• RELEVANCY SCORE 3.49

    DB:3.49:Paktahn Wont Build 1k





    Good evening there.

    I am having an issue building paktahn (AUR package) from tarball; a debugger appears showing:
    ; compiling file /home/kakb/src/clbuild.paktahn/source/cl-store/sbcl/custom.lisp (written 12 AUG 2009 03:38:32 AM):
    ; compiling (IN-PACKAGE :CL-STORE)
    ; compiling (DEFUN CREATE-FLOAT-VALUES ...)
    ; compiling (DEFSTORE-CL-STORE (OBJ STRUCTURE-OBJECT ...) ...)
    ; compiling (DEFRESTORE-CL-STORE (STRUCTURE-OBJECT STREAM) ...)
    ; compiling (DEFUN GET-LAYOUT ...)
    ; compiling (DEFUN GET-INFO ...)
    ; compiling (DEFUN DD-NAME ...)
    ; compiling (DEFVAR *SBCL-STRUCT-INHERITS* ...)
    ; compiling (DEFSTRUCT (STRUCT-DEF #) ...)
    ; compiling (DEFUN INFO-OR-DIE ...)
    ; compiling (DEFUN SAVE-ABLE-SUPERS ...)
    ; compiling (DEFUN GET-SUPERS ...)
    ; compiling (DEFSTORE-CL-STORE (OBJ STRUCTURE-CLASS ...) ...)
    ; compiling (DEFSTORE-CL-STORE (OBJ STRUCT-DEF ...) ...);
    ; caught ERROR:
    ; READ error during COMPILE-FILE:
    ;
    ; Lock on package SB-KERNEL violated when interning CLASS-METHOD-DEFINITIONS
    ; while in package CL-STORE.
    ; See also:
    ; The SBCL Manual, Node Package Locks
    ;
    ; (in form starting at line: 76, column: 41, file-position: 2419)

    ; compilation aborted after 0:00:00.044

    debugger invoked on a UIOP/LISP-BUILD:COMPILE-FILE-ERROR in thread
    #THREAD main thread RUNNING {1003016D83}:
    COMPILE-FILE-ERROR while compiling #NON-REQUIRED-FILE cl-store custom

    Type HELP for debugger help, or (SB-EXT:EXIT) to exit from SBCL.

    restarts (invokable by number or by possibly-abbreviated name):
    0: [RETRY ] Retry
    compiling #NON-REQUIRED-FILE cl-store custom.
    1: [ACCEPT ] Continue, treating
    compiling #NON-REQUIRED-FILE cl-store custom
    as having been successful.
    2: Retry ASDF operation.
    3: [CLEAR-CONFIGURATION-AND-RETRY] Retry ASDF operation after resetting the
    configuration.
    4: [CONTINUE ] Ignore runtime option --eval (asdf:oos asdf:load-op paktahn).
    5: [ABORT ] Skip rest of --eval and --load options.
    6: Skip to toplevel READ/EVAL/PRINT loop.
    7: [EXIT ] Exit SBCL (calling #EXIT, killing the process).

    (UIOP/LISP-BUILD:CHECK-LISP-COMPILE-RESULTS NIL T T ~/asdf-action::format-action/ ((#ASDF/LISP-ACTION:COMPILE-OP . #CL-STORE.SYSTEM:NON-REQUIRED-FILE cl-store custom)))
    0]

  • RELEVANCY SCORE 3.27

    DB:3.27:[Solved] Fatal Error: Config.H: No Such File Or Directory In Builds m1





    Hello everyone!I enjoy archlinux a lot since a few years. However, I found a problem I cannot solve although I searched forums, web and wiki.

    Since a few months packages / programs do not longer build correctly for me. The errors always relate to a missing config.h. The following example is from gcc. Language errors result from setting the LANG variable for the build to get English error messages. It does not work if not setting LANG either. The log is from extracted from a paktahn build.
    # end of configure

    configure: creating ./config.status
    config.status: creating Makefile
    config.status: creating testsuite/Makefile
    config.status: creating config.h
    config.status: config.h is unchanged
    config.status: executing default commands
    /bin/sh: warning: setlocale: LC_ALL: cannot change locale (EN)
    /bin/sh: warning: setlocale: LC_ALL: cannot change locale (EN)
    /bin/sh: warning: setlocale: LC_ALL: cannot change locale (EN)

    #make starts here

    make[3]: Entering directory `/home/caspar/.paktahn/aur/gcc-gcj/src/gcc-4.8.1/build/libiberty
    if [ x-fpic != x ]; then \
    gcc -c -DHAVE_CONFIG_H -g -I. -I../../libiberty/../include -W -Wall -Wwrite-strings -Wc++-compat -Wstrict-prototypes -pedantic -fpic ../../libiberty/regex.c -o pic/regex.o; \
    else true; fi
    /bin/sh: warning: setlocale: LC_ALL: cannot change locale (EN)
    ../../libiberty/regex.c:39:22: fatal error: config.h: No such file or directory
    # include config.h
    ^
    compilation terminated.
    make[3]: *** [regex.o] Error 1
    make[3]: Leaving directory `/home/caspar/.paktahn/aur/gcc-gcj/src/gcc-4.8.1/build/libiberty
    make[2]: *** [all-stage1-libiberty] Error 2
    make[2]: Leaving directory `/home/caspar/.paktahn/aur/gcc-gcj/src/gcc-4.8.1/build
    make[1]: *** [stage1-bubble] Error 2
    make[1]: Leaving directory `/home/caspar/.paktahn/aur/gcc-gcj/src/gcc-4.8.1/build
    make: *** [all] Error 2

    DB:3.27:[Solved] Fatal Error: Config.H: No Such File Or Directory In Builds m1


    I finally found a solution. However, I do not know which problem it has been exactly ;-). It seems that I messed up my build environment somehow.Simply do the following to fix the error:

    Identify files not owned by any package and afterwards identify and delete library files you find in there and which you do not need. Look here on how to do this https://wiki.archlinux.org/index.php/Pa … ny_package

    Delete /var/cache/ldconfig/aux-cache and rerun ldconfig like described here https://bbs.archlinux.org/viewtopic.php?id=83944

    Run paktahn from aur paktahn -Su --aur and remove all packages which are not longer available

    Reinstall all packages and force overwriting of existing files like so pacman -Qenq | pacman -S --force - . Be sure that forced overwrite does not destroy something for you.

    Reboot

    After that the error of a missing config.h file was resolved for me in all builds. Thank you all for your hints! This really is a relief as I had this problem for months.

    Last edited by phillme (2013-09-17 11:59:18)

  • RELEVANCY SCORE 3.15

    DB:3.15:Buield Infotype 1k





    hallow experts,

    i wont info of how to build infotype from the begining

    i learn h.r.

    regards

    DB:3.15:Buield Infotype 1k


    hi

    Prerequisites

    So that you can create infotype records for objects, the object, that is the existence infotype 1000 (Object), must already have been created. You can create this in Simple Maintenance or by maintaining infotypes for objects.

    Note that all the object types and infotypes that have been flagged as not maintainable in customizing in Customizing, can not be maintained in the standard infotype maintenance screen. See General Maintenance

    bProcedure/bYou create infotype records if you want to create the object itself (infotype 1000 Object) or if you want to create additional characteristics for an object. The procedure for creating additional infotype records varies for each infotype. For example, the final steps involved in creating the Description infotype (1002) are different to those followed to create the Work Schedule infotype (1011) record.On the Organizational Management screen, choose Expert mode
    . The Maintain
    screen appears. In the Plan version and
    fields, enter data as required. In the Infotypes field, select the infotype you want to create. It could be that not all the infotypes that are available can be displayed on one screen. By using Page up and Page down ,you can display all infotypes.Using the tab pages, select the status the new infotype record. Choose Edit Create infotype. The infotype screen you selected appears.Enter data in the appropriate fields as required. Save your entries.The Maintain

    screen appears.

    regards

    navjot

    reward if helpfull

  • RELEVANCY SCORE 3.05

    DB:3.05:What Virutalization Software Can I Install And Use Under 64bit 8m



    Virutalbox wont build for me, and cant get vmware going either.

    DB:3.05:What Virutalization Software Can I Install And Use Under 64bit 8m


    I installed VirtualBox using the installer for all distributions from VirtualBox homepage. Works absolutely flawless!

  • RELEVANCY SCORE 2.37

    DB:2.37:Workflows Wont Run After Upgrade From 2010sp1 To 2012.3 f8


    Hi
    We just upgraded our TFS 2010 to 2012.3.
    The buildcontrollers(2010SP1) are not upgraded, just re-added to the Collection. The testcontroller is upgraded to 2012
    normal builds Work fine, but when I try to build and deployI get an error:

    The build is queued on the following build controller, but that build controller is not configured for workflow: Build01. Queue the build on the following build controller instead: .

    How doI configure the buildcontroller to run workflows? Is it possible at all when we still need the 2010 build servers? They will be migrated later.

    DB:2.37:Workflows Wont Run After Upgrade From 2010sp1 To 2012.3 f8

    Hi Kim,

    Thanks for your reply.

    It seems that we need to use the TFS 2012 Build Service if we want to build and deploy in TFS 2012 lab environment.We are trying to better understand customer views on social support experience, so your participation in this interview project would be greatly appreciated if you have time. Thanks for helping make community forums a great place.

    Click
    HERE to participate the survey.

  • RELEVANCY SCORE 2.37

    DB:2.37:Media Center Wont Open In Build 5728 9j


     
    There are now two entries in Start for Media Center, neither which will open. I upgraded from build 5600. Any help is appreciated. Thanks.

    DB:2.37:Media Center Wont Open In Build 5728 9j

    MCE is working also for me now. I don't know yet if it's because my laptop is no more connected to the docking station or if it's due to the fact that i'm not using a proxy at home...

  • RELEVANCY SCORE 2.36

    DB:2.36:Vmware 6: Fedora 6 No Longer Works After Update. Fc7 Wont Install Either. 7f



    I am running WS build 39849. I updated Fedora core 6 (which included a kernel), and it no longer finds to root fs. The old kernel still works. FC7T2 wont install, as it cant find a drive to install to.

    XP64 host. Opteron 170, 4 gigs ram.

    DB:2.36:Vmware 6: Fedora 6 No Longer Works After Update. Fc7 Wont Install Either. 7f


    If you are running the Workstation 6 beta, you'll get better responses posting in that forum. http://www.vmware.com/community/forum.jspa?forumID=372

  • RELEVANCY SCORE 2.36

    DB:2.36:Build Aplication kp


    I wont to build Aplication.I tryed to do this, and it's work, but after I done this, I have seen:Build finished!Remember that the LABVIEW Run-Time Engine version 6.1 must be installed onany machine that is going to run this application.And that is not this what I expected.Is that pasible to build "independent" application?thanks Duzy

    DB:2.36:Build Aplication kp

    Hi Piotr,You Can't build an "independent application". You must to install the Run-time engine at any computer that you want your EXE to run.Like Visual Basic or VB .Net, that you must to install the VBRUn, before exeude.Hope it Helps...

  • RELEVANCY SCORE 2.35

    DB:2.35:Security Update Kb2419632 Wont Install On Windows Xp Media Center Edition Build 5.1 m9


    I've tried several suggestions found on site but nothing works.

    DB:2.35:Security Update Kb2419632 Wont Install On Windows Xp Media Center Edition Build 5.1 m9

    Hi,
    ·What are the suggestions that you have tried to resolve your issue?
    ·What happens when you try to install the update on the system?

    The update that you are trying to install is as follows.
    MS11-002: Description of the security update for Microsoft Data Access Components 2.8 Service Pack 1: January 11, 2011
    http://support.microsoft.com/kb/2419632

    I would suggest you to follow the steps mentioned below.

    Method 1:
    Download the update from the Microsoft website and then perform a clean boot and then try to install the update on the system, and check whether the issue persists.
    Step 1:
    Perform a clean boot on the system. Follow the steps mentioned below.
    How to configure Windows XP to start in a "clean boot" state
    http://support.microsoft.com/kb/310353
    Step 2:
    Download the update from the link mentioned below.
    Security Update for Windows XP (KB2419632)
    http://www.microsoft.com/downloads/en/details.aspx?familyid=7951FD7B-6B0A-4168-8519-312A62FF3289displaylang=en

    I would suggest you to follow the steps mentioned in the article given below.
    You cannot install some updates or programs
    http://support.microsoft.com/kb/822798

    Thank you and Regards.
    Thahaseena M
    Microsoft Answers Support Engineer.
    Visit ourMicrosoft Answers Feedback Forum and let us know what you think.

  • RELEVANCY SCORE 2.31

    DB:2.31:Ooo-Build dz



    Hello,

    I want to build ooo-build (www.go-oo.org) because of its advanced media support (uses gstreamer).

    But it wont even start compiling, due to rpm not being installed.

    Any hints how to ship around this?
    pkgname=ooo-build
    pkgver=2.1.4.9
    pkgrel=1
    pkgdesc=
    arch=(i686 x86_64)
    url=http://go-oo.org
    license=(GPL)
    depends=()
    makedepends=()
    source=(http://download.go-oo.org/OOH680/ooo-build-2.4.1.9.tar.gz)
    md5sums=(8a1b1483371c35092a2b2fd431b742b5)

    build() {
    # http://download.go-oo.org/OOH680/ooh680-m17-system.tar.bz2 // core, lang
    cd $startdir/src/ooo-build-2.4.1.9
    ./configure --with-distro=CommonLinux --disable-kde
    ./download
    make || return 1
    make DESTDIR=$startdir/pkg install || return 1
    }

    DB:2.31:Ooo-Build dz


    Any progress on this? When I execute makepkg (OOO is installed), it aborts showing
    checking whether to add custom build version... yes, Build 2.4.1.9
    checking whether to build with Java support... yes
    configure: error: /usr//bin/java not found set with_jdk_home
    make: *** [stamp/build] Error 1

  • RELEVANCY SCORE 2.30

    DB:2.30:520 Wont Load The New Build 12400 8d


    Does anyone having problem with the new build that was release yesterday at 1pm eastern time?

    well I have a nokia 520 on the preview for developers apparently I missed out on the new build some how build #12400
    I check the update my phone and doesn't have it and I turn off the preview for developers and turn it back on still nothing
    what gives? Kinda feel some type of way here lol

    DB:2.30:520 Wont Load The New Build 12400 8d

    Hop on back to the Dp then. And Look in Storage sense of your Phone memory is displaying normal. If you use bitlocker you see XX-XX

  • RELEVANCY SCORE 2.30

    DB:2.30:Wont&Nbsp; Re Build Data&Nbsp; Base/Entourage 3f


    Hi, any ideas?
    10.5.2. wont rebuild data base on Entourage form M. Office for Mac.
    I have always been able to do this on all other versions. Here we go again ! more RD in the field

    Thanks
    David

    DB:2.30:Wont&Nbsp; Re Build Data&Nbsp; Base/Entourage 3f

    Agreed. Since Entourage is not an Apple product, you should post your question in Microsoft's own forums for their Office:Mac products:

    http://www.officeformac.com/productforums

  • RELEVANCY SCORE 2.30

    DB:2.30:Simply Wont Work. 8s



    I managed to get it to build a dll a cuple of times but now it just wont work and theres no errors or warnings iv reinstalled everything and googled the hell out of it but it simply wont give me my dll!

    Solved, the guided auto parallelism analysis option was the problem.

    DB:2.30:Simply Wont Work. 8s


    I managed to get it to build a dll a cuple of times but now it just wont work and theres no errors or warnings iv reinstalled everything and googled the hell out of it but it simply wont give me my dll!

    Solved, the guided auto parallelism analysis option was the problem.

  • RELEVANCY SCORE 2.30

    DB:2.30:Nxt Stonehenge Color Sorter Wont Work Need Help jp


    i just got the nxt 2.0 kit and i build the stonehenge ball sorter but it wont workit just goes in the air and then it starts grabbing al of the time could someone help me ??

  • RELEVANCY SCORE 2.30

    DB:2.30:[Solved]Why Wont Mate-Power-Manager Build? ax



    Hello.I have this problem and I dont know where to look. I installed mate-common. And mate power manager wont build.
    Cloning into mate-power-manager...
    remote: Counting objects: 945, done.
    remote: Compressing objects: 100% (670/670), done.
    remote: Total 945 (delta 309), reused 897 (delta 261)
    Receiving objects: 100% (945/945), 4.02 MiB | 907 KiB/s, done.
    Resolving deltas: 100% (309/309), done.
    == GIT checkout done or server timeout
    == Starting build...
    Cloning into /tmp/yaourt-tmp-root/aur-mate-power-manager/src/mate-power-manager-build...
    done.
    which: no mate-autogen in (/usr/local/bin:/usr/bin:/bin:/usr/local/sbin:/usr/sbin:/sbin:/opt/java/jre/bin:/usr/bin/core_perl)
    You need to install mate-common from the MATE Git
    == ERROR: Makepkg was unable to build mate-power-manager.

    DB:2.30:[Solved]Why Wont Mate-Power-Manager Build? ax

    ConnorBehan wrote:
    So is this issue solved then?

    There are two types of messages that a C compiler prints out: warnings and errors. An error means there is a major problem with the C file and it cannot be compiled. A warning is just a suggestion that you might want a piece of code to be written better. There are various -W flags that can be passed to gcc. The more -W flags you pass, the more warnings you will see. Some of them have intuitive names like -Warray-bounds, -Wmissing-braces, -Wunused-variable. However, there are some -W flags that are special. -Werror means that every time a warning is encountered, gcc should fail just like it would fail if it had encountered an error. -Wno-error counteracts this. If you run gcc with the -Werror flag and the -Wno-error flag, warnings will once again be non-fatal as long as the -Wno-error flag goes after the -Werror flag.

    A program written in C like mate-power-manager will typically have one or more files called Makefile.am in the source directory. The command automake generates Makefile.in from Makefile.am. The command ./configure generates Makefile from Makefile.in. The command make will read the Makefile and call all the programs that the Makefile says to call (such as gcc with various warning flags). If some of these warning flags are flags that you dont want, there are two ways to change them. One is to change them in Makefile.am before any of its descendants are generated. The other is to specify flags that undo them in the CFLAGS environment variable (which can be set in a few different ways, one of which is in makepkg.conf). The second way only works if the scripts in mate-power-manager are written to respect the value of CFLAGS.

  • RELEVANCY SCORE 2.30

    DB:2.30:Cannot Restore cx


    My iphone wont turn on so i reset it and it says the iphone is not eligible for the request build
    what to do next?

    DB:2.30:Cannot Restore cx

    BEFORE you try Dhryston's 'solution', which will wipe your phone of all it's data, read this article:http://support.apple.com/kb/ts4451

  • RELEVANCY SCORE 2.30

    DB:2.30:My Iphone 3gs Wont Start cc


    hi, my iphone wont start. i've tried to restore it but itunes keeps saying ''could not restore the device *iphone* because it is not eligable for the requested build.''anyone who knows how to fix it? btw im stuck on ios 5 beta 7, wont upgrade....

    DB:2.30:My Iphone 3gs Wont Start cc

    hi, my iphone wont start. i've tried to restore it but itunes keeps saying ''could not restore the device *iphone* because it is not eligable for the requested build.''anyone who knows how to fix it? btw im stuck on ios 5 beta 7, wont upgrade....

  • RELEVANCY SCORE 2.30

    DB:2.30:Re: Vista Wont Validate 7c


    Vista will not validate build 6000 says it is not genuine copy i bought this copy at Best Buy new..... help

    DB:2.30:Re: Vista Wont Validate 7c

     
    Please post the results of the WGA diagnostics tool (http://go.microsoft.com/fwlink/?linkid=52012) with any new question. 
     
    Please also post the error code you get (if any) when you validate by clicking Validate Windows here: www.microsoft.com/genuineThe error code will be gray and in brackets at the end of the message on the page that says validation failed.  (It'll look something like this:  [0xC004C000]).
     
    Thank you!

  • RELEVANCY SCORE 2.30

    DB:2.30:Eclipse Wont Build ca



    seems like i reached a point in my code where if i add more classes or files to my project, it wont build anymore. Which means any new changes just wont compile and copy over to the simulator. There are no errors in my project, but i think Eclipse just wont show them. I'm not sure what to do, i have redone the proejct 4 or 5 times and added all the files back to new empy projects, same issue. It simply gets to the point where if i add an emply class with any name, it just stops building from that point forward. Has anyone expierence this and could lend some tips to discover the problem?

    DB:2.30:Eclipse Wont Build ca

    I also experienced similar build problem ... I added PATH variable in environment variables of Right click on MyComputerPropertiesAdvancedEnvironment Variables Hope this will help you..

  • RELEVANCY SCORE 2.29

    DB:2.29:Need To Build The Report On Campagins And Custom Object 01 k1


    Hi All,

    I am building the report on campaigns and customobject 01 ,But wen i build the report i was not able to get all the project ID that are associated to the campaigns.

    The issue is when i pull the campaign id it wont fetches all the ID for customobject01 (becoz the relation is M:M)
    Can u please guide how to build the report.

    Regards
    Anu

    DB:2.29:Need To Build The Report On Campagins And Custom Object 01 k1

    Hi,
    you can try to add the metric fields to your report for all involved objects, like # of Campaigns, # of Projects and # of Custom Object 1. Afterwards you can hide these fields from layout. For me this has always helped.
    Regards

  • RELEVANCY SCORE 2.29

    DB:2.29:Field Catalog In Alv fp



    i have a basic alv and i wont build a field catalog .i take my alv from se83 basic alv grid. i have to do a new data (delete my definition that work) or to build antor data ? .

    DB:2.29:Field Catalog In Alv fp


    Building field catalog is nothing but framing ur output.So depending on ur requirement u have to build ur fieldcatalog.Suppose u want 10 fields as ur output then build field catalog for 10 fields.

    Regarding data u have to populate into final internal table use it in the function module.

    Let me know if I have misunderstood ur problem.

    Regards

  • RELEVANCY SCORE 2.27

    DB:2.27:Corrupt Kb253411 Update z1


    fresh build win7 home premium first update corrupt and won't uninstall Plusother 65 updates fail to install. wont install

    DB:2.27:Corrupt Kb253411 Update z1

    Hi,
    Good to know that the issue has been resolved. Let us know if you face any issues with Windows in future.

  • RELEVANCY SCORE 2.27

    DB:2.27:Build Vm Guest From Iso m1


    Hi All,

    Can anyone advise possible reasons for why I cannot seem to build vm guests from iso? I'm trying to build a w2k8 32 and 64bit server via vmguest console and wont build from iso, only from host cdrom.

    Any suggestions?

    I am using Vsphere 4

    Thanks in advance.

    Fred

    DB:2.27:Build Vm Guest From Iso m1


    Hi Datto,

    Thanks for your advice. Option 3 sorted out my issues. Much appreciated again.

    Cheers,

    Fred

  • RELEVANCY SCORE 2.27

    DB:2.27:Reversing The Order Of Build On A Chart fs


    Ive been trying to just reverse the order on a bar chart. Seems simple. Its an horizontal bar chart, each bar with two colours on (say 80% and 20%) and I want it to build from the bottom of the page not the top. I have used the 'set timing and order for each build tick box' and still they wont move in the build order in the inspector. They will move down the build order listing, but not up. Its as if the whole thing is a group and wont reorder (they arent grouped). Usually keynote is really simple to use which makes me think it might be a bug ... of am I over looking something simple. (BTW even using any of the order number drop downs on the inspector it doesn't help. Hope I am make this clear! Any help?

    DB:2.27:Reversing The Order Of Build On A Chart fs

    Ive been trying to just reverse the order on a bar chart. Seems simple. Its an horizontal bar chart, each bar with two colours on (say 80% and 20%) and I want it to build from the bottom of the page not the top. I have used the 'set timing and order for each build tick box' and still they wont move in the build order in the inspector. They will move down the build order listing, but not up. Its as if the whole thing is a group and wont reorder (they arent grouped). Usually keynote is really simple to use which makes me think it might be a bug ... of am I over looking something simple. (BTW even using any of the order number drop downs on the inspector it doesn't help. Hope I am make this clear! Any help?

  • RELEVANCY SCORE 2.27

    DB:2.27:Windows 8 Build 8400 Wont Wake Fully From Sleep 7k


    Hi there,

    DB:2.27:Windows 8 Build 8400 Wont Wake Fully From Sleep 7k

    This is a real pain. It seems to be awake but the monitors just don't come on, I stumbled across a workaround unplug the monitor cable(s) and it comes back on. I hope this helps someone.

  • RELEVANCY SCORE 2.27

    DB:2.27:Brand New Build - Wont Post At All - Hx850i Dead? :( Youtube Link Insidei xa


    So

  • RELEVANCY SCORE 2.27

    DB:2.27:Zune Wont Update Hd7 From Build 7008 To Build 7392. x7


    I have an HD7(original with 7008 build),I updated it to NoDo 7392 used it for a month,due to some reasons I had to downgrade back to 7008,but then when I try to update it back to 7392,Zune says Your phone is up to date.Current phone version:7.0(7008).Can
    someone tell me why is this happening?

  • RELEVANCY SCORE 2.26

    DB:2.26:Pet Mudule Clicks pj


    Can somebody click my pet rabbit module please When I get the Blue print build the blueprint, Then build the master piece blue printPlease help Me!



    Razzled Pickled Cowboy- lvl 20 in LMOThe Justest Tiger AliveI wont be on the MBS for awhile

    DB:2.26:Pet Mudule Clicks pj

    JustTiger wrote:Can somebody click my pet rabbit module please When I get the Blue print build the blueprint, Then build the master piece blue printPlease help Me! br/how abou tyou click my rabbit moulde and i clicked yoursp.s so sorry if i made you lower in top ten of rank 7 I click your rabbit 4 timesP.S.It's fine if I lower even more In Top Ten in your RankI'm just glad That your Top 1 In your Rank



    Razzled Pickled Cowboy- lvl 20 in LMOThe Justest Tiger AliveI wont be on the MBS for awhile

  • RELEVANCY SCORE 2.26

    DB:2.26:Ms C++ Needed? zd



    I had multiple entries of this redistribute, some of the same build, so I uninstalled.Bdagent will not load. Is it needed?Windows update installed one but bdagent still wont load.



    DB:2.26:Ms C++ Needed? zd


    I had multiple entries of this redistribute, some of the same build, so I uninstalled.Bdagent will not load. Is it needed?Windows update installed one but bdagent still wont load.



  • RELEVANCY SCORE 2.26

    DB:2.26:Vs13 App Wont Build - No Error Reported 18


    I just installed VS 13 - I can't get either a console or WPF app to build. When I try building, the output window shows the build failed, but there are no messages anywhere. The programs I have tried are simple sample applications similar to
    Hello World

    DB:2.26:Vs13 App Wont Build - No Error Reported 18

    Hi,
    Please try to repair the compiler.
    How to: Repair Visual Studio
    http://msdn.microsoft.com/en-us/library/aa983433(v=vs.90).aspx
    Best regards,We are trying to better understand customer views on social support experience, so your participation in this interview project would be greatly appreciated if you have time. Thanks for helping make community forums a great place.

    Click
    HERE to participate the survey.

  • RELEVANCY SCORE 2.26

    DB:2.26:Thread: Outlook 2013 Wont Connect a1


    I am trying to connect a Windows tablet with Outlook 2013 to our GMS 2.0.1 Build 53 server but it fails to connect. Is Outlook 2013 Supported yet?

    Just wondering,

    Ken

    DB:2.26:Thread: Outlook 2013 Wont Connect a1

    kheinz wrote:

    Thanks for the information. I used the mail app on the Windows

    Surface to connect. Still no time line as to when 2.1 will make its

    debut?

    It should be right around the corner.

    -' + '-

    Your world is on the move. http://www.novell.com/mobility/

    Supercharge your IT knowledge. http://www.novell.com/techtalks/

  • RELEVANCY SCORE 2.26

    DB:2.26:Pc Wont Boot, Whats Wrong!?!? 3s


    i JUST finished my latest build.

  • RELEVANCY SCORE 2.26

    DB:2.26:Cdparanoia Wont Build kj



    cdparanoia was updated recently with a gcc34.patch file but is not included in the cvs.

    tried bug tracker but it wont let me sign in so i guess i will be doin the complainin here.

    slyski

    DB:2.26:Cdparanoia Wont Build kj


    the base should always build via makeworld/srcpac and maybe some other key (read large) packages.

  • RELEVANCY SCORE 2.26

    DB:2.26:My Build In Hp Mic Wont Work 81



    when im on skype the other person cant hear me and when doing online karaoke the mic wont work. i click the speaker at the bottom and everything seems to be okay what do i do? i have a hp pavilion g7 with windows 7

    DB:2.26:My Build In Hp Mic Wont Work 81


    Hi nayaa,

    Welcome to the HPCommunity, I hope you enjoy your experience! To help you get the most out of the HP Forums I would like to direct your attention to the HP Forums Guide First Time Here? Learn How to Post and More.

    I understand that you are having a problem with built in mic on your Pavilion. Here is a link on setting default audio and recording device. The first part of the link is for setting default audio device but if you scroll down it will show you how to set the default recording device. If that doesn't work then reply back with your product number and we will look at installing a driver.

    Thank you,

  • RELEVANCY SCORE 2.25

    DB:2.25:Wont Debug Or Build Projects fp


    Have just downloaded vs 2012 ultimate and when I go to build c programs it gives me this error
    1C:\Program Files (x86)\MSBuild\Microsoft.Cpp\v4.0\V110\Microsoft.CppCommon.targets(347,5): error : Required file tracker.exe is missing.
    Any suggestions I'm running on windows 7 64 bit laptop

    DB:2.25:Wont Debug Or Build Projects fp

    Hello,
    Have you checked the link davlind provided above?
    There are severalworkarounds in that link for this issue.
    In my opinion, this problem is possibly caused by the version of Windows SDK ,please try to install the the latest SDK (Microsoft
    Windows SDK for Windows 7 and .NET Framework 4).
    You could also refer to the similar question MSBuild on TeamCity Server can't find AL.exe
    .
    Best Regards,
    Jane.We are trying to better understand customer views on social support experience, so your participation in this interview project would be greatly appreciated if you have time. Thanks for helping make community forums a great place.

    Click
    HERE to participate the survey.

  • RELEVANCY SCORE 2.24

    DB:2.24:Beta Build Wont Upgrade To Released Build 8k


    What the snot I hit the check for Upgrade and nothing Happens I'm still using 1.1500 beta it's not upgrading

    Posted By Mikro

    DB:2.24:Beta Build Wont Upgrade To Released Build 8k

    I'll wait and see what happens... there's no rush.
    Can't help but feel it's better to let it updateas intended rather than force an over the top install of new version... assuming it does update via WU of course.

  • RELEVANCY SCORE 2.24

    DB:2.24:New Pc Build, Wont Recognize Brand New Win 7 Pro 64 Disc Help Please! sp


    Hey there,

    DB:2.24:New Pc Build, Wont Recognize Brand New Win 7 Pro 64 Disc Help Please! sp

    Hello,You can download Windows 7 Enterprise 90-day Trial and burn it to a DVD. Then boot the computer from this DVD. http://technet.microsoft.com/en-us/evalcenter/cc442495.aspxIf the problem still happens, the problem should be caused by your DVD device.If you have 64-bit version of windows XP disc, you can first install itin the PC and then perform a flat installtion of windows 7. A flat installation avoids problems that are related to the CD drive or to the DVD drive. How to perform a flat installation of Windows Vistahttp://support.microsoft.com/default.aspx/kb/928902

    Thomas77

  • RELEVANCY SCORE 2.24

    DB:2.24:New Computer 87



    i wont to build a new computer with cs5 , this to stitch 30 off 40mb files . i wont to use i7 pro with 16mb ram exspandable to 32mb later, there will be a 500mb hd and a 250mb ssd for a scratch drive .i would like help on the other components ??mother board, vidio card power supply ect ect . i wont allso to be able to have 2 off screens many thanks

    DB:2.24:New Computer 87


    thanks chaps i got that wrong please read 500mb = 500gb .250mb =250gb .the ram should be 16gb exspandable to 32.gb. the buget is $2000 = 1200 . the op system is windows 7 pro .64 . i would like a multi card reader b/w dvd and as many usbs as possible.some of my panos if i dont flatten them can be quite large and take 30min/50min .the present machine is 2core with 8gig ram ,500gb hd with500gb scratch disk on windos 7 64 home

  • RELEVANCY SCORE 2.24

    DB:2.24:Blackberry Unity Game Not Loading Up 7k



    Blackberry bar files generated in unity sometines wont work on specific blackberry OS versions. Maybe try to build the file with previous version of unity?

    DB:2.24:Blackberry Unity Game Not Loading Up 7k


    Blackberry bar files generated in unity sometines wont work on specific blackberry OS versions. Maybe try to build the file with previous version of unity?

  • RELEVANCY SCORE 2.23

    DB:2.23:Firefox 3 Wont Start. [Solved] f1



    Both the nightly build and beta 2 wont run.
    ./firefox-bin
    ./firefox-bin: error while loading shared libraries: libxul.so: cannot open shared object file: No such file or directory

    DB:2.23:Firefox 3 Wont Start. [Solved] f1

    vogets wrote:
    Firefox comes usually with a loader shellscript called firefox - you should launch this one instead of the firefox-bin directly.

  • RELEVANCY SCORE 2.23

    DB:2.23:Help! Debug Wont Work! 7j


    I dont know what i did but debug wont work. It just loads the same thing over and over. Even if i put errors int he code it doesn't catch them it just starts some older version of it?Like i can add a control to a form and it wont show in the debug but in the build it does?

    DB:2.23:Help! Debug Wont Work! 7j

     
    In the build Menu check the configuration manager to make sure your project is in running in debug mode.

  • RELEVANCY SCORE 2.23

    DB:2.23:Ssis Wont Generate Deployment Files 3f


    I enabled building of deployment by - MySolution right click properties CreateDeploymentUtility = True, DeploymentOutputPath = bin\Deployment Apply OK.
    Then, SSIS Build Build MySolution.
    I went to the above folder (under visual studio 2008 projects) and saw nothing there. why is this happening and how do I fix it ?

    DB:2.23:Ssis Wont Generate Deployment Files 3f

    Hi blastoSO,
    It is odd that the deployment folder was not generated after your correct operations. In case the BIDS is corrupted, I suggest that you reinstall the BIDS from SQL Server 2008 installation media if possible.

    Besides, I would like to explain that the Package Installation Wizard tool launched by the deployment manifest file not only copies the package .dtsx file and the package configurations .dtsConfig file to the install folder, but also changes the DTS:Configurations
    element of the package XML code to change the path of the default package configurations. So, if we just copy the package and the package configurations file to the install folder, the default path of the package configurations is not changed. To change the
    package configurations file path, we can just modify the ConfigurationString property of the .dtsx file.
    DTS:Configurations
    DTS:Configuration
    DTS:ConfigurationString=C:\Program Files\Microsoft SQL Server\110\DTS\Packages\Package.dtsConfig
    DTS:ConfigurationType=1
    DTS:CreationName=
    DTS:DTSID={5C1CD68C-8F04-475C-ACB6-E1DDDAFA50CF}
    DTS:ObjectName=Configuration 1 /
    /DTS:Configurations

    Regards,

    Mike Yin
    TechNet Community Support

  • RELEVANCY SCORE 2.23

    DB:2.23:Nvidia-Beta Wont Build Against Kernel 2.6.28 k3



    Hello

    I cant build nvidia-beta against kernel 2.6.28, any tips of things I might need to do?

  • RELEVANCY SCORE 2.23

    DB:2.23:Webcam Help Computer Wont Recognize Build In Webcam pp


    My computer won't detect my webcam..but my webcam is build into the computer. help me?

    DB:2.23:Webcam Help Computer Wont Recognize Build In Webcam pp

    Hiwaynelove2,

    1)Was it working fine before?
    2)Do you recall making any changes to the computer prior to this issue?
    3)Do you get any error message?
    4)What is the make and model number of your computer?

    Method 1: Run the fixit available in the link below and check if that makes any difference
    Hardware devices are not working or are not detected in Windows

    Method 2:Download and install the latest webcam drivers from the computer manufacturer’s website.

    Thanks and Regards
    Ajay K
    Microsoft Answers Support Engineer
    Visit our Microsoft Answers Feedback Forum and let us know what you think.

  • RELEVANCY SCORE 2.23

    DB:2.23:Cant Open Or Send Email And Windows Live Mail Wont Sign In Automatically Or Manually. 83


    I can sign in using the Sign in button but nothing happens. Window7 home premium. Windows Live Mail Version 2011 (Build 15.4.3555.0308)

    DB:2.23:Cant Open Or Send Email And Windows Live Mail Wont Sign In Automatically Or Manually. 83

    Hello Will,

    Thank you for posting your concern on Microsoft Community Forum. I will be assisting you on your inquiry about unable to sign into your Windows Live Mail.

    First, we would like to verify if you can successfully log-in to your account when you visit
    Hotmail/Outlook website. If you're having issues on signing in within the web, please create a separatethread within the link
    below for further assistance on your inquiry.

    Microsoft Account thread

    In case you can log-in successfully, it is possible that the issue is caused by a corrupted data within your Windows Live Mail. For this issue, please try to repair your Live Mail by following the steps below:

    For Windows Vista/7:
    1. Click the Start menu.
    2. Click Control Panel.
    3. Click Programs.
    4. Click Programs and Features.
    5. Search for Windows Essentials 2012 on the list and then select it.
    6. Click Uninstall/Change.
    7. Click Repair all Windows Essentials programs.

    In addition, please try to reconfigure your account. This will refresh Windows Live Mail and might also fix the issue. To do this, kindly follow the steps within this
    link.

    We're looking forward to your response.

    Thank you.

  • RELEVANCY SCORE 2.23

    DB:2.23:Function Group 87


    Hi,i wont to build a function group and store their all fm that for e.g.. to h.r but if i do the first fm and i move it from Dev to Qa and i and i build another fm and under the the same function group i D'ont have erorr ?Regards

    DB:2.23:Function Group 87

    A function group is used to group a set of function modules together. You can use same function group to create multiple Function Modules.There will be no error if you want to create a new function module in the same function group.Regards,Abhishek Jolly

  • RELEVANCY SCORE 2.23

    DB:2.23:M57e Wont Bootup For Ghost fz


    Hi Guys, I received 20 new M57e and build one from scratch. I'm trying to make an image with that build box. For some reason my boot flash usb wont work. I dl the NSDI2 driver from Marvell and I booted another pc and it was able to boot to the PCDos Ghost interface so that tells it works. But for the m75e it just gets stuck at "Starting to boot...." Do any of you guys experience this? My Ghost version is 8.3.THanks,

    DB:2.23:M57e Wont Bootup For Ghost fz

    Hi Guys, I received 20 new M57e and build one from scratch. I'm trying to make an image with that build box. For some reason my boot flash usb wont work. I dl the NSDI2 driver from Marvell and I booted another pc and it was able to boot to the PCDos Ghost interface so that tells it works. But for the m75e it just gets stuck at "Starting to boot...." Do any of you guys experience this? My Ghost version is 8.3.THanks,

  • RELEVANCY SCORE 2.23

    DB:2.23:Paktahn: Yaourt-Style Aur/Pacman Search And Install f8



    Hello everyone,

    for those who dont know me: Im a former TU and long time yaourt user.

    Unfortunately yaourt doesnt seem to be maintained anymore and has quite some problems (e.g. UI nits, security issues, huge shell codebase).

    But since yaourts interface is so great I have decided to code up an alternative called Paktahn (after a ship type from Wing Commander).

    For now its just a development preview for interested people. It might toast your cat, although its not designed to do that.Right now it also offers just the most convenient (for me) two features of yaourt: the -S mode where you can install a package from repos or AUR and the mode with just a plain argument that lets you search in repos and AUR and then interactively install one or more packages from the results.

    This doesnt mean that there wont be support for other things, but yaourts functionality has grown huge and one cant implement all that stuff alone in a few days.

    Development site and repository at Gitorious: http://gitorious.org/paktahn

    A binary package can be downloaded here: http://viridian-project.de/~sky/paktahn … pkg.tar.gz

    Its a clean package that I personally vouch for.

    Building from source is a bit more elaborate since you need to download the Common Lisp deps on your own, e.g. using clbuild. Contact me if you want to help and hit a wall. In the future this will be solved with either proper packages or a script that automates the process. Like I said, this is mainly a preview.

    Contributions, bug reports, comments and praise are all welcome, as are donations since Im an independent software developer.

    Have a nice day,

    Leslie

  • RELEVANCY SCORE 2.23

    DB:2.23:[Request] Vpopmail 5.4.6 k8



    Hey, I recently tried to install/build vpopmail 5.2.2 thats in extra currently, but it wont build, errors out with mysql. So I was wondering if anyone could/was planning on upgrading the package anyway to the most recent version. I wanted to get a mail server up and it seems like qmail with qmailadmin and vpopmail is the easiest. If no one wants to update I will try to build from source.

    Thanksmrjohnston

    DB:2.23:[Request] Vpopmail 5.4.6 k8


    Sorry, been very busy. Another question, There is a restriction or problem that it must be vpopmail 5.4.6, since the latest stable one is 5.4.9

  • RELEVANCY SCORE 2.23

    DB:2.23:How To: Build A Duplex Service Sample Wont Build cz


    I am trying to build the MSDN Sample from:
    http://msdn.microsoft.com/en-us/library/cc645027(VS.95).aspx#
    When I change the Service1.svc file to:
    %@ServiceHost language=VB Debug=true Factory=DuplexService.PollingDuplexServiceHostFactory%
    I get an error: Attribute 'Factory is not a valid attribute of Element 'ServiceHost'.

    How do I fix this?

    DB:2.23:How To: Build A Duplex Service Sample Wont Build cz

    Hi:
    I uploaded a solution here:
    http://cid-2fa13ebc6cc8e80f.skydrive.live.com/self.aspx/Public/WcfService1.zip

    Please try it to see if it works.
    Regards

    Hi Allen,
    I really need you help.
    I got the WCF Duplex Service that you uploaded to work and it really works well with my Silverlight application. But I really need a VB version of the Duplex Service.
    I have done my best to create as close a copy as I can to yours in VB, but the svc file will not runwith the Browser and the
    CreateServiceHost function never gets called so there is no communications.
    Since you were able to fix it in C#, I wonder if you can help me figure out what is wrong with the VB.
    The Service1.svc file reads:
    %@ ServiceHost Language=VB Debug=true Factory=DuplexService.PollingDuplexServiceHostFactory %The web.config file was changed to work with VB (copied from default
    VB WCF Service):
    system.codedom
    compilers
    compiler
    language=vb;vbs;visualbasic;vbscript
    extension=.vb
    warningLevel=4
    type=Microsoft.VisualBasic.VBCodeProvider,
    System, Version=2.0.0.0, Culture=neutral, PublicKeyToken=b77a5c561934e089
    providerOption
    name=CompilerVersion
    value=v3.5/
    providerOption
    name=OptionInfer
    value=true/
    providerOption
    name=WarnAsError
    value=false/
    /compiler
    /compilers
    /system.codedomThe
    IService1.vb file reads:

    Namespace DuplexService
    ServiceContract([Namespace]:=Silverlight, _
    CallbackContract:=GetType(IDuplexClient)) _

    Public
    Interface IDuplexService
    OperationContract(IsOneWay:=True) _
    Sub Order(ByVal receivedMessage
    As Message)
    End
    Interface

    ServiceContract() _
    Public
    Interface IDuplexClient
    OperationContract(IsOneWay:=True) _
    Sub Receive(ByVal returnMessage
    As Message)
    End
    Interface
    I checked the Project Properties and they seem to match up 1-to-1.
    Can You PLEASE let me know what the secret is to get the svc file to run in the Browser and the WCF Service to run in VB?
    THANK YOUVERY MUCH for your Help.

  • RELEVANCY SCORE 2.23

    DB:2.23:[Solved] Mesa-Full-I965 Wont Build s3



    EDIT:I solved the build error by editing the PKGBUILD from
    --with-gallium-drivers= \

    DB:2.23:[Solved] Mesa-Full-I965 Wont Build s3


    EDIT:I solved the build error by editing the PKGBUILD from
    --with-gallium-drivers= \

  • RELEVANCY SCORE 2.23

    DB:2.23:How Do I Build An Internet Browser? 91


    i want to build an internet browser, with the following options...
    - the only graphics it displays are those on the google (or other specified search engine) page
    - all other pages, it returns only text, and the html used to build that page

    can anyone point me in the right direction? i cant find anything specific in the help docs, so a rtfm wont help me here =P

    DB:2.23:How Do I Build An Internet Browser? 91

    Hopefully, this'll make short work of your exercise.thank you i was thinking much about this problem so you helped me too. Browser is nice :-)

  • RELEVANCY SCORE 2.23

    DB:2.23:My Level Wont Load. Please Help! jk



    Yes, along with what GameVortex said, you must add the scene to the build settings by:



    Clicking the File tab


    Selecting Build Settings


    Select Add Current under build settings



    Then you'll have the scene in build settings.


    Also (just so you know), you can call the level using

    Application.LoadLevel(LevelName);


    or

    Application.LoadLevel(numberOfScene);


    Number Of Scene is the number you see next to your scene name in the build settings (no quotations).

    DB:2.23:My Level Wont Load. Please Help! jk


    If you want to use this script for more than one portal that I recommend the LevelToLoad var as you have there. When you enter your scenes into your build settings you'll see the number near it, just change the LevelToLoad into the relevant scene number.

    var LevelToLoad : 1;

    function OnTriggerEnter (other : collider)
    {
    Application.LoadLevel(LevelToLoad);
    }



    That should work.

  • RELEVANCY SCORE 2.23

    DB:2.23:My Web Camera Wont Register s8


    my web camera and earphones quick play and my wioreless modem thats build in my computer isnt working what can i do to get it running

    DB:2.23:My Web Camera Wont Register s8

    Please post back with the relevant minimum information -

    Quote -
    The Windows Update forum is one of three forums that does not have different forums for the different versions of Windows (Internet Explorer and Gaming are the others). With that in mind we ask that you postAT LEAST the following information.
    If you do not know how to find some of the information then post what you can and let us know that you need help finding information.

    Minimum information to post:
    Version of Windows and Service pack level. (Windows XP Home, SP3; Vista Home Premium, SP1; Windows 7 Ultimate, etc...)
    Also post if you are using 32bit or 64bit version of Windows.

    Update number of the last update installed prior to any problems. If you don't know the update number then give the date that the update was installed. The update number of any failed updates.

    Error code from any failed updates or if you believe an update has caused ablue screen, givethe error codes from the blue screen.

    Other information to post:
    Steps already taken to correct the issue and the results of the steps.

    If the issue has ever happened before with other updates.

    A couple other helpful pieces are:
    What anti-virus program you use, if it is up to date, and if there has ever been any other anti-virus program installed.
    If your version of Windows was upgraded from a previous version or if it came with (or was clean installed with) the version you are currently running.
    http://social.answers.microsoft.com/Forums/en-US/vistawu/thread/1467f44b-ee27-4f7d-98d7-f1c4b35b3395
    End Quote

    TaurArian [MVP] 2005-2011 - Update Services

  • RELEVANCY SCORE 2.23

    DB:2.23:Win7 Wont Save Login/Password For Vpn Connections f3


    I am using build 6.1.7229.

    DB:2.23:Win7 Wont Save Login/Password For Vpn Connections f3

    Hi, This form only support officical version. For more informaiton, please refer to the following link:Windows 7 Unofficial BuildsThank you for your understanding.

  • RELEVANCY SCORE 2.23

    DB:2.23:New Build Computer Wont Boot - Please Help 7p


    Hi, ive recently been upgrading my pc. I brought this on because my last one had stopped working hower am now having a major problem.

    DB:2.23:New Build Computer Wont Boot - Please Help 7p

    Have you tried the video card in a different PC?

  • RELEVANCY SCORE 2.23

    DB:2.23:Mail App Wont Open. zm


    My Mail App wont open. Giving me an error ---You have Mail version 4.5 (1084/1085). It cant be used on Mac OS X Version 10.6.8 (Build 10K549). For more information, click the Help button. and Believe me Help button is no help at all. Anyone have any ideas? Please help...Thanks

    DB:2.23:Mail App Wont Open. zm

    postvisualist wrote:My Mail App wont open. Giving me an error ---You have Mail version 4.5 (1084/1085). It cant be used on Mac OS X Version 10.6.8 (Build 10K549). For more information, click the Help button. and Believe me Help button is no help at all. Anyone have any ideas? Please help...ThanksHi postvisualistJust got notification in my email that my lengthy series of steps to reviving Apple Mail after a failed Security Update worked out for you. It appears that Paldeng got some helpful info out of the steps also.My steps are long but they're thorough which is what counts in my book, especially for an app as essential to everyday life these days as the Apple Mail email app. The steps cover all the bases methodially going through them all as you did will save one from tearing his or her hair out trying others' suggestions that have the words "try this" "should..." and "maybe" so forth mixed in with the rest of their probably helpful but otherwise well-meaning help.So... Glad to read that you got yours working! And thanks for the green "This Solved It" checkmark, too. That'll give indication to others poring through these discussion forums that this post is a good one for solving their own same or similar problems with Mail after installing the 2012-004 Security Update via Software Update which causes problems if you don't have your v4.5 Mail.app in the Apps folder when doing it. In my opinion, that's a goofup by the Apple Security Update authors. After the Apple software engineers see all the uber-miffed sometimes frantic posts in Apple's Discussions forum here about Mail not working after the Update install, good bet that the next Sec Update will take into account that there's some folks out there who just.... Think Different. heheHappy Mac'in, p.v.! Kevin Kendall

  • RELEVANCY SCORE 2.22

    DB:2.22:Is Build Required For Running Automated Coded Ui Test From Mtm? 3z


    Hi,
    Can any one help me to find a better way for executing codedui test from MTM without a build..
    We had created coded ui functions associated automated function to MTM test cases, when we try to run test cases we are getting error says Build definition is mandatory, but in our case we wont get build details through tfs (its a QA service based
    company), So how can we achieve this with out build details. can we process with dummy build definition
    Please reply...
    Regards,
    tuely.S

    tuely

  • RELEVANCY SCORE 2.22

    DB:2.22:Windows 10 Build 9841 Wont Update m7


    Hello is anyone else having this problem my windows 10 computer running build 9841 cant update to 9860 when I click on preview builds in the system update and recovery it says no preview builds are available even though build 9860 I tried restarting I
    tried shutting down and it still doesnt work please help.

    DB:2.22:Windows 10 Build 9841 Wont Update m7

    Build 9879 is rather quirky and has a know issue which prevents some hard drives from spinning up after shutdown or hibernation. This issue is not present in Build 9841 or 9860. MS has created a fix and includes it in the updates, but, the fix does
    not always work. If the hard drive fails to spin up many people are going to be thinking their drive is dead and won't have the technical knowledge to resurrect their drive. The drive issue is at the hardware level so installing W10 on a separate partition
    won't avoid the problem.
    Getting the drive to spin up again is fairly simple. Burn HDAT2 to a disk and boot the computer. Select option 1 on the menu. Type HDAT2/w in the command line. The drive should now spin up and be detected. You can now boot back into Windows and try to install
    the fix. However, if the patch doesn't work, the spin up problem will happen over and over.

  • RELEVANCY SCORE 2.22

    DB:2.22:Kdenlive Qt3 Issue! ( Qt3 And Qt4 Conflicts!) m9



    Ive build kdenlive from aur on x86_64 - builds fine!But it wont start
    KCrash: Application kdenlive crashing...
    sock_file=/home/markuman/.kde4/socket-Hugo/kdeinit4__0

    DB:2.22:Kdenlive Qt3 Issue! ( Qt3 And Qt4 Conflicts!) m9


    Maybe you should give qt path when you build kdenlive...:|

  • RELEVANCY SCORE 2.22

    DB:2.22:Compressor Wont Open az


    Compressor wont open....This is the error I get...Help!

    Date/Time: 2008-07-16 20:14:34.434 -0700
    OS Version: 10.4.11 (Build 8S165)
    Report Version: 4

    Command: Compressor
    Path: /Applications/Compressor.app/Contents/MacOS/Compressor
    Parent: WindowServer [61]

    Version: 2.3 (2.3)
    Build Version: 2
    Project Name: Compressor
    Source Version: 20340

    PID: 231
    Thread: Unknown

    Link (dyld) error:

    Symbol not found: __ZN5stomp16CEncoderSettings24RegisteredAsITMSProviderEv
    Referenced from: /Applications/Compressor.app/Contents/MacOS/Compressor
    Expected in: /Library/Frameworks/Compressor.framework/Versions/A/Compressor

    DB:2.22:Compressor Wont Open az

    Compressor wont open....This is the error I get...Help!

    Date/Time: 2008-07-16 20:14:34.434 -0700
    OS Version: 10.4.11 (Build 8S165)
    Report Version: 4

    Command: Compressor
    Path: /Applications/Compressor.app/Contents/MacOS/Compressor
    Parent: WindowServer [61]

    Version: 2.3 (2.3)
    Build Version: 2
    Project Name: Compressor
    Source Version: 20340

    PID: 231
    Thread: Unknown

    Link (dyld) error:

    Symbol not found: __ZN5stomp16CEncoderSettings24RegisteredAsITMSProviderEv
    Referenced from: /Applications/Compressor.app/Contents/MacOS/Compressor
    Expected in: /Library/Frameworks/Compressor.framework/Versions/A/Compressor

  • RELEVANCY SCORE 2.22

    DB:2.22:Java Ee Tutorial Coffee Break Application Wont Build Or Deploy 31


    Ive been trying to build and deploy the coffee break application but have had zero luck it just comes up with a load of errors and wont build or compile and says that there are unresolved resources and it needs jaxws20 library.

    I got to build and deploy the cb-jaxws part but the other 2 parts wont build or deploy.

    Can anyone help?

    Edited by: scorpion2 on Aug 5, 2008 11:15 AM

    DB:2.22:Java Ee Tutorial Coffee Break Application Wont Build Or Deploy 31

    Its actually from the java ee tutorial bundle. Its the coffeebreak application from that bundle.
    I didn't write the application myself and since it was from a previously written tutorial bundle I had assumed it would be ready to be built and deployed without messing around with any code.

    Anyway cheers for the advice I'll have a look through the errors and see if I can get it working.

  • RELEVANCY SCORE 2.22

    DB:2.22:Vs2013 Build Queued But Wont Start 88


    Hi, I'm new to TFS build service and has just installed a build service, build controller and build agent (all on TFS 2012) on my DEV server. All services start and are ready. And I have also installed Visual Studio 2013 on the server.

    I create a simple project and build definitions which trigger a build when a check-in happened. I can see my build is submitted and is queued on my new build controller.

    However, this build never get picked. I cannot see any error on windows events. All I see are informational debug event which says I'm querying the query. Any help will be very much appreciated. I have been trying and searching the
    web for hints for weeks already.

    DB:2.22:Vs2013 Build Queued But Wont Start 88

    Hi Cyberia0083,
    Thanks for your post.
    And thank you for sharing your experience here. It will be very beneficial for other community members having the similar questions.
    All your participation and support are very important to build such harmonious/ pleasant / learning environment for MSDN community.
    We are trying to better understand customer views on social support experience, so your participation in this interview project would be greatly appreciated if you have time. Thanks for helping make community forums a great place.

    Click
    HERE to participate the survey.

  • RELEVANCY SCORE 2.22

    DB:2.22:My Cisco Agents Wont Register With Mngmt Center p8


    Im using the 4.0.1 build. My workstations have sucessfully downloaded the agent but are unable to communicate with the Mngmt server. I did a packet capture and I receive a checksum error. The Mngmt Server has the correct license...Any ideas?

    DB:2.22:My Cisco Agents Wont Register With Mngmt Center p8


    Sorry about my last post. I didnt check the csalog for CSAMC. The error I receive there is

    Feature: desktopagent

    License path: D:\PROGRA~1\CSCOpx\CSAMC\cfg\CSA4.0-NFR.lic

    FLEXlm error: -5,357

    For further information, refer to the FLEXlm End User Manual,

    available at "www.globetrotter.com".

    [2004-08-02 06:58:30.953] [PID=3948] [webagent]: Agent Req 'Registration' Failure(2035), ip=192.168.2.151, huid={6DF14834-AA29-4FFF-B65D-ACA74049C1CD}

    [2004-08-02 06:58:34.750] [PID=3948] [webagent]: No such feature exists

    No such feature exists?? I looked on google and Flexlm -5 error code means exactly that:

    http://www.abaqus.com/support/flexlm/chap14.htm

    Any more ideas, suggestions or any recommendations on who I should contact would be greatly appreciated?

    Thanks

    Victor

  • RELEVANCY SCORE 2.22

    DB:2.22:C# Chinese Wont Build Resources On Vista ak


    In my C# project I have CHS/CHT for Chinese resources. If I build the project on Vista these two languages will not build the resource dll file. I have to rename to Hans/Hant for Chinese to build. If I move the project back to XP then it again wont build and I have to rename the resources again.
    I've heard of a workaround where you set the resource programatically in code based on the OS. Does anyone have a beter solution or info about this issue?
     
    Thanks in advance,
    KC

    DB:2.22:C# Chinese Wont Build Resources On Vista ak

    Wolf,
    This is a known issue we're already tracking internally. As you found out, the workaround is to rename back and forth - unfortunately. There may be a QFE released to address this -- and maybe a modification needed on the MSBuild side. Neither are currently available, though.
    Another workaround that may suit you better might be to pick random cultures you're not already creating resources for, and use their names for your Hans/Hant resources. That makes development possible on Vista and XP. Then just before shipping or releasing to test, change to the Chinese culture.
    Let us know how it goes.
    Dan
    "This posting provided AS-IS, with no warranties"

  • RELEVANCY SCORE 2.22

    DB:2.22:Once Again Wmplayer.Exe Wont End... xj


    What is the deal!?  I realize that I am now running build 7068, and that it's not officially a release. 

    DB:2.22:Once Again Wmplayer.Exe Wont End... xj

    Sorry, but these forums currently support the official Beta 1 version which is Build 7000.
    Please see the following thread for more detailed description of the leaked builds.
    Windows 7 Unauthorized Versions
    This thread will be locked.
    Thanks for understanding.

  • RELEVANCY SCORE 2.22

    DB:2.22:Xperia Sp 3m



    Its just wasting our time . sony makes me disapointed very well . and this new build wont come . they are just ridiculeus

    DB:2.22:Xperia Sp 3m


    What is your problem with the phone?Can you please elaborate?




    All we have to decide is what to do with the time that is given to us - J.R.R. Tolkien

  • RELEVANCY SCORE 2.22

    DB:2.22:Desktop Frozen Coming Out Of Sleep cp


    I got this in build 7000 and i still get it in build 7100 i found if i leave the mouse on the taskbar it wont freeze, i use hind taskbar feature?

    DB:2.22:Desktop Frozen Coming Out Of Sleep cp

    the mouse is the only thing that still works my G15 keyboard still works so the computer is still working, ill hit CTRL ALT DELETE and wait about 3-5 minutes and it will come out of it

  • RELEVANCY SCORE 2.22

    DB:2.22:How Do I Redirect With Action Script? af


    Just can't find it, I wont to build a button in action script that will send me to new URL.

  • RELEVANCY SCORE 2.22

    DB:2.22:Easy Pandoc [Solved] 8d



    Hi,

    pandoc, as well as haskell-pandoc from AUR wont build. This hasnt always been the case, but the last successful build dates back more than a month. Nobodys been commenting on this; am I the dumbest one on the block?

    Last edited by Llama (2011-10-09 17:42:34)

    DB:2.22:Easy Pandoc [Solved] 8d

    frabjous wrote:
    Easiest way around this is to add the ArchHaskell binary repo; i.e., put this:
    [haskell]
    Server = http://andromeda.kiwilight.com/$repo/$arch

  • RELEVANCY SCORE 2.22

    DB:2.22:Pacman Database File For Paktahn Does Not Exist x1



    I accidentally called pacman -S on a PKGBUILD file (the one for paktahn). I got paktahn installed properly, but now pacman gives me the following warning each time it runs

    warning: database file for paktahn does not exist

    How do I fix or further troubleshoot this?

  • RELEVANCY SCORE 2.22

    DB:2.22:Wrong Build Flavor Message When I Try To Download Mse fk


    I keep trying to download MSE and it keeps telling me I have a different "Build Flavor" on my computer and wont install the program. It tells me to uninstall older version and try again but the older version wont uninstall. Dont know what to do

    DB:2.22:Wrong Build Flavor Message When I Try To Download Mse fk

    See this post for manual Microsoft Security Essentials uninstall methods -
    http://answers.microsoft.com/en-us/protect/forum/protect_start/uninstalling-mse/a63b8c4b-58ed-437e-8086-fa08d80725a4
    Jim

  • RELEVANCY SCORE 2.22

    DB:2.22:Checkinstall Removing Installed Packages. m8



    Hey again!I want to ask a little question about Checkinstall...I need to build something from source (No way to build package) and if I build and install package using Checkinstall and when I want to remove the package it wont make a mess in my system?Im talking about for example RPM based distros.

    DB:2.22:Checkinstall Removing Installed Packages. m8

    JohnVV wrote:
    Im must build xfce and thunar from git repo and then its hard to build package.

  • RELEVANCY SCORE 2.22

    DB:2.22:Cairo-Dock Wont Build Mail Applet d1



    Hi,

    Im trying to enable the mail applet in my cairo-dock but no matter how I edit the PKGBUILD it wont enable the mail applet.

    Has anyone else known of this problem

    Just so you know I have tried both packages cairo-dock-plug-in and cairo-dock-bzr-plug-in

    Thanks

    DB:2.22:Cairo-Dock Wont Build Mail Applet d1


    Hi,

    Im trying to enable the mail applet in my cairo-dock but no matter how I edit the PKGBUILD it wont enable the mail applet.

    Has anyone else known of this problem

    Just so you know I have tried both packages cairo-dock-plug-in and cairo-dock-bzr-plug-in

    Thanks

  • RELEVANCY SCORE 2.22

    DB:2.22:Uname -R Reporting Wrong Kernel Version a9



    Just figured out why a package wont build:

    This is from the make file:
    KDIR := /lib/modules/$(shell uname -r)/build

  • RELEVANCY SCORE 2.22

    DB:2.22:My Ac97 Driver Wont Install With Windows 7 d7


    try realtek build 6305 but did not work.
    i have a motherboard a8s-x se.

    DB:2.22:My Ac97 Driver Wont Install With Windows 7 d7

    Hi superdave808,

    Welcome to Microsoft Windows community Answers Forum!

    I suggest you go to the manufactures website and download the latest drivers. Most hardware and drivers that worked with Vista will work with Windows 7.

    Important Note: This response contains a reference to a third party World Wide Web site. Microsoft is providing this information as a convenience to you. Microsoft does not control these sites and has not tested any software or information
    found on these sites; therefore, Microsoft cannot make any representations regarding the quality, safety, or suitability of any software or information found there. There are inherent dangers in the use of any software found on the Internet, and Microsoft
    cautions you to make sure that you completely understand the risk before retrieving any software from the Internet.

    Check for Compatibility of your hardware device drivers with Windows 7

    COMPATIBILITY HARDWARE DEVICE DRIVERS:

    1. Place the driver installation file on the Desktop.

    2. Right Click the driver installation file and select Properties/Compatibility Tab. Select the appropriate options in from the list in the following image.

    Same for windows 7

    3. Click Apply/OK.

    4. Right Click the file and select the Run As Administrator option to install.

    Hope this information helped!

    Thanks and Regards:

    Azeez Nadeem - Microsoft Support.
    Visit our Microsoft Answers Feedback Forum http://social.answers.microsoft.com/Forums/en-US/answersfeedback/threads/ and let us know what you think.

  • RELEVANCY SCORE 2.22

    DB:2.22:Windows Xp Sp 3 On Dell Laptop -Ftp Allows Login To Destination Ip But No Commands- Error 425 Cant Build Data Connection af


    I can open ftp and log into the destination ip, but cant send any commands - error 425 cant build data connection
    wont allow dir, puts gets etc

    DB:2.22:Windows Xp Sp 3 On Dell Laptop -Ftp Allows Login To Destination Ip But No Commands- Error 425 Cant Build Data Connection af

    Traditional FTP both sides act as servers and clients. Firewall will block the server side of your FTP client. Use passive ftp..

  • RELEVANCY SCORE 2.22

    DB:2.22:How To Include Missing Assembly References To A Team Build ? jm


    Hello, i have the problem, that our project wont build on the Build Server, because there a some missing assembly references. Locally i set the references manually, because all are in a folder named
    SharedLibs In this directory are all third party assemblies

    How to set in the Team Explorer the missing assemblies, is there a way to give an directory which has all neccessary assemblies for the project`?
    i wont touch the solution file.

    Im using the Microsoft Best Practices Assemblies in my project, on the Build Server these are not installed, they are only in the Workspace under SharedLibs/....
    How to map or edit the build?

    DB:2.22:How To Include Missing Assembly References To A Team Build ? jm

    Hi kernel64,

    Thanks for your post.

    Jakob provided a helpful suggestion, have you took it?

    What about the progress for this issue?Best Regards
    John Qiao
    Please remember to mark the replies as answers if they help and unmark them if they provide no help.

    Welcome to the All-In-One Code Framework! If you have any feedback, please tell us.

  • RELEVANCY SCORE 2.22

    DB:2.22:Windows Xp Pro - Wont Boot 3p


    get to a black screen with Boot agent PXE Base Code PXE-2.1 build 084. I then get PXE-E61 Media test failure, PXE-M0F Exiting Intel Boot Agent and No Bootable Device. Help Please?

    DB:2.22:Windows Xp Pro - Wont Boot 3p

    Hi,

    Welcome to Microsoft Community Forums. I understand that when you try to boot the computer you get black screen with error PXE-E61 Media test failure.

    This issue is often caused by either an incorrect setting in
    CMOS Setup or a bad boot device, such as a bad hard drive.

    Verify your boot options are properly set in CMOS setup. We recommend having the CD or disc drive as your first boot device and then hard drive as the second boot device.
    If your CMOS Setup has an option to boot from the LAN disable this option.
    If you have changed any CMOS settings, make sure to save and reboot the computer.

    I suggest you to contact computer manufacturer.

    If you have any more suggestions/queries related to Windows feel free to post us we will be happy to help you.

    Thank you.

  • RELEVANCY SCORE 2.22

    DB:2.22:Help, Projects Created In Vb2008 Express Wont Convert To Vs2008 71


    I have created several projects in Visual Basic 2008 Express, I upgraded to Visual Studio 2008 and when I attempt to build or publish my programs, they develop errors and I can't build or publish them. Here is an example:

    Code Snippet

    DB:2.22:Help, Projects Created In Vb2008 Express Wont Convert To Vs2008 71

    Thanks Jim, dropping them and re-adding them did the trick! Just one question though, what are cs proxies?Allan

  • RELEVANCY SCORE 2.22

    DB:2.22:Msn Live And Mail Wont Work With Rc 7100 sx


    I just got the rc build and since then my msn and live mail wont work, they launch but msn i cant log in to and mail says i have to reinstall it. Tried both reinstalling and repairing both with and without a reboot and neither helps. msn build is 2009 build 14.0.8064.206 swedish language but seems language doesnt matter. also mail says it cant load my contact list before it crashes

    DB:2.22:Msn Live And Mail Wont Work With Rc 7100 sx

    solved by reinstalling and making a clean install.

  • RELEVANCY SCORE 2.22

    DB:2.22:Cs4 Encore Encode Fail 7x



    I'm trying build a dvd but I immediately get an encode failed, is this a bug? I did adobe dynamic link to import my sequnce but that wont even transcode

    DB:2.22:Cs4 Encore Encode Fail 7x


    An Encode can fail for many reasons. First, I'd suggest posting to the Encore Forum, as some subscribers there, do not visit here, so more "eyes" on your problem.

    When you do, be sure to provide all info on your PrPro Sequence - the more, the better.

    It could be Assets, like MP3's, or maybe just a simple little gap. The more info, the better.

    Good luck, and see you there,

    Hunt

  • RELEVANCY SCORE 2.22

    DB:2.22:Installing Older Package From Aur 7f



    how do I revert to an older package from the aur? I installed the new build of utorrent and it wont run so I was wondering how to revert back to the old build? thanks

    DB:2.22:Installing Older Package From Aur 7f

    karol wrote:
    The archstuff repo has utorrent 2.2.0.build_23235-1.https://wiki.archlinux.org/index.php/Un … positories

  • RELEVANCY SCORE 2.22

    DB:2.22:Build Wont Start 3x


    Hello,
    I have a TFS Collection with multiple projects.
    I have a build controller with one build agent that handles the builds for this collection.
    I have been able to get the builds in project A to work just fine. But when I attempt to get a build in Project B to work, it just hangs up. When I queue the build I see I see the Build in the Queued/active list. When I click on the Build
    to see the details, all I see is the Build # but there is nothing in the Activity Log. It says the I have triggered the build for latest sources and that it is running for 0 Seconds on the build controller.
    After a few minutes (many minutes) of waiting, when I finally stop the build, I get the following message:
    The build has been forcefully stopped by the server because the build machine did not respond to a stop request.
    I have a single solution in the Project B build. I took all of the defaults when I created the build. I take all of the defaults when I queue a new build. I'm running both builds from the same workstation. If I run the builds from
    the Build Controller itself, I get the same problem, project A builds work fine and project B builds hang.

    I know that the Build Controller and Build Agent are working because they work just fine for another project in the solution.
    I'm stumped. Any ideas?
    - Bruce

    Bruce

    DB:2.22:Build Wont Start 3x

    Hello bruce,
    If you are using other build definition on other team project, check the build service account is part of security build group in team project.Regards Ayman Zaza MCTS

  • RELEVANCY SCORE 2.22

    DB:2.22:After Importing Facebook Sdk, Proj Wont Compile Anymore 38



    fix it. opened the sdk manager and downloaded android sdk build tools 19.1. after the download, went to sdk-build-tools-19.1, copied the zipalign.exe and pasted it to sdk-tools

    DB:2.22:After Importing Facebook Sdk, Proj Wont Compile Anymore 38


    fix it. opened the sdk manager and downloaded android sdk build tools 19.1. after the download, went to sdk-build-tools-19.1, copied the zipalign.exe and pasted it to sdk-tools

  • RELEVANCY SCORE 2.22

    DB:2.22:Make-A-City cx



    Hi guys!This is brickhawk324. Today, I wont to build a city. So, Iwant you guys to choos a roofs color.Would you guys mind?

    DB:2.22:Make-A-City cx

    Your welcome and if you need more advice just say so.



    ☽♪‼ℳeℂh₥a¡n¡aℂ‼♪☾EMBRACE THE BOOM!

  • RELEVANCY SCORE 2.22

    DB:2.22:Mplayer-Coreavc-Svn Wont Compile sd



    Im getting the following when compiling mplayer-coreavc-svn:
    Makefile:22: config.mak: No such file or directory
    make: *** osdep/: Is a directory. Stop.
    == ERROR: Build Failed.

    DB:2.22:Mplayer-Coreavc-Svn Wont Compile sd


    it has to be patched after ./configure according to the coreavc-for-linux wiki

    ensure that you have a recent mplayer build (...) and have run ./configure on it

  • RELEVANCY SCORE 2.21

    DB:2.21:Build 9860 Wont Let Me Install Programs 7z


    whenever i click on a exe file in my documents it causes the window to freeze and the file doesn't install

    DB:2.21:Build 9860 Wont Let Me Install Programs 7z

    its ok the problem was with avast internet security so i uninstalled it and it works fine now

  • RELEVANCY SCORE 2.21

    DB:2.21:Hp Pavilion A6700f Build Id Missing, Wont Recover With Discs fs


    Pavilion a6700f, started a recovery, it formatted HD, restarted to bootmgr missing, put in disc to recovery and it comes up with PC not recognizing discs can not recover, I checked build I'd to match disc set and there's no build I'd on PC BIOS, tried cmos clear, tried resetting to default, how do I re-enter build I'd to recover?

    DB:2.21:Hp Pavilion A6700f Build Id Missing, Wont Recover With Discs fs

    Although there may be an issue with the discs, I brought up the BIOS on the PC and found there is no BID listed on it, it does in fact show the version and all other info related, is there a way of re-entering the BID on the PC before attempting the recovery, or is it possible the motherboard may be corrupted? Thanks

  • RELEVANCY SCORE 2.21

    DB:2.21:No Build Id Or Feature Byte ms



    my build id and feature byte section of my bios is blank, cant recover how do input info in bios? windows 7, currently non-op, hp pavilion p6644y just got restore disks and they wont load

    DB:2.21:No Build Id Or Feature Byte ms


    Try the following (it may or may not work):

    1. Access BIOS

    2. Press CRTL-A

    3. Goto the SECURITY section of the BIOS

    4. Goto the SECURITY_ID sub menu

    5. Fill in the BuildID, FeatureByte, ProductName, ChassisSerial, SKU_Number .

    Which label contains which item may be different for each machine.

    Generally the BuildID and FeatureByte is located on the lable on the underside/bottom of the machine

    The ProductName, ChassisSerial, SKU_Numbe is located on the side/top of the machine.

    6. F10 to save the data for each field, then F10 and enter to exit BIOS.

    7. Try the System Recovery disks again and see if this yeilds a beller outcome.

    Hope this helps you more than it helped me

  • RELEVANCY SCORE 2.21

    DB:2.21:Slate Wont Turn On dm


    As of yesterday, my //BUILD developer preview slate won't turn on. It doesn't matter if it is plugged into the the wall charger or not. No blue light, no fan.

    Is there anything I can do? It was running build 8400.

    DB:2.21:Slate Wont Turn On dm

    what did you done before shutting down the last time?

  • RELEVANCY SCORE 2.21

    DB:2.21:Build Wont Generate An Exe File For My Simple Console App (Non-Clr) zm


    In the Visual Studio 2003 days, I could generate a simple console application and build a .exe file.
    For some reason in VS 2005, I can't seem to generate an exe. Instead, I get manifest files. Can you tell me how to get the exe to be created?
    I build without errors, there is just no exe generated.
     
    -su

    DB:2.21:Build Wont Generate An Exe File For My Simple Console App (Non-Clr) zm

    see  the post of Przemysław Rokicki 

    in link http://forums.microsoft.com/MSDN/ShowPost.aspx?PostID=371498SiteID=1mode=1

  • RELEVANCY SCORE 2.21

    DB:2.21:Jabber Wont Ring Incoming Calls Windows 7 kc



    I have 2 users whos jabber client won't ring on incoming calls. You here ring tone when making outbound calls and chat tones work fine.
    Version 9.1.0 Build 12296

    DB:2.21:Jabber Wont Ring Incoming Calls Windows 7 kc


    I have 2 users whos jabber client won't ring on incoming calls. You here ring tone when making outbound calls and chat tones work fine.
    Version 9.1.0 Build 12296

  • RELEVANCY SCORE 2.21

    DB:2.21:Help Me!!!!!!!! ps


    i cant upload anything to the gallery! whatever i make wont let me click send! even if i just make a mini figure with nothing on it it wont let me upload it!



    to build, or not to build. that is the question. im a forum founder!

    DB:2.21:Help Me!!!!!!!! ps

    i cant upload anything to the gallery! whatever i make wont let me click send! even if i just make a mini figure with nothing on it it wont let me upload it! YIKES! That must be annoying! It might be a glitch...



    --==LegoZac==--' Lego, the the toy that ties reality and imagination together in bricks ' - Legozac

  • RELEVANCY SCORE 2.21

    DB:2.21:Lightswitch Project Wont Build After Visual Studio 2010 Sp1 x1


    Got me this..
    Method not found: 'Void Microsoft.Data.Schema.SQL.SchemaModel.ISQLSimpleColumn.set_IsIdentity(Boolean)'

    any solutions?Pinoy

    DB:2.21:Lightswitch Project Wont Build After Visual Studio 2010 Sp1 x1

    yeah I thought as much. The thing is, uninstalling SP1 will need a reinstall(fix) of VS2010 and is just a hair short of uninstalling and reinstalling VS2010.. with me having a lot of things on top of it. Oh well.. there goes another 2hours. :DPinoy

  • RELEVANCY SCORE 2.21

    DB:2.21:Ie Wont Run Directly On Build 6001 m7


     
    Environment:
    Running enterprise evaluation copy build 6001 via TS.
     
    Behaviour:

    Double click on IE in the Start menu does not cause it to run.

    DB:2.21:Ie Wont Run Directly On Build 6001 m7

    I have had the same issue exactly. I think this is a bug.
     

  • RELEVANCY SCORE 2.20

    DB:2.20:Login On Win 8 Build fz


    im new at this and cant even log in on the log in screen, it wont take my windows live id. thank you

    DB:2.20:Login On Win 8 Build fz

    If you're still having trouble with this please post your question in the Windows Developer Preview: General OS Questions forum at http://social.msdn.microsoft.com/Forums/en-US/windowsdeveloperpreviewgeneral/threads .
    --Rob

  • RELEVANCY SCORE 2.20

    DB:2.20:S3 Wont Come Out Of Sleep With Raid 0,1,5 cm


    I have the following build -

    DB:2.20:S3 Wont Come Out Of Sleep With Raid 0,1,5 cm

    I'm sorry that's not helping, is that the forum i post this in/ how is this system laid out because I don't follow you telling me to look for a community, i just wish to post the question, its a specific question to a specifiic set of drivers and parts.
    so i'm going to just repost the question their in the link otherwise I don't follow sorry.

  • RELEVANCY SCORE 2.20

    DB:2.20:Range Of Period 7m



    hallow

    i get from user period like beg_date 012007 and end_date 122007 and i wont to build range table for between this period how i can do that ?

    Regards

    DB:2.20:Range Of Period 7m


    Hi,

    DATA beg LIKE SY-DATUM.

    DATA end LIKE SY-DATUM.

    beg+0(3) = '01/'.

    beg3(2) = beg_date0(2).

    beg+5(1) = '/'.

    beg6(4) = 'beg_date2(4).

    end+0(3) = '01/'.

    beg+5(1) = '/'.

    beg6(4) = 'beg_date2(4).

    then use FM MONTH_PLUS_DETERMINE to increase the month by 1.

    assign this month to end+3(2).

    subtract 1 form end, that will be the last date of the previous month.

    then use between operator. u don't need to use range.

    Reward if useful

    Regards

    ANUPAM

  • RELEVANCY SCORE 2.20

    DB:2.20:My C++ Code Wont Links With Qml cp


    it shows launch binary failed on run while build successfully plz help me out.

    DB:2.20:My C++ Code Wont Links With Qml cp


    Can you give the error exactly as shown?

    Most likely there is an error in your QML code like a missing variable that while it will build will cause the page not to load.




    If you've been helped click on , if you've been saved buy the app. Developer of stokLocker, Sympatico and Super Sentences.

  • RELEVANCY SCORE 2.20

    DB:2.20:Visual Studio Wont Build Projects c1


    Hello, I've recently come across a problem where my Visual Studio refuses to build any project - it just hangs until you close VS via task manager. All it says is
    1------ Build started: Project: NewFolderTest, Configuration: Debug Win32 ------
    and then it stops responding no matter how long I leave it to build. I've tried reinstalling and downloading service packs but nothing seems to work. Thanks in advance!

    DB:2.20:Visual Studio Wont Build Projects c1

    Confirm all options are checked while vs installation.Also check environment variables are set correctly.Thanks, Renjith V R