• RELEVANCY SCORE 5.08

    DB:5.08:Error Message C-991, Disconnected? 39





    Anyone else get this, I got it when I went into my apartment, and everytime I try to log in.

    DB:5.08:Error Message C-991, Disconnected? 39

    Yeah, the servers are being hammered with everyone going on at once. It kicked me off when i tried to go into my summerhouse.



  • RELEVANCY SCORE 3.27

    DB:3.27:Network Error . The Connnection To The Server Was Lost. C-991 . mm





    Hi



  • RELEVANCY SCORE 3.08

    DB:3.08:The Error Message When I Add A Bookmark fa






    When I add a bookmark, a window appears with the message:
    unload: [Exception... "Component returned failure code: 0x80004005 (NS_ERROR_FAILURE) [nsIObserverService.removeObserver]" nsresult: "0x80004005 (NS_ERROR_FAILURE)" location: "JS frame :: chrome://trustchecker/content/trustchecker.js :: TOP_LEVEL :: line 991" data: no]

    DB:3.08:The Error Message When I Add A Bookmark fa



    For me the solution was to go into add-ons manager, click Extensions and disable Zonealarm Security Engine.

  • RELEVANCY SCORE 3.00

    DB:3.00:Post Route Simulation Error Message sk



    Hi

    I have encounterd an error message in the post route simulation .

    I am now using test fixture as follows

    always begin

    CLKIN=0;

    # 5;

    CLKIN =1;

    # 5;

    end

    initial begin

    @(posedge CLKIN);

    # 10000 rx_wire =1;

    end

    Here all the inputs are synchronised to input clock of DCM.

    Post route simulation throws error as

    # ** Error: C:/Xilinx/10.1/ISE/verilog/mti_se/simprims_ver/sim​prims_ver_source.v(121023):
    $setup( posedge SSET (sset_clk_enable1 != 0):22309309
    ps, posedge CLK:22310237 ps, 990 ps );# Time: 22310237 ps Iteration: 2 Instance: /TESTFIXTURENEW/uut/\instance_name/state_next_2 # ** Error: C:/Xilinx/10.1/ISE/verilog/mti_se/simprims_ver/sim​prims_ver_source.v(121024):
    $setup( negedge SSET (sset_clk_enable1 != 0):22320086
    ps, posedge CLK:22320237 ps, 990 ps );# Time: 22320237 ps Iteration: 2 Instance: /TESTFIXTURENEW/uut/\instance_name/state_next_2 # ** Error: C:/Xilinx/10.1/ISE/verilog/mti_se/simprims_ver/sim​prims_ver_source.v(121023):
    $setup( posedge SSET (sset_clk_enable1 != 0):26829459
    ps, posedge CLK:26830238 ps, 991 ps );# Time: 26830238 ps Iteration: 2 Instance: /TESTFIXTURENEW/uut/\instance_name/LED_reg_0 # ** Error: C:/Xilinx/10.1/ISE/verilog/mti_se/simprims_ver/sim​prims_ver_source.v(121024):
    $setup( negedge SSET (sset_clk_enable1 != 0):27910141
    ps, posedge CLK:27910236 ps, 990 ps );# Time: 27910236 ps Iteration: 2 Instance: /TESTFIXTURENEW/uut/\receiver/state_next_0 # ** Error: C:/Xilinx/10.1/ISE/verilog/mti_se/simprims_ver/sim​prims_ver_source.v(121023):
    $setup( posedge SSET (sset_clk_enable1 != 0):27909413
    ps, posedge CLK:27910237 ps, 991 ps );# Time: 27910237 ps Iteration: 2 Instance: /TESTFIXTURENEW/uut/\receiver/state_next_1 # ** Error: C:/Xilinx/10.1/ISE/verilog/mti_se/simprims_ver/sim​prims_ver_source.v(121023):
    $setup( posedge SSET (sset_clk_enable1 != 0):27919585
    ps, posedge CLK:27920236 ps, 990 ps );# Time: 27920236 ps Iteration: 2 Instance: /TESTFIXTURENEW/uut/\receiver/state_next_0 # ** Error: C:/Xilinx/10.1/ISE/verilog/mti_se/simprims_ver/sim​prims_ver_source.v(121024):
    $setup( negedge SSET (sset_clk_enable1 != 0):28039339
    ps, posedge CLK:28040236 ps, 990 ps );# Time: 28040236 ps Iteration: 2 Instance: /TESTFIXTURENEW/uut/\receiver/state_next_0 # ** Error: C:/Xilinx/10.1/ISE/verilog/mti_se/simprims_ver/sim​prims_ver_source.v(121023):
    $setup( posedge SSET (sset_clk_enable1 != 0):28049339
    ps, posedge CLK:28050236 ps, 990 ps );# Time: 28050236 ps Iteration: 2 Instance: /TESTFIXTURENEW/uut/\receiver/state_next_0

    I did not have a clue where to start with to fix these errors

    Any help would be appreciated

    Regards

    Faisal

    DB:3.00:Post Route Simulation Error Message sk


    Faisal,

    Your instructor owes us a favour... a very large favour. We have been pounding into you, in this thread, the importance of respecting the timing relationship between data and its sampling clock. This should have been discussed at great length and with excruciating clarity the same day your course instructor first described a flip-flop to you.

    This is digital logic design course 101, first week.

    Consider reading through this simple tutorial. At the bottom of this page you'll find additional instructive links on the subject. It will be well worth your time. And when you are certain that you understand the principles involved, please mention to your instructor that this lesson should be given the coverage it deserves in his or her course plan.

    -- Bob Elkind




    SIGNATURE:README for newbies is here: http://forums.xilinx.com/t5/New-Users-Forum/README-first-Help-for-new-users/td-p/219369Summary:1. Read the manual or user guide. Have you read the manual? Can you find the manual?2. Search the forums (and search the web) for similar topics.3. Do not post the same question on multiple forums.4. Do not post a new topic or question on someone else's thread, start a new thread!5. Students: Copying code is not the same as learning to design.6 "It does not work" is not a question which can be answered. Provide useful details (with webpage, datasheet links, please).7. You are not charged extra fees for comments in your code.8. I am not paid for forum posts. If I write a good post, then I have been good for nothing.

  • RELEVANCY SCORE 2.94

    DB:2.94:C# To C++ Named Pipes Communication Problem. 9s


     
    I’m using named pipes for communication between my 2 applications one written on c# (pipe server) and one on c++ (pipe client). I took some example projects from internet and remake them to fit my needs and support Unicode. But something went wrong. So when I send some string from c++ it c# successfully get it, but if c# still processing data from c++ and c++ send one more string, then when I read next time from c# I get inconsistent result. Instead of getting for example [hello][bye] I get [hello] some unprintable characters \0 [bye] where [hello] is string which was not read from stream by c# before c++ send [bye] message. 
    Here is c# receiving code:

      private void Read(object clientObj)  

            {  

                var client = (Client)clientObj;  

                client.stream = new FileStream(client.handle, FileAccess.ReadWrite, BUFFER_SIZE, true);  

                char[] buffer = new char[BUFFER_SIZE];  

                var encoder = new UnicodeEncoding();  

     

                while (Running)  

                {  

                    int bytesRead;  

     

                    try 

                    {  

                        bytesRead = new StreamReader(client.stream, encoder).Read(buffer, 0, BUFFER_SIZE);  

                    }  

                    catch 

                    {  

                        //read error has occurred  

                        break;  

                    }  

     

                    //client has disconnected  

                    if (bytesRead == 0)  

                        break;  

     

                    var rcv = new string(buffer, 0, bytesRead);  

                    //fire message received event  

                    if(MessageReceived != null)  

                        MessageReceived(client, rcv);  

                }  

     

                //clean up resources  

                client.stream.Close();  

                client.handle.Close();  

                lock (clients)  

                    clients.Remove(client);  

            } 

    DB:2.94:C# To C++ Named Pipes Communication Problem. 9s

     
    I’m using named pipes for communication between my 2 applications one written on c# (pipe server) and one on c++ (pipe client). I took some example projects from internet and remake them to fit my needs and support Unicode. But something went wrong. So when I send some string from c++ it c# successfully get it, but if c# still processing data from c++ and c++ send one more string, then when I read next time from c# I get inconsistent result. Instead of getting for example [hello][bye] I get [hello] some unprintable characters \0 [bye] where [hello] is string which was not read from stream by c# before c++ send [bye] message. 
    Here is c# receiving code:

      private void Read(object clientObj)  

            {  

                var client = (Client)clientObj;  

                client.stream = new FileStream(client.handle, FileAccess.ReadWrite, BUFFER_SIZE, true);  

                char[] buffer = new char[BUFFER_SIZE];  

                var encoder = new UnicodeEncoding();  

     

                while (Running)  

                {  

                    int bytesRead;  

     

                    try 

                    {  

                        bytesRead = new StreamReader(client.stream, encoder).Read(buffer, 0, BUFFER_SIZE);  

                    }  

                    catch 

                    {  

                        //read error has occurred  

                        break;  

                    }  

     

                    //client has disconnected  

                    if (bytesRead == 0)  

                        break;  

     

                    var rcv = new string(buffer, 0, bytesRead);  

                    //fire message received event  

                    if(MessageReceived != null)  

                        MessageReceived(client, rcv);  

                }  

     

                //clean up resources  

                client.stream.Close();  

                client.handle.Close();  

                lock (clients)  

                    clients.Remove(client);  

            } 

  • RELEVANCY SCORE 2.92

    DB:2.92:Error: While Trying To Put Web Applications Into Maintenance Mode. x9


    Hi,
    A script was created from my colleague to put ~30 Web Application into maintenance mode.

    Each Web Application might have different Maintenance Windows.
    On occasion I will receive error messages from certain applications while attempting to put them into maintenance mode.

    Here is a sample of the error message:
    New-ManagementGroupConnection : The client has been disconnected from the serve
    r. Please call ManagementGroup.Reconnect() to reestablish the connection.

    We use a 3rd party to run the StartmaintenanceMode.ps1 script. But I also got the same error message while attempting to put the
    web apps using the Windows Scheduler.
    Here is a sample error message:
    C:\C:\Windows\system32\WindowsPowerShell\v1.0\powershell.exe -Command D:\Scr
    ipts\MaintenanceMode\StartMaintenanceMode.ps1 -RMS {My RMS server name} -Class {'My web app name'} -
    DurationInMinutes 38 -Reason 'PlannedApplicationMaintenance' -Comment 'This is the reason for maintenance.'; Exit $LASTEXITCODE;

    New-ManagementGroupConnection : The client has been disconnected from the server. Please call ManagementGroup.Reconnect() to reestablish the connection.
    At D:\Scripts\MaintenanceMode\StartMaintenanceMode.ps1:47 char:41
    $mgConn = New-ManagementGroupConnection -ConnectionString:$RMS -ErrorVariable errSnapin;
    Set-Location : System error.
    At D:\Scripts\MaintenanceMode\StartMaintenanceMode.ps1:48 char:14
    Set-Location $RMS -ErrorVariable errSnapin;
    Set-Location : Cannot find path 'Microsoft.EnterpriseManagement.OperationsManager.Client\OperationsManagerMonitoring::{My RMS Server name}' because it does not exist.
    At D:\Scripts\MaintenanceMode\StartMaintenanceMode.ps1:48 char:14
    Set-Location $RMS -ErrorVariable errSnapin;
    Failed to find class name: {My web app name}

    C:\echo 13
    13

    DB:2.92:Error: While Trying To Put Web Applications Into Maintenance Mode. x9

    Hi,

    Regarding the error appeared, please try the following hotfix:

    Attempts to opening the System Center Operations Manager 2007 console fails with The client has been disconnected from the server exception
    http://support.microsoft.com/kb/2262476

    Thanks.
    Nicholas Li - MSFT
    Please remember to click “Mark as Answer” on the post that helps you, and to click “Unmark as Answer” if a marked post does not actually answer your question. This can be beneficial to other community members reading the thread.

  • RELEVANCY SCORE 2.87

    DB:2.87:Windows Installer Cannot Access Network Location When Installed Directories Located On Network Drive c1


    I have a C Windows application built in Visual Studio 2010 with a Setup project to create an .msi that installs fine when users have a local My Documents folder, but fails when their My Documents folder is located on a
    network drive. When installed locally, the installer creates Project and Data folders in their My Documents folder, but when I try to install to system with My Documents in a network location, the .msi fails with the cannot access
    network location error message. Looking at the installer log file, it appears that the failure occurs when the installer is creating the property that describes the Project and Data directories, not when trying to create and populate
    those directories.

    Does anybody have an idea about how I can either avoid, workaround, or recover from this error? Right now the installation just fails and rolls back for systems with My Documents on networks. Thanks (cut and paste from msi log follows, I don't think the missing
    Error Icon is relevant, but maybe?)

    The installer has encountered an unexpected error installing this package. This may indicate a problem with this package. The error code is 2835. The arguments are: ErrorIcon, ErrorDialog, Error 1606. Could not access network location \TOMVEE-W7PC\Users\W8RemoteUserDocs\eQUEST
    3-65 Projects. MSI (c) (38:64) [13:13:34:987]: Note: 1: 2262 2: Error 3: -2147287038 MSI (c) (38:64) [13:13:34:987]: Product: eQUEST 3-65 -- Error 1606. Could not access network location \TOMVEE-W7PC\Users\W8RemoteUserDocs\eQUEST 3-65 Projects.

    MSI (c) (38:64) [13:13:34:989]: Note: 1: 1314 2: \TOMVEE-W7PC\Users\W8RemoteUserDocs\eQUEST 3-65 Projects\ MSI (c) (38:64) [13:13:34:989]: Note: 1: 1606 2: \TOMVEE-W7PC\Users\W8RemoteUserDocs\eQUEST 3-65 Projects\ MSI (c) (38:64) [13:13:34:989]: Note: 1: 2262
    2: Error 3: -2147287038 MSI (c) (38:BC) [13:13:34:991]: Note: 1: 2262 2: Error 3: -2147287038 DEBUG: Error 2835: The control ErrorIcon was not found on dialog ErrorDialog The installer has encountered an unexpected error installing this package. This may indicate
    a problem with this package. The error code is 2835. The arguments are: ErrorIcon, ErrorDialog, Error 1606. Could not access network location \TOMVEE-W7PC\Users\W8RemoteUserDocs\eQUEST 3-65 Projects. MSI (c) (38:64) [13:13:39:006]: Note: 1: 2262 2: Error 3:
    -2147287038 MSI (c) (38:64) [13:13:39:006]: Product: eQUEST 3-65 -- Error 1606. Could not access network location \TOMVEE-W7PC\Users\W8RemoteUserDocs\eQUEST 3-65 Projects.

    MSI (c) (38:64) [13:13:39:007]: Note: 1: 1606 2: \TOMVEE-W7PC\Users\W8RemoteUserDocs\eQUEST 3-65 Projects\ MSI (c) (38:64) [13:13:39:007]: Note: 1: 2262 2: Error 3: -2147287038 MSI (c) (38:BC) [13:13:39:009]: Note: 1: 2262 2: Error 3: -2147287038

    TommyVee

    DB:2.87:Windows Installer Cannot Access Network Location When Installed Directories Located On Network Drive c1

    Barry,
    Thanks for responding. I made a little application to check permissions and also update them if they were inadequate, but that did not fix the problem.

    But along the way, testing manually, I discovered that an extra \ in the middle of the directory path was causing the problem, like \\TOMVEE-W7PC\Users\W8RemoteUserDocs\\eQUEST
    3-65 Projects. This extra slash was coming because the [PersonalFolder] used for the folder default location in the setup project properties already generates a \ and then I was also adding a slash in the property value. This extra slash did not cause problems
    in local installations, but did cause problems in installations on network locations, probably because the \\ has other meanings in network directories.
    So the issue was not permissions but an an incorrectly formatted path.
    TomTommyVee

  • RELEVANCY SCORE 2.86

    DB:2.86:Iphone Disconnected When Syncing To Itunes 1k


    I am receiving an error message that states iTunes could not sync calendars to the iPhone because the iPhone was disconnected. Does anyone have any ideas what is going on?

    DB:2.86:Iphone Disconnected When Syncing To Itunes 1k

    I am receiving an error message that states iTunes could not sync calendars to the iPhone because the iPhone was disconnected. Does anyone have any ideas what is going on?

  • RELEVANCY SCORE 2.81

    DB:2.81:Java Error cj


    Java Plug-in 1.6.0_07
    Using JRE version 1.6.0_07 Java HotSpot(TM) Client VM
    User home directory = C:\Documents and Settings\Compaq_Owner

    ----------------------------------------------------
    c: clear console window
    f: finalize objects on finalization queue
    g: garbage collect
    h: display this help message
    l: dump classloader list
    m: print memory usage
    o: trigger logging
    p: reload proxy configuration
    q: hide console
    r: reload policy configuration
    s: dump system and deployment properties
    t: dump thread list
    v: dump thread stack
    x: clear classloader cache
    0-5: set trace level to n
    ----------------------------------------------------

    java.io.IOException: Server returned HTTP response code: 500 for URL: http://accountappeal.runescape.com/login.ws
    at sun.net.www.protocol.http.HttpURLConnection.getInputStream(Unknown Source)
    at ba.a(ba.java:170)
    at ba.a(ba.java:34)
    at loginapplet.g(loginapplet.java:89)
    at loginapplet.a(loginapplet.java:991)
    at n.e(n.java:432)
    at n.run(n.java:119)
    at java.lang.Thread.run(Unknown Source)
    load: class loader.class not found.
    java.lang.ClassNotFoundException: loader.class
    at sun.applet.AppletClassLoader.findClass(Unknown Source)
    at java.lang.ClassLoader.loadClass(Unknown Source)
    at sun.applet.AppletClassLoader.loadClass(Unknown Source)
    at java.lang.ClassLoader.loadClass(Unknown Source)
    at sun.applet.AppletClassLoader.loadCode(Unknown Source)
    at sun.applet.AppletPanel.createApplet(Unknown Source)
    at sun.plugin.AppletViewer.createApplet(Unknown Source)
    at sun.applet.AppletPanel.runLoader(Unknown Source)
    at sun.applet.AppletPanel.run(Unknown Source)
    at java.lang.Thread.run(Unknown Source)

    How do I fix this?

    Edited by: Grigne on Aug 12, 2008 4:28 PM

    DB:2.81:Java Error cj

    HTTP response code of 500 is an internal server error. When you tried to call the getInputStream, the request was sent off to the address mentioned, http://accountappeal.runescape.com/login.ws and the reply from that server was a 500 error.

    The issue you have is with the server you are trying to connect to, there is an internal error... what are you trying to do? Do you have any control of the http://accountappeal.runescape.com/login.ws address? (can you see whats going on inside it?)

  • RELEVANCY SCORE 2.77

    DB:2.77:Wlan.Ini Error Message After Uninstall p8



    I ran the uninstall of our Linksys software and disconnected the hardware. Now an error message pops up every 10 seconds - "Loading WLAN.INI ERROR! C:\Program Files\Linksys Wireless-G USB Wireless Network Monitor\WLAN.INI cannot be found"

    Even after the uninstall, there are Linksys directories on the C:\ drive, so I'm not sure what happened. When I check the Device Manager, the Wireless option is no longer there.

    Does anyone know how I can get rid of this error message and remove Linksys completely from my computer?

    thanks in advance.

    DB:2.77:Wlan.Ini Error Message After Uninstall p8

    The Wireless option is not there because you have un-installed the linksys adapter, however there are certain files which are still there and that's why you are getting that error message...In order to get rid of the message you need to shut the computer down and turn it on in safe mode and try to un-install again...After un-installing the linksys adapter reboot the computer in Normal mode and check...If you still get the same error message you need to run a registry cleaner s/w...

  • RELEVANCY SCORE 2.75

    DB:2.75:Airvision 2.1.2 - Post Upgrade Everything "Disconnected" ds



    Just upgraded from 2.1.1 to 2.1.2 now my local NVR and 4 cameras are showing as "disconnected"

    Error log shows
    [2013-07-11 10:32:52,927] LocalNvrService-HouseKeeper ERROR C - NVR thread not running. Restarting NVR
    [2013-07-11 10:32:57,927] LocalNvrService-HouseKeeper ERROR C - NVR thread not running. Restarting NVR
    [2013-07-11 10:33:02,927] LocalNvrService-HouseKeeper ERROR C - NVR thread not running. Restarting NVR
    [2013-07-11 10:33:07,927] LocalNvrService-HouseKeeper ERROR C - NVR thread not running. Restarting NVR

    Connection Log
    [2013-07-11 10:33:02] INFO ConnectionLog - NVR[9119ee66-2726-4447-a3c1-7a47edb5358b] - Disconnected (Local NVR)
    [2013-07-11 10:33:07] INFO ConnectionLog - NVR[9119ee66-2726-4447-a3c1-7a47edb5358b] - Disconnected (Local NVR)
    [2013-07-11 10:33:12] INFO ConnectionLog - NVR[9119ee66-2726-4447-a3c1-7a47edb5358b] - Disconnected (Local NVR)
    [2013-07-11 10:33:17] INFO ConnectionLog - NVR[9119ee66-2726-4447-a3c1-7a47edb5358b] - Disconnected (Local NVR)
    [2013-07-11 10:33:22] INFO ConnectionLog - NVR[9119ee66-2726-4447-a3c1-7a47edb5358b] - Disconnected (Local NVR)
    [2013-07-11 10:33:27] INFO ConnectionLog - NVR[9119ee66-2726-4447-a3c1-7a47edb5358b] - Disconnected (Local NVR)
    [2013-07-11 10:33:32] INFO ConnectionLog - NVR[9119ee66-2726-4447-a3c1-7a47edb5358b] - Disconnected (Local NVR)

    DB:2.75:Airvision 2.1.2 - Post Upgrade Everything "Disconnected" ds


    Those having problems, please send me your supp file under the admin tab.

    huan@ubnt.com

  • RELEVANCY SCORE 2.74

    DB:2.74:Error Message Stating Firewalled Disconnected Broadband Wan Miniport Pppoe And Local Lan Connection 8s


    DB:2.74:Error Message Stating Firewalled Disconnected Broadband Wan Miniport Pppoe And Local Lan Connection 8s


    Looks like you are set up for DSL instead of Comcast Cable. You can call in to Comcast Tech support to get assistance in reconfiguring for a Comcast Cable Connection.

  • RELEVANCY SCORE 2.71

    DB:2.71:Skype On Alcatel Ot-991 With Android 2.3.6 m1


    Alcatel One Touch 991Firmware 2.3.6 kernel 2.6.35.7Orange or wifiI cannot install skype the error says that my device could not support skype. I have a front camera on the device. Where is the problem?

    DB:2.71:Skype On Alcatel Ot-991 With Android 2.3.6 m1


    Eventually I managed to install skype. But no video

  • RELEVANCY SCORE 2.68

    DB:2.68:Wsus 3.0 Sp2 Down After Demoting Domain Controller k3


    Hi,
    WSUS 3.0 SP2 is installed on our member W2003R2 domain controller. Yesterday I demoted this domaincontroller with DCPROMO. Now WSUS doesn't seem to work anymore.
    I see this error in the system log: The Windows Internal Database (MICROSOFT##SSEE) service terminated with service-specific error 3417 (0xD59).
    In the app log there are various errors:

    FCB::Open: Operating system error 5(Access is denied.) occurred while creating or opening file 'c:\WINDOWS\SYSMSI\SSEE\MSSQL.2005\MSSQL\DATA\master.mdf'.
    FCB::Open failed: Could not open file c:\WINDOWS\SYSMSI\SSEE\MSSQL.2005\MSSQL\DATA\master.mdf for file number 1. OS error: 5(Access is denied.).

    FCB::Open: Operating system error 5(Access is denied.) occurred while creating or opening file 'c:\WINDOWS\SYSMSI\SSEE\MSSQL.2005\MSSQL\DATA\mastlog.ldf'. Diagnose and correct the operating system error, and retry the operation.
    FCB::Open failed: Could not open file c:\WINDOWS\SYSMSI\SSEE\MSSQL.2005\MSSQL\DATA\mastlog.ldf for file number 2. OS error: 5(Access is denied.).
    Unable to cycle error
    log file from 'c:\WINDOWS\SYSMSI\SSEE\MSSQL.2005\MSSQL\LOG\ERRORLOG.5' to 'c:\WINDOWS\SYSMSI\SSEE\MSSQL.2005\MSSQL\LOG\ERRORLOG.6' due to OS error '5(Access is denied.)'. A process outside of SQL Server may be preventing SQL Server from reading the files.
    As a result, errorlog entries may be lost and it may not be possible to view some SQL Server errorlogs. Make sure no other processes have locked the file with write-only access.
    etc ....
    The Windows service Windows Internal Database (MICROSOFT##SSEE) is doesn't start. It's using
    the NT AUTHORITY\NetworkService
    I used this kb http://support.microsoft.com/kb/929665and these are the results:
    === Verbose logging started: 17/05/2011 3:05:16 Build type: SHIP UNICODE 3.01.4000.4042
    Calling process: C:\WINDOWS\system32\msiexec.exe ===
    MSI (c) (B4:C8) [03:05:16:960]: Resetting cached policy values
    MSI (c) (B4:C8) [03:05:16:960]: Machine policy value 'Debug' is 0
    MSI (c) (B4:C8) [03:05:16:960]: ******* RunEngine:
    ******* Product: c:\SSEE_10.msi
    ******* Action:
    ******* CommandLine: **********
    MSI (c) (B4:C8) [03:05:16:976]: Client-side and UI is none or basic: Running entire install on the server.
    MSI (c) (B4:C8) [03:05:16:976]: Grabbed execution mutex.
    MSI (c) (B4:C8) [03:05:16:976]: Cloaking enabled.
    MSI (c) (B4:C8) [03:05:16:976]: Attempting to enable all disabled priveleges before calling Install on Server
    MSI (c) (B4:C8) [03:05:16:976]: Incrementing counter to disable shutdown. Counter after increment: 0
    MSI (s) (34:64) [03:05:16:991]: Grabbed execution mutex.
    MSI (s) (34:E8) [03:05:16:991]: Resetting cached policy values
    MSI (s) (34:E8) [03:05:16:991]: Machine policy value 'Debug' is 0
    MSI (s) (34:E8) [03:05:16:991]: ******* RunEngine:
    ******* Product: c:\SSEE_10.msi
    ******* Action:
    ******* CommandLine: **********
    MSI (s) (34:E8) [03:05:16:991]: Machine policy value 'DisableUserInstalls' is 0
    MSI (s) (34:E8) [03:05:16:991]: File will have security applied from OpCode.
    MSI (s) (34:E8) [03:05:17:116]: SOFTWARE RESTRICTION POLICY: Verifying package -- 'c:\SSEE_10.msi' against software restriction policy
    MSI (s) (34:E8) [03:05:17:116]: SOFTWARE RESTRICTION POLICY: c:\SSEE_10.msi has a digital signature
    MSI (s) (34:E8) [03:05:22:382]: SOFTWARE RESTRICTION POLICY: c:\SSEE_10.msi is permitted to run at the 'unrestricted' authorization level.
    MSI (s) (34:E8) [03:05:22:382]: End dialog not enabled
    MSI (s) (34:E8) [03:05:22:382]: Original package == c:\SSEE_10.msi
    MSI (s) (34:E8) [03:05:22:382]: Package we're running from == c:\WINDOWS\Installer\1571bf.msi
    MSI (s) (34:E8) [03:05:22:382]: APPCOMPAT: looking for appcompat database entry with ProductCode '{CEB5780F-1A70-44A9-850F-DE6C4F6AA8FB}'.
    MSI (s) (34:E8) [03:05:22:382]: APPCOMPAT: no matching ProductCode found in database.
    MSI (s) (34:E8) [03:05:22:382]: MSCOREE not loaded loading copy from system32
    MSI (s) (34:E8) [03:05:22:382]: Machine policy value 'DisablePatch' is 0
    MSI (s) (34:E8) [03:05:22:382]: Machine policy value 'AllowLockdownPatch' is 0
    MSI (s) (34:E8) [03:05:22:382]: Machine policy value 'DisableLUAPatching' is 0
    MSI (s) (34:E8) [03:05:22:382]: Machine policy value 'DisableFlyWeightPatching' is 0
    MSI (s) (34:E8) [03:05:22:382]: APPCOMPAT: looking for appcompat database entry with ProductCode '{CEB5780F-1A70-44A9-850F-DE6C4F6AA8FB}'.
    MSI (s) (34:E8) [03:05:22:382]: APPCOMPAT: no matching ProductCode found in database.
    MSI (s) (34:E8) [03:05:22:382]: Transforms are not secure.
    MSI (s) (34:E8) [03:05:22:398]: Note: 1: 2205 2: 3: Control
    MSI (s) (34:E8) [03:05:22:398]: Command Line: CALLERID=OCSetup.exe REINSTALL=ALL REINSTALLMODE=omus REBOOT=ReallySupress CURRENTDIRECTORY=C:\ CLIENTUILEVEL=3 CLIENTPROCESSID=4788

    MSI (s) (34:E8) [03:05:22:398]: PROPERTY CHANGE: Adding PackageCode property. Its value is '{0C104883-8660-4A2C-96BB-C07CB7BFA321}'.
    MSI (s) (34:E8) [03:05:22:398]: Product Code passed to Engine.Initialize: ''
    MSI (s) (34:E8) [03:05:22:398]: Product Code from property table before transforms: '{CEB5780F-1A70-44A9-850F-DE6C4F6AA8FB}'
    MSI (s) (34:E8) [03:05:22:398]: Product Code from property table after transforms: '{CEB5780F-1A70-44A9-850F-DE6C4F6AA8FB}'
    MSI (s) (34:E8) [03:05:22:398]: Product registered: entering maintenance mode
    MSI (s) (34:E8) [03:05:22:398]: PROPERTY CHANGE: Adding ProductState property. Its value is '5'.
    MSI (s) (34:E8) [03:05:22:398]: PROPERTY CHANGE: Adding ProductToBeRegistered property. Its value is '1'.
    MSI (s) (34:E8) [03:05:22:398]: Entering CMsiConfigurationManager::SetLastUsedSource.
    MSI (s) (34:E8) [03:05:22:398]: Specifed source is not already in a list.
    MSI (s) (34:E8) [03:05:22:398]: User policy value 'SearchOrder' is 'nmu'
    MSI (s) (34:E8) [03:05:22:398]: Machine policy value 'DisableBrowse' is 0
    MSI (s) (34:E8) [03:05:22:398]: Machine policy value 'AllowLockdownBrowse' is 0
    MSI (s) (34:E8) [03:05:22:398]: Adding new sources is allowed.
    MSI (s) (34:E8) [03:05:22:398]: PROPERTY CHANGE: Adding PackagecodeChanging property. Its value is '1'.
    MSI (s) (34:E8) [03:05:22:398]: Note: 1: 1729
    MSI (s) (34:E8) [03:05:22:398]: Note: 1: 2729
    MSI (s) (34:E8) [03:05:22:398]: Note: 1: 2729
    MSI (s) (34:E8) [03:05:22:398]: Product: Windows Internal Database -- Configuration failed.
    MSI (s) (34:E8) [03:05:22:398]: MainEngineThread is returning 1638
    Another version of this product is already installed. Installation of this version cannot continue. To configure or remove the existing version of this product, use Add/Remove Programs on the Control Panel.
    {CEB5780F-1A70-44A9-850F-DE6C4F6AA8FB}
    MSI (c) (B4:C8) [03:05:22:507]: Decrementing counter to disable shutdown. If counter = 0, shutdown will be denied. Counter after decrement: -1
    MSI (c) (B4:C8) [03:05:22:507]: MainEngineThread is returning 1638
    === Verbose logging stopped: 17/05/2011 3:05:22 ===
    Any ideas? Thx!

    DB:2.68:Wsus 3.0 Sp2 Down After Demoting Domain Controller k3


    4. delete all files in C:\WINDOWS\SYSMSI\SSEE\MSSQL.2005\MSSQL\Data

    Why wouldyou destroy data when the solution does not require the destruction of data?Lawrence Garvin, M.S., MCITP:EA, MCDBA, MCSA
    Product Manager, SolarWinds
    Microsoft MVP - Software Distribution (2005-2012)
    My MVP Profile: http://mvp.support.microsoft.com/profile/Lawrence.Garvin

  • RELEVANCY SCORE 2.65

    DB:2.65:Why I Get Disconnected When I Try To Play Spade 9d


    I error message to open port

    DB:2.65:Why I Get Disconnected When I Try To Play Spade 9d

    Hi Salim,

    To provide the appropriate resolution, I would need more information from your end.
    1. Where are you playing Spade from?
    2. Which web browser are you using?
    3. What is the complete error message?
    4. Do you face any issue while playing other games?
    5. Which version of Operating System are you using?

    Refer to the article for more information on how to ask questions on help forums.

    Suggestions for asking a question on help forums:
    http://support.microsoft.com/kb/555375

    Please provide the necessary information to assist you further,
    I will be glad to help you.

  • RELEVANCY SCORE 2.62

    DB:2.62:Why Am I Getting A Web Page Error Message Out Of Memory At Line 993 sx


    I am running Internet Explorer 8 and I have Windows Vista 64-bit. I am not running a lot of programs at the same time, however I am receiving an error message every time I try to input information onto a government website of web page error: out of memory
    at lines 990, 991 993. Why is this occuring?

  • RELEVANCY SCORE 2.59

    DB:2.59:Java Error Message - Bad Version Number In .Class File 9d


    I get the error noted below in Safari, Firefox, and Chrome when I try to view java containing web pages.Specifically this page: http://aviationweather.gov/adds/tafs/java/My Java Preferences are as followsMy OS is 10.5.8Thanks!Java Plug-in 1.6.0_26Using JRE version 1.5.0_30-b03-389-9M3425 Java HotSpot(TM) Client VMUser home directory = /Users/ernest----------------------------------------------------c: clear console windowf: finalize objects on finalization queueg: garbage collecth: display this help messagel: dump classloader listm: print memory usageo: trigger loggingq: hide consoler: reload policy configurations: dump system and deployment propertiest: dump thread listv: dump thread stackx: clear classloader cache0-5: set trace level to n----------------------------------------------------java.lang.UnsupportedClassVersionError: Bad version number in .class file at java.lang.ClassLoader.defineClass1(Native Method) at java.lang.ClassLoader.defineClass(ClassLoader.java:676) at java.security.SecureClassLoader.defineClass(SecureClassLoader.java:124) at java.net.URLClassLoader.defineClass(URLClassLoader.java:260) at sun.reflect.NativeMethodAccessorImpl.invoke0(Native Method) at sun.reflect.NativeMethodAccessorImpl.invoke(NativeMethodAccessorImpl.java:39) at sun.reflect.DelegatingMethodAccessorImpl.invoke(DelegatingMethodAccessorImpl.ja va:25) at java.lang.reflect.Method.invoke(Method.java:592) at sun.plugin2.applet.Plugin2ClassLoader.defineClassHelper(Plugin2ClassLoader.java :1014) at sun.plugin2.applet.Plugin2ClassLoader.access$100(Plugin2ClassLoader.java:69) at sun.plugin2.applet.Plugin2ClassLoader$2.run(Plugin2ClassLoader.java:991) at java.security.AccessController.doPrivileged(Native Method) at sun.plugin2.applet.Plugin2ClassLoader.findClassHelper(Plugin2ClassLoader.java:9 55) at sun.plugin2.applet.Applet2ClassLoader.findClass(Applet2ClassLoader.java:134) at sun.plugin2.applet.Plugin2ClassLoader.loadClass0(Plugin2ClassLoader.java:250) at sun.plugin2.applet.Plugin2ClassLoader.loadClass(Plugin2ClassLoader.java:180) at sun.plugin2.applet.Plugin2ClassLoader.loadClass(Plugin2ClassLoader.java:161) at java.lang.ClassLoader.loadClass(ClassLoader.java:252) at sun.plugin2.applet.Plugin2ClassLoader.loadCode(Plugin2ClassLoader.java:675) at sun.plugin2.applet.Plugin2Manager.createApplet(Plugin2Manager.java:3046) at sun.plugin2.applet.Plugin2Manager$AppletExecutionRunnable.run(Plugin2Manager.ja va:1498) at java.lang.Thread.run(Thread.java:655)Exception: java.lang.UnsupportedClassVersionError: Bad version number in .class file

  • RELEVANCY SCORE 2.56

    DB:2.56:Keep Getting Disconnected From Ie 7z


    I keep getting disconnected from IE with this error message to follow. Internet Explorer has encountered a problem and needs to close. What do I need to do to be able to stay online. Thanks

    DB:2.56:Keep Getting Disconnected From Ie 7z

    Did you uninstall, reboot, reinstall ToonTowns?

    Bill



    ___________________________________________________________________Good judgement comes from experience, most of which came from bad judgement.

  • RELEVANCY SCORE 2.55

    DB:2.55:Wt41n0 Te Client Ssh Connection Error: Disconnected: No Supported Authentication Methods Available 3d



    The attached screenshot shows the SSH Client Fatal Error message from the title of this question.

    DB:2.55:Wt41n0 Te Client Ssh Connection Error: Disconnected: No Supported Authentication Methods Available 3d


    the status of the issue is OPEN.

    Delwyn is on all communucation emails in his case. 00827053

    Customer loads

    TE Client

    SSH Client

    already has SSH utility on PC.

    When the client connects initially, it warns the user about the security key, and after that the log shows SSH autologin user name and password.

    Then we see the error.

    I asked for SSH Server logs.

  • RELEVANCY SCORE 2.55

    DB:2.55:Error While Loading Rtf Template sa


    Hi All,
    We got the following errors while loading the RTF template.
    How can we rectify this ?

    Exception Details.
    oracle.apps.fnd.framework.OAException: oracle.apps.xdo.XDOException: String index out of range: 71
    at oracle.apps.fnd.framework.OAException.wrapperException(OAException.java:896)
    at oracle.apps.fnd.framework.OAException.wrapperException(OAException.java:870)
    at oracle.apps.fnd.framework.OAException.wrapperInvocationTargetException(OAException.java:993)
    at oracle.apps.fnd.framework.server.OAUtility.invokeMethod(OAUtility.java:211)
    at oracle.apps.fnd.framework.server.OAApplicationModuleImpl.invokeMethod(OAApplicationModuleImpl.java:720)
    at oracle.apps.xdo.oa.template.webui.TemplateFileAddCO.processFormRequest(TemplateFileAddCO.java:432)
    at oracle.apps.fnd.framework.webui.OAWebBeanHelper.processFormRequest(OAWebBeanHelper.java:813)
    at oracle.apps.fnd.framework.webui.OAWebBeanContainerHelper.processFormRequest(OAWebBeanContainerHelper.java:382)
    at oracle.apps.fnd.framework.webui.beans.layout.OALabeledFieldLayoutBean.processFormRequest(OALabeledFieldLayoutBean.java:373)
    at oracle.apps.fnd.framework.webui.OAWebBeanHelper.processFormRequestChildren(OAWebBeanHelper.java:1025)
    at oracle.apps.fnd.framework.webui.OAWebBeanHelper.processFormRequestChildren(OAWebBeanHelper.java:991)
    at oracle.apps.fnd.framework.webui.OAWebBeanHelper.processFormRequest(OAWebBeanHelper.java:846)
    at oracle.apps.fnd.framework.webui.OAWebBeanContainerHelper.processFormRequest(OAWebBeanContainerHelper.java:382)
    at oracle.apps.fnd.framework.webui.beans.layout.OAStackLayoutBean.processFormRequest(OAStackLayoutBean.java:370)
    at oracle.apps.fnd.framework.webui.OAWebBeanHelper.processFormRequestChildren(OAWebBeanHelper.java:1025)
    at oracle.apps.fnd.framework.webui.OAWebBeanHelper.processFormRequestChildren(OAWebBeanHelper.java:991)
    at oracle.apps.fnd.framework.webui.OAWebBeanHelper.processFormRequest(OAWebBeanHelper.java:846)
    at oracle.apps.fnd.framework.webui.OAWebBeanContainerHelper.processFormRequest(OAWebBeanContainerHelper.java:382)
    at oracle.apps.fnd.framework.webui.beans.layout.OAHeaderBean.processFormRequest(OAHeaderBean.java:408)
    at oracle.apps.fnd.framework.webui.OAWebBeanHelper.processFormRequestChildren(OAWebBeanHelper.java:1025)
    at oracle.apps.fnd.framework.webui.OAWebBeanHelper.processFormRequestChildren(OAWebBeanHelper.java:991)
    at oracle.apps.fnd.framework.webui.OAWebBeanHelper.processFormRequest(OAWebBeanHelper.java:846)
    at oracle.apps.fnd.framework.webui.OAWebBeanContainerHelper.processFormRequest(OAWebBeanContainerHelper.java:382)
    at oracle.apps.fnd.framework.webui.beans.layout.OAStackLayoutBean.processFormRequest(OAStackLayoutBean.java:370)
    at oracle.apps.fnd.framework.webui.OAWebBeanHelper.processFormRequestChildren(OAWebBeanHelper.java:1025)
    at oracle.apps.fnd.framework.webui.OAWebBeanHelper.processFormRequestChildren(OAWebBeanHelper.java:991)
    at oracle.apps.fnd.framework.webui.OAWebBeanHelper.processFormRequest(OAWebBeanHelper.java:846)
    at oracle.apps.fnd.framework.webui.OAWebBeanContainerHelper.processFormRequest(OAWebBeanContainerHelper.java:382)
    at oracle.apps.fnd.framework.webui.beans.layout.OAStackLayoutBean.processFormRequest(OAStackLayoutBean.java:370)
    at oracle.apps.fnd.framework.webui.OAWebBeanHelper.processFormRequestChildren(OAWebBeanHelper.java:1025)
    at oracle.apps.fnd.framework.webui.OAWebBeanHelper.processFormRequestChildren(OAWebBeanHelper.java:991)
    at oracle.apps.fnd.framework.webui.OAWebBeanHelper.processFormRequest(OAWebBeanHelper.java:846)
    at oracle.apps.fnd.framework.webui.OAWebBeanContainerHelper.processFormRequest(OAWebBeanContainerHelper.java:382)
    at oracle.apps.fnd.framework.webui.OAPageLayoutHelper.processFormRequest(OAPageLayoutHelper.java:1178)
    at oracle.apps.fnd.framework.webui.beans.layout.OAPageLayoutBean.processFormRequest(OAPageLayoutBean.java:1579)
    at oracle.apps.fnd.framework.webui.OAWebBeanHelper.processFormRequestChildren(OAWebBeanHelper.java:1025)
    at oracle.apps.fnd.framework.webui.OAWebBeanHelper.processFormRequestChildren(OAWebBeanHelper.java:991)
    at oracle.apps.fnd.framework.webui.OAWebBeanHelper.processFormRequest(OAWebBeanHelper.java:846)
    at oracle.apps.fnd.framework.webui.OAWebBeanContainerHelper.processFormRequest(OAWebBeanContainerHelper.java:382)
    at oracle.apps.fnd.framework.webui.beans.form.OAFormBean.processFormRequest(OAFormBean.java:395)
    at oracle.apps.fnd.framework.webui.OAWebBeanHelper.processFormRequestChildren(OAWebBeanHelper.java:1025)
    at oracle.apps.fnd.framework.webui.OAWebBeanHelper.processFormRequestChildren(OAWebBeanHelper.java:991)
    at oracle.apps.fnd.framework.webui.OAWebBeanHelper.processFormRequest(OAWebBeanHelper.java:846)
    at oracle.apps.fnd.framework.webui.OAWebBeanContainerHelper.processFormRequest(OAWebBeanContainerHelper.java:382)
    at oracle.apps.fnd.framework.webui.beans.OABodyBean.processFormRequest(OABodyBean.java:363)
    at oracle.apps.fnd.framework.webui.OAPageBean.processFormRequest(OAPageBean.java:2840)
    at oracle.apps.fnd.framework.webui.OAPageBean.preparePage(OAPageBean.java:1834)
    at oracle.apps.fnd.framework.webui.OAPageBean.preparePage(OAPageBean.java:532)
    at oracle.apps.fnd.framework.webui.OAPageBean.preparePage(OAPageBean.java:420)
    at OA.jspService(_OA.java:208)
    at com.orionserver.http.OrionHttpJspPage.service(OrionHttpJspPage.java:59)
    at oracle.jsp.runtimev2.JspPageTable.service(JspPageTable.java:416)
    at oracle.jsp.runtimev2.JspServlet.internalService(JspServlet.java:478)
    at oracle.jsp.runtimev2.JspServlet.service(JspServlet.java:401)
    at javax.servlet.http.HttpServlet.service(HttpServlet.java:856)
    at com.evermind.server.http.ResourceFilterChain.doFilter(ResourceFilterChain.java:64)
    at oracle.apps.jtf.base.session.ReleaseResFilter.doFilter(ReleaseResFilter.java:26)
    at com.evermind.server.http.EvermindFilterChain.doFilter(EvermindFilterChain.java:15)
    at oracle.apps.fnd.security.AppsServletFilter.doFilter(AppsServletFilter.java:318)
    at com.evermind.server.http.ServletRequestDispatcher.invoke(ServletRequestDispatcher.java:627)
    at com.evermind.server.http.ServletRequestDispatcher.forwardInternal(ServletRequestDispatcher.java:376)
    at com.evermind.server.http.HttpRequestHandler.doProcessRequest(HttpRequestHandler.java:870)
    at com.evermind.server.http.HttpRequestHandler.processRequest(HttpRequestHandler.java:451)
    at com.evermind.server.http.AJPRequestHandler.run(AJPRequestHandler.java:299)
    at com.evermind.server.http.AJPRequestHandler.run(AJPRequestHandler.java:187)
    at oracle.oc4j.network.ServerSocketReadHandler$SafeRunnable.run(ServerSocketReadHandler.java:260)
    at com.evermind.util.ReleasableResourcePooledExecutor$MyWorker.run(ReleasableResourcePooledExecutor.java:303)
    at java.lang.Thread.run(Thread.java:595)
    ## Detail 0 ##
    oracle.apps.xdo.XDOException: String index out of range: 71
    at oracle.apps.xdo.template.rtf.RTFParser.generate(RTFParser.java:156)
    at oracle.apps.xdo.template.rtf.RTF2XSLParser.generateXSL(RTF2XSLParser.java:295)
    at oracle.apps.xdo.oa.util.CoreHelper.runRtfParser(CoreHelper.java:130)
    at oracle.apps.xdo.oa.schema.server.TemplateHelper.addTemplateFile(TemplateHelper.java:2064)
    at oracle.apps.xdo.oa.template.server.TemplatesAMImpl.addTemplateFile(TemplatesAMImpl.java:658)
    at sun.reflect.NativeMethodAccessorImpl.invoke0(Native Method)
    at sun.reflect.NativeMethodAccessorImpl.invoke(NativeMethodAccessorImpl.java:39)
    at sun.reflect.DelegatingMethodAccessorImpl.invoke(DelegatingMethodAccessorImpl.java:25)
    at java.lang.reflect.Method.invoke(Method.java:585)
    at oracle.apps.fnd.framework.server.OAUtility.invokeMethod(OAUtility.java:190)
    at oracle.apps.fnd.framework.server.OAApplicationModuleImpl.invokeMethod(OAApplicationModuleImpl.java:720)
    at oracle.apps.xdo.oa.template.webui.TemplateFileAddCO.processFormRequest(TemplateFileAddCO.java:432)
    at oracle.apps.fnd.framework.webui.OAWebBeanHelper.processFormRequest(OAWebBeanHelper.java:813)
    at oracle.apps.fnd.framework.webui.OAWebBeanContainerHelper.processFormRequest(OAWebBeanContainerHelper.java:382)
    at oracle.apps.fnd.framework.webui.beans.layout.OALabeledFieldLayoutBean.processFormRequest(OALabeledFieldLayoutBean.java:373)
    at oracle.apps.fnd.framework.webui.OAWebBeanHelper.processFormRequestChildren(OAWebBeanHelper.java:1025)
    at oracle.apps.fnd.framework.webui.OAWebBeanHelper.processFormRequestChildren(OAWebBeanHelper.java:991)
    at oracle.apps.fnd.framework.webui.OAWebBeanHelper.processFormRequest(OAWebBeanHelper.java:846)
    at oracle.apps.fnd.framework.webui.OAWebBeanContainerHelper.processFormRequest(OAWebBeanContainerHelper.java:382)
    at oracle.apps.fnd.framework.webui.beans.layout.OAStackLayoutBean.processFormRequest(OAStackLayoutBean.java:370)
    at oracle.apps.fnd.framework.webui.OAWebBeanHelper.processFormRequestChildren(OAWebBeanHelper.java:1025)
    at oracle.apps.fnd.framework.webui.OAWebBeanHelper.processFormRequestChildren(OAWebBeanHelper.java:991)
    at oracle.apps.fnd.framework.webui.OAWebBeanHelper.processFormRequest(OAWebBeanHelper.java:846)
    at oracle.apps.fnd.framework.webui.OAWebBeanContainerHelper.processFormRequest(OAWebBeanContainerHelper.java:382)
    at oracle.apps.fnd.framework.webui.beans.layout.OAHeaderBean.processFormRequest(OAHeaderBean.java:408)
    at oracle.apps.fnd.framework.webui.OAWebBeanHelper.processFormRequestChildren(OAWebBeanHelper.java:1025)
    at oracle.apps.fnd.framework.webui.OAWebBeanHelper.processFormRequestChildren(OAWebBeanHelper.java:991)
    at oracle.apps.fnd.framework.webui.OAWebBeanHelper.processFormRequest(OAWebBeanHelper.java:846)
    at oracle.apps.fnd.framework.webui.OAWebBeanContainerHelper.processFormRequest(OAWebBeanContainerHelper.java:382)
    at oracle.apps.fnd.framework.webui.beans.layout.OAStackLayoutBean.processFormRequest(OAStackLayoutBean.java:370)
    at oracle.apps.fnd.framework.webui.OAWebBeanHelper.processFormRequestChildren(OAWebBeanHelper.java:1025)
    at oracle.apps.fnd.framework.webui.OAWebBeanHelper.processFormRequestChildren(OAWebBeanHelper.java:991)
    at oracle.apps.fnd.framework.webui.OAWebBeanHelper.processFormRequest(OAWebBeanHelper.java:846)
    at oracle.apps.fnd.framework.webui.OAWebBeanContainerHelper.processFormRequest(OAWebBeanContainerHelper.java:382)
    at oracle.apps.fnd.framework.webui.beans.layout.OAStackLayoutBean.processFormRequest(OAStackLayoutBean.java:370)
    at oracle.apps.fnd.framework.webui.OAWebBeanHelper.processFormRequestChildren(OAWebBeanHelper.java:1025)
    at oracle.apps.fnd.framework.webui.OAWebBeanHelper.processFormRequestChildren(OAWebBeanHelper.java:991)
    at oracle.apps.fnd.framework.webui.OAWebBeanHelper.processFormRequest(OAWebBeanHelper.java:846)
    at oracle.apps.fnd.framework.webui.OAWebBeanContainerHelper.processFormRequest(OAWebBeanContainerHelper.java:382)
    at oracle.apps.fnd.framework.webui.OAPageLayoutHelper.processFormRequest(OAPageLayoutHelper.java:1178)
    at oracle.apps.fnd.framework.webui.beans.layout.OAPageLayoutBean.processFormRequest(OAPageLayoutBean.java:1579)
    at oracle.apps.fnd.framework.webui.OAWebBeanHelper.processFormRequestChildren(OAWebBeanHelper.java:1025)
    at oracle.apps.fnd.framework.webui.OAWebBeanHelper.processFormRequestChildren(OAWebBeanHelper.java:991)
    at oracle.apps.fnd.framework.webui.OAWebBeanHelper.processFormRequest(OAWebBeanHelper.java:846)
    at oracle.apps.fnd.framework.webui.OAWebBeanContainerHelper.processFormRequest(OAWebBeanContainerHelper.java:382)
    at oracle.apps.fnd.framework.webui.beans.form.OAFormBean.processFormRequest(OAFormBean.java:395)
    at oracle.apps.fnd.framework.webui.OAWebBeanHelper.processFormRequestChildren(OAWebBeanHelper.java:1025)
    at oracle.apps.fnd.framework.webui.OAWebBeanHelper.processFormRequestChildren(OAWebBeanHelper.java:991)
    at oracle.apps.fnd.framework.webui.OAWebBeanHelper.processFormRequest(OAWebBeanHelper.java:846)
    at oracle.apps.fnd.framework.webui.OAWebBeanContainerHelper.processFormRequest(OAWebBeanContainerHelper.java:382)
    at oracle.apps.fnd.framework.webui.beans.OABodyBean.processFormRequest(OABodyBean.java:363)
    at oracle.apps.fnd.framework.webui.OAPageBean.processFormRequest(OAPageBean.java:2840)
    at oracle.apps.fnd.framework.webui.OAPageBean.preparePage(OAPageBean.java:1834)
    at oracle.apps.fnd.framework.webui.OAPageBean.preparePage(OAPageBean.java:532)
    at oracle.apps.fnd.framework.webui.OAPageBean.preparePage(OAPageBean.java:420)
    at OA.jspService(_OA.java:208)
    at com.orionserver.http.OrionHttpJspPage.service(OrionHttpJspPage.java:59)
    at oracle.jsp.runtimev2.JspPageTable.service(JspPageTable.java:416)
    at oracle.jsp.runtimev2.JspServlet.internalService(JspServlet.java:478)
    at oracle.jsp.runtimev2.JspServlet.service(JspServlet.java:401)
    at javax.servlet.http.HttpServlet.service(HttpServlet.java:856)
    at com.evermind.server.http.ResourceFilterChain.doFilter(ResourceFilterChain.java:64)
    at oracle.apps.jtf.base.session.ReleaseResFilter.doFilter(ReleaseResFilter.java:26)
    at com.evermind.server.http.EvermindFilterChain.doFilter(EvermindFilterChain.java:15)
    at oracle.apps.fnd.security.AppsServletFilter.doFilter(AppsServletFilter.java:318)
    at com.evermind.server.http.ServletRequestDispatcher.invoke(ServletRequestDispatcher.java:627)
    at com.evermind.server.http.ServletRequestDispatcher.forwardInternal(ServletRequestDispatcher.java:376)
    at com.evermind.server.http.HttpRequestHandler.doProcessRequest(HttpRequestHandler.java:870)
    at com.evermind.server.http.HttpRequestHandler.processRequest(HttpRequestHandler.java:451)
    at com.evermind.server.http.AJPRequestHandler.run(AJPRequestHandler.java:299)
    at com.evermind.server.http.AJPRequestHandler.run(AJPRequestHandler.java:187)
    at oracle.oc4j.network.ServerSocketReadHandler$SafeRunnable.run(ServerSocketReadHandler.java:260)
    at com.evermind.util.ReleasableResourcePooledExecutor$MyWorker.run(ReleasableResourcePooledExecutor.java:303)
    at java.lang.Thread.run(Thread.java:595)
    oracle.apps.xdo.XDOException: String index out of range: 71
    at oracle.apps.xdo.template.rtf.RTFParser.generate(RTFParser.java:156)
    at oracle.apps.xdo.template.rtf.RTF2XSLParser.generateXSL(RTF2XSLParser.java:295)
    at oracle.apps.xdo.oa.util.CoreHelper.runRtfParser(CoreHelper.java:130)
    at oracle.apps.xdo.oa.schema.server.TemplateHelper.addTemplateFile(TemplateHelper.java:2064)
    at oracle.apps.xdo.oa.template.server.TemplatesAMImpl.addTemplateFile(TemplatesAMImpl.java:658)
    at sun.reflect.NativeMethodAccessorImpl.invoke0(Native Method)
    at sun.reflect.NativeMethodAccessorImpl.invoke(NativeMethodAccessorImpl.java:39)
    at sun.reflect.DelegatingMethodAccessorImpl.invoke(DelegatingMethodAccessorImpl.java:25)
    at java.lang.reflect.Method.invoke(Method.java:585)
    at oracle.apps.fnd.framework.server.OAUtility.invokeMethod(OAUtility.java:190)
    at oracle.apps.fnd.framework.server.OAApplicationModuleImpl.invokeMethod(OAApplicationModuleImpl.java:720)
    at oracle.apps.xdo.oa.template.webui.TemplateFileAddCO.processFormRequest(TemplateFileAddCO.java:432)
    at oracle.apps.fnd.framework.webui.OAWebBeanHelper.processFormRequest(OAWebBeanHelper.java:813)
    at oracle.apps.fnd.framework.webui.OAWebBeanContainerHelper.processFormRequest(OAWebBeanContainerHelper.java:382)
    at oracle.apps.fnd.framework.webui.beans.layout.OALabeledFieldLayoutBean.processFormRequest(OALabeledFieldLayoutBean.java:373)
    at oracle.apps.fnd.framework.webui.OAWebBeanHelper.processFormRequestChildren(OAWebBeanHelper.java:1025)
    at oracle.apps.fnd.framework.webui.OAWebBeanHelper.processFormRequestChildren(OAWebBeanHelper.java:991)
    at oracle.apps.fnd.framework.webui.OAWebBeanHelper.processFormRequest(OAWebBeanHelper.java:846)
    at oracle.apps.fnd.framework.webui.OAWebBeanContainerHelper.processFormRequest(OAWebBeanContainerHelper.java:382)
    at oracle.apps.fnd.framework.webui.beans.layout.OAStackLayoutBean.processFormRequest(OAStackLayoutBean.java:370)
    at oracle.apps.fnd.framework.webui.OAWebBeanHelper.processFormRequestChildren(OAWebBeanHelper.java:1025)
    at oracle.apps.fnd.framework.webui.OAWebBeanHelper.processFormRequestChildren(OAWebBeanHelper.java:991)
    at oracle.apps.fnd.framework.webui.OAWebBeanHelper.processFormRequest(OAWebBeanHelper.java:846)
    at oracle.apps.fnd.framework.webui.OAWebBeanContainerHelper.processFormRequest(OAWebBeanContainerHelper.java:382)
    at oracle.apps.fnd.framework.webui.beans.layout.OAHeaderBean.processFormRequest(OAHeaderBean.java:408)
    at oracle.apps.fnd.framework.webui.OAWebBeanHelper.processFormRequestChildren(OAWebBeanHelper.java:1025)
    at oracle.apps.fnd.framework.webui.OAWebBeanHelper.processFormRequestChildren(OAWebBeanHelper.java:991)
    at oracle.apps.fnd.framework.webui.OAWebBeanHelper.processFormRequest(OAWebBeanHelper.java:846)
    at oracle.apps.fnd.framework.webui.OAWebBeanContainerHelper.processFormRequest(OAWebBeanContainerHelper.java:382)
    at oracle.apps.fnd.framework.webui.beans.layout.OAStackLayoutBean.processFormRequest(OAStackLayoutBean.java:370)
    at oracle.apps.fnd.framework.webui.OAWebBeanHelper.processFormRequestChildren(OAWebBeanHelper.java:1025)
    at oracle.apps.fnd.framework.webui.OAWebBeanHelper.processFormRequestChildren(OAWebBeanHelper.java:991)
    at oracle.apps.fnd.framework.webui.OAWebBeanHelper.processFormRequest(OAWebBeanHelper.java:846)
    at oracle.apps.fnd.framework.webui.OAWebBeanContainerHelper.processFormRequest(OAWebBeanContainerHelper.java:382)
    at oracle.apps.fnd.framework.webui.beans.layout.OAStackLayoutBean.processFormRequest(OAStackLayoutBean.java:370)
    at oracle.apps.fnd.framework.webui.OAWebBeanHelper.processFormRequestChildren(OAWebBeanHelper.java:1025)
    at oracle.apps.fnd.framework.webui.OAWebBeanHelper.processFormRequestChildren(OAWebBeanHelper.java:991)
    at oracle.apps.fnd.framework.webui.OAWebBeanHelper.processFormRequest(OAWebBeanHelper.java:846)
    at oracle.apps.fnd.framework.webui.OAWebBeanContainerHelper.processFormRequest(OAWebBeanContainerHelper.java:382)
    at oracle.apps.fnd.framework.webui.OAPageLayoutHelper.processFormRequest(OAPageLayoutHelper.java:1178)
    at oracle.apps.fnd.framework.webui.beans.layout.OAPageLayoutBean.processFormRequest(OAPageLayoutBean.java:1579)
    at oracle.apps.fnd.framework.webui.OAWebBeanHelper.processFormRequestChildren(OAWebBeanHelper.java:1025)
    at oracle.apps.fnd.framework.webui.OAWebBeanHelper.processFormRequestChildren(OAWebBeanHelper.java:991)
    at oracle.apps.fnd.framework.webui.OAWebBeanHelper.processFormRequest(OAWebBeanHelper.java:846)
    at oracle.apps.fnd.framework.webui.OAWebBeanContainerHelper.processFormRequest(OAWebBeanContainerHelper.java:382)
    at oracle.apps.fnd.framework.webui.beans.form.OAFormBean.processFormRequest(OAFormBean.java:395)
    at oracle.apps.fnd.framework.webui.OAWebBeanHelper.processFormRequestChildren(OAWebBeanHelper.java:1025)
    at oracle.apps.fnd.framework.webui.OAWebBeanHelper.processFormRequestChildren(OAWebBeanHelper.java:991)
    at oracle.apps.fnd.framework.webui.OAWebBeanHelper.processFormRequest(OAWebBeanHelper.java:846)
    at oracle.apps.fnd.framework.webui.OAWebBeanContainerHelper.processFormRequest(OAWebBeanContainerHelper.java:382)
    at oracle.apps.fnd.framework.webui.beans.OABodyBean.processFormRequest(OABodyBean.java:363)
    at oracle.apps.fnd.framework.webui.OAPageBean.processFormRequest(OAPageBean.java:2840)
    at oracle.apps.fnd.framework.webui.OAPageBean.preparePage(OAPageBean.java:1834)
    at oracle.apps.fnd.framework.webui.OAPageBean.preparePage(OAPageBean.java:532)
    at oracle.apps.fnd.framework.webui.OAPageBean.preparePage(OAPageBean.java:420)
    at OA.jspService(_OA.java:208)
    at com.orionserver.http.OrionHttpJspPage.service(OrionHttpJspPage.java:59)
    at oracle.jsp.runtimev2.JspPageTable.service(JspPageTable.java:416)
    at oracle.jsp.runtimev2.JspServlet.internalService(JspServlet.java:478)
    at oracle.jsp.runtimev2.JspServlet.service(JspServlet.java:401)
    at javax.servlet.http.HttpServlet.service(HttpServlet.java:856)
    at com.evermind.server.http.ResourceFilterChain.doFilter(ResourceFilterChain.java:64)
    at oracle.apps.jtf.base.session.ReleaseResFilter.doFilter(ReleaseResFilter.java:26)
    at com.evermind.server.http.EvermindFilterChain.doFilter(EvermindFilterChain.java:15)
    at oracle.apps.fnd.security.AppsServletFilter.doFilter(AppsServletFilter.java:318)
    at com.evermind.server.http.ServletRequestDispatcher.invoke(ServletRequestDispatcher.java:627)
    at com.evermind.server.http.ServletRequestDispatcher.forwardInternal(ServletRequestDispatcher.java:376)
    at com.evermind.server.http.HttpRequestHandler.doProcessRequest(HttpRequestHandler.java:870)
    at com.evermind.server.http.HttpRequestHandler.processRequest(HttpRequestHandler.java:451)
    at com.evermind.server.http.AJPRequestHandler.run(AJPRequestHandler.java:299)
    at com.evermind.server.http.AJPRequestHandler.run(AJPRequestHandler.java:187)
    at oracle.oc4j.network.ServerSocketReadHandler$SafeRunnable.run(ServerSocketReadHandler.java:260)
    at com.evermind.util.ReleasableResourcePooledExecutor$MyWorker.run(ReleasableResourcePooledExecutor.java:303)
    at java.lang.Thread.run(Thread.java:595)

    Thanks in Advance

    Regards,
    Sudeep

    DB:2.55:Error While Loading Rtf Template sa

    Hi Klaus,
    Thanks for your suggestion.We ran the template in word itself.We are able to track all the errors now.

    The following is the area where we are facing the error.

    ?xdoxslt:set_variable($_XDOCTX, 'Alloc_count1',1)?
    ?xdoxslt:set_variable($_XDOCTX, 'Payout')?
    ?xdoxslt:set_variable($_XDOCTX, 'Payout_Total')?
    For-each:G_11
    ?xdofx:if Alloc_count1ALLOCATION_EXAMPLE_COUNT then
    ?xdoxslt:set_variable($_XDOCTX, 'Payout',( N_RATE_FACTOR/100)*45000*(
    WEIGHTING/100) || '+')?
    ?xdoxslt:set_variable($_XDOCTX, 'Payout_Total',((
    N_RATE_FACTOR/100)*45000*( WEIGHTING/100))
    + Payout_Total)?
    else
    ?xdoxslt:set_variable($_XDOCTX, 'Payout',( N_RATE_FACTOR/100)*45000*(
    WEIGHTING/100) || 'or')?
    ?xdoxslt:set_variable($_XDOCTX, 'Payout_Total',((
    N_RATE_FACTOR/100) *45000*(WEIGHTING/100))+Payout_Total)?
    end if?

    ?xdoxslt:set_variable($_XDOCTX, 'Alloc_count1', xdoxslt:get_variable ($_XDOCTX, 'Alloc_count1') +1)?

    end G_11

    The following are the errors which we get when we run the RTF template in the word.

    [082207_113212414][][ERROR] [Line 1058.6] Missing end delimiter for token: ??xdoxslt:set_variable($_XDOCTX, 'Payout')?...
    [082207_113212414][][ERROR] [Line 1066.6] Missing end delimiter for token: ??xdofx:if Alloc_count1ALLOCATION_EXAMPLE_COUNT then...
    [082207_113212430][][ERROR] [Line 1070.6] Missing end delimiter for token: ??xdoxslt:set_variable($_XDOCTX, 'Payout',( N_RATE_FACTOR/100)*45000*( ...
    [082207_113212430][][ERROR] [Line 1070.162] Missing start delimiter for token: .../100) || '+')??
    [082207_113212430][][ERROR] [Line 1075.6] Missing end delimiter for token: ??xdoxslt:set_variable($_XDOCTX, 'Payout_Total',(( ...
    [082207_113212430][][ERROR] [Line 1082.6] Missing end delimiter for token: ??xdoxslt:set_variable($_XDOCTX, 'Payout',( N_RATE_FACTOR/100)*45000*( ...
    [082207_113212430][][ERROR] [Line 1083.6] Missing start delimiter for token: .../100) || 'or')??
    [082207_113212430][][ERROR] [Line 1086.6] Missing end delimiter for token: ??xdoxslt:set_variable($_XDOCTX, 'Payout_Total',(( N_RATE_FACTOR/100)*45000*( ...
    [082207_113212430][][ERROR] [Line 1087.6] Missing start delimiter for token: .../100))+Payout_Total)??
    [082207_113212430][][ERROR] [Line 1089.6] Missing start delimiter for token: ...end if??
    [082207_113212430][][ERROR] [Line 1092.6] Missing end delimiter for token: ??xdoxslt:set_variable($_XDOCTX, 'Alloc_count1', xdoxslt:get_variable($_XDOCTX, 'Alloc_count1') ...

    Thanks in Advance.
    Regards,
    Sudeep

  • RELEVANCY SCORE 2.54

    DB:2.54:Creating Jco Destionations For Planning mj



    Hello.

    when i'm trying to run tr. RSPLAN-start modeler in BI system i receive message in internet browser "Error while obtaining JCO connection".

    then i'm trying to create Jco destionaions (http:/host name:50100/webdynpro/dispatcher/sap.com/tcwdtools/Explorer)

    BI_METADATA

    BI_MODELDATA

    WD_ALV_METADATA_DEST

    WD_ALV_MODELDATA_DEST

    errors is appeared:

    bFailed to process request. Please contact your system administrator.

    The initial exception that caused the request to fail, was:

    java.lang.NullPointerException

    at com.sap.tc.webdynpro.serverimpl.wdc.sl.SystemLandscapeFactory.checkStatus(SystemLandscapeFactory.java:991)

    at com.sap.tc.webdynpro.services.sal.sl.api.WDSystemLandscape.checkStatus(WDSystemLandscape.java:469)

    at com.sap.tc.webdynpro.tools.sld.NameDefinition.updateJCODestinations(NameDefinition.java:285)

    at com.sap.tc.webdynpro.tools.sld.NameDefinition.updateNavigation(NameDefinition.java:250)

    at com.sap.tc.webdynpro.tools.sld.NameDefinition.wdDoInit(NameDefinition.java:157)

    ... 45 more

    /b

    Denis

    DB:2.54:Creating Jco Destionations For Planning mj


    Hello.

    when i'm trying to run tr. RSPLAN-start modeler in BI system i receive message in internet browser "Error while obtaining JCO connection".

    then i'm trying to create Jco destionaions (http:/host name:50100/webdynpro/dispatcher/sap.com/tcwdtools/Explorer)

    BI_METADATA

    BI_MODELDATA

    WD_ALV_METADATA_DEST

    WD_ALV_MODELDATA_DEST

    errors is appeared:

    bFailed to process request. Please contact your system administrator.

    The initial exception that caused the request to fail, was:

    java.lang.NullPointerException

    at com.sap.tc.webdynpro.serverimpl.wdc.sl.SystemLandscapeFactory.checkStatus(SystemLandscapeFactory.java:991)

    at com.sap.tc.webdynpro.services.sal.sl.api.WDSystemLandscape.checkStatus(WDSystemLandscape.java:469)

    at com.sap.tc.webdynpro.tools.sld.NameDefinition.updateJCODestinations(NameDefinition.java:285)

    at com.sap.tc.webdynpro.tools.sld.NameDefinition.updateNavigation(NameDefinition.java:250)

    at com.sap.tc.webdynpro.tools.sld.NameDefinition.wdDoInit(NameDefinition.java:157)

    ... 45 more

    /b

    Denis

  • RELEVANCY SCORE 2.54

    DB:2.54:Advance = Yes With Eor Gives No Warning/Error xj



    I think the snippet below should give at least a warning when compiled with standard warning is enabled since EOR cannot be specified for Advance == YES.

    I am using 11.1.038 on WinXP64 with VS2005.

    The command line for compilation is:

    /nologo /debug:full /Od /gen-interfaces /stand:f03 /warn:all /module:"Debug\" /object:"Debug\" /traceback /check:bounds /libs:static /threads /dbglibs /c

    Abhi

    ----

    Program Test_NoAdvance

    !
    ! Purpose: Test Advance = NO
    !

    Implicit None

    Integer, Parameter :: N = 5
    Real :: A(N), B
    Integer :: i

    Open(90, File='Input.dat', Form='Formatted', Status='Old')

    Rewind(90)

    Read(90,"(5(F4.1,1X))",ADVANCE='YES',ERR=990,END=991,EOR=992) (A(i), i=1,N)
    Read(90,*,ERR=995,END=996) B

    Close(90)

    990 Stop "ERR."
    991 Stop "END."
    992 Stop "EOR."

    995 Stop "ERR2."
    996 Stop "END2."

    End Program Test_NoAdvance

    DB:2.54:Advance = Yes With Eor Gives No Warning/Error xj


    Done in 15.0, though the diagnostic incorrectly mentions F90. I'll have that fixed.

  • RELEVANCY SCORE 2.54

    DB:2.54:Jco Connection Error k7



    Dear all,

    When i click the button "Create JCo Destination" in the Web Dynpro Content Administrator, i get the following error,

    please help me how to solve it, Thank you.

    Best wishes !

    java.lang.NullPointerException

    at com.sap.tc.webdynpro.serverimpl.wdc.sl.SystemLandscapeFactory.checkStatus(SystemLandscapeFactory.java:991)

    at com.sap.tc.webdynpro.services.sal.sl.api.WDSystemLandscape.checkStatus(WDSystemLandscape.java:469)

    at com.sap.tc.webdynpro.tools.sld.NameDefinition.updateJCODestinations(NameDefinition.java:286)

    at com.sap.tc.webdynpro.tools.sld.NameDefinition.updateNavigation(NameDefinition.java:251)

    at com.sap.tc.webdynpro.tools.sld.NameDefinition.wdDoInit(NameDefinition.java:158)

    ... 45 more

    DB:2.54:Jco Connection Error k7


    Hi Aaron

    As said in above response. :--

    Please update the host and service in the server desktop location.

    - Check the SLD status whether properly configured or not and SLD Data supplier in visual administration

    - Check the JCO pointing to correct SLD which you have configured.

    - Ping the SLD and server from desktop with correct URL

    Refer to [System Landscape Directory Process and JCo Configuration|http://www.sdn.sap.com/irj/scn/go/portal/prtroot/docs/library/uuid/c0c1d495-048e-2b10-babd-924a136f56b5?QuickLink=indexoverridelayout=true]

    Hope it will helps

    Regards

    Arun Jaiswal

  • RELEVANCY SCORE 2.54

    DB:2.54:Error?! xd


    i keep getting: Network error The connection to the server was lost C-991.what does this mean?



    Are You Ready?!

    DB:2.54:Error?! xd

    DARN!!! All excited then an error. Looks like we'll have to wait it out again. Got to hand it to them, they did release it today.



  • RELEVANCY SCORE 2.53

    DB:2.53:Now If Only I Could Connect mm



    "Network Error, the Connection to the Server was lost, C-991"

    Aw man

  • RELEVANCY SCORE 2.53

    DB:2.53:Duration Of Put Into Azure Coudqueue 1s


    Hello,

    we measuered the speed of Put Actions into the Azure Cloud Queue using the following code:
    var message = new CloudQueueMessage(String.Format(Message [{0}] at {1}, item, DateTime.Now).PadRight(MessageLength, '#'));
    var sw = Stopwatch.StartNew();
    WriteQueue.PutMessage(message);
    sw.Stop();
    Console.WriteLine(Message [{0}] Duration [{1}] ms [{2}] [{3}] byte, item, sw.ElapsedMilliseconds, test, message.AsBytes.Length);
    the interisting thing is what happens:
    Message [#0097] Duration [38] ms [Thread #7] [991] byte
    Message [#0096] Duration [57] ms [Thread #8] [991] byte
    Message [#0098] Duration [17] ms [Thread #7] [991] byte
    Message [#0099] Duration [57] ms [Thread #1] [991] byte
    Message [#0100] Duration [15] ms [Thread #1] [991] byte
    and
    Message [#0047] Duration [399] ms [Thread #17] [990] byte
    Message [#0046] Duration [597] ms [Thread #20] [990] byte
    Message [#0045] Duration [399] ms [Thread #15] [990] byte
    Message [#0049] Duration [598] ms [Thread #1] [990] byte
    Message [#0048] Duration [396] ms [Thread #17] [990] byte
    Message [#0050] Duration [195] ms [Thread #1] [990] byte
    can anybody explain why it takes so much longer to insert Strings of Length 990 than inserting LONGER Strings of length 991?

    Thanks to parallelization using LINQ we were able to insert 100 messages per second of 6000 byte but from one application but we were not able to get this speed with short messages.

    Dan Danneberg

    DB:2.53:Duration Of Put Into Azure Coudqueue 1s

    Thanks a lot. This helped.
    Additionally now we hav increased the number of parallel TCP sessions allowing us more traffic as written in

    this article.
    CloudStorageAccount cloudStorageAccount = CloudStorageAccount.Parse(connectionString);

    ServicePoint queueServicePoint = ServicePointManager.FindServicePoint(cloudStorageAccount.QueueEndpoint);
    queueServicePoint.UseNagleAlgorithm = false;
    queueServicePoint.ConnectionLimit = 32;

    CloudQueueClient qs = cloudStorageAccount.CreateCloudQueueClient();

    queue = qs.GetQueueReference(queueName);

    Console.WriteLine(Connection esteblished.);

    This code now alloes us to send without any problem 500 Messages per second from an application.
    Dan Danneberg

  • RELEVANCY SCORE 2.52

    DB:2.52:Update Sync kp


    I downloaded the update and during "backing up iphone" I get an error message saying "itunes couldn't sync because the phone was disconnected", of course the phone is not disconnected and I was also able to sync some new songs on it after I got the message. any thoughts on the problem/solution? Thanks.

    P

    DB:2.52:Update Sync kp

    Thanks. I tried that but the same thing happened. and when I get the error message the phone automatically resets itself. Its the weirdest thing.

  • RELEVANCY SCORE 2.52

    DB:2.52:Error Message From Pc Suite When Starting Computer Disconnected pj



    Hello!

    When I start my computer and it is not connected to the Internet I get an error message.

    How can I avoid this?

    System:

    Windows 7 64bit.

    PC Suite 6.0

    Regards Abbe

    DB:2.52:Error Message From Pc Suite When Starting Computer Disconnected pj


    SE website is not written support WIN 7? Is your computer system problems, let's see the closure or disabling antivirus software or firewall. Whether installation has other brands Suite software?

    System requirements
    Windows XP Home, Pro, Media Center (SP3) Windows Vista 32 64 bits Ultimate, Enterprise, Business, Home Premium and Home Basic (With or without SP1) Windows 7 Pentium II - 233 MHz or more Windows XP: 128 MB RAM Windows Vista: 512 MB RAM 50 MB of hard drive space Any of the following connections that are applicable for your phone: USB Cable, Infrared or Bluetooth connection.

  • RELEVANCY SCORE 2.51

    DB:2.51:The Connection To The Remote Computer Has Got Disconnected - Error 1028 zj


    Any idea about this error message : Error 1028

    DB:2.51:The Connection To The Remote Computer Has Got Disconnected - Error 1028 zj

    This happens while the users are trying to connect to a VM.

    They are using a VDM environment either through a web server or directly using the wswc.exe file inside C:\Program Files\VMware\VMware VDM\Client\bin\wswc.exe file. While they are connecting to a desktop they are getting this message. "The connection to the remote computer has got disconnected"

    Other context : while working with inside the VDI with some intense applications like, a high graphic applications, users are getting this message.

  • RELEVANCY SCORE 2.50

    DB:2.50:Get The Imsi Number Without Disconnected The Modem f3


    HI

    my question is how can i connect and disconnect my usb 3G modem automatically in c#;
    because I want to get the IMSI number of my 3G modem SIM Card, but when the modem has the status connected I can't acceded
    into it, and I get a port message error.

    Best regards
    Yassine

  • RELEVANCY SCORE 2.50

    DB:2.50:Bug: Not Able To Access Summer House xj



    Hey Ted,

    There is a bug, no one can access their Summer House. I don't know about other apartments, but I only tried my Summer House.

    I get a C-991 Error, then you get stuck in your Apartment and everytime you log in you log back out with the C-991 Error.

    DB:2.50:Bug: Not Able To Access Summer House xj

    I'm also having this problem.



    (\__/)(='.'=)(")_(")

  • RELEVANCY SCORE 2.50

    DB:2.50:Error While Canceling Print: Startdocprinter Call Was Not Issued zz


    I am using a print dialog to print a document. If the document is like 14-15 pages, the processing is slow enough that I can cancel the printjob while its building the pages. However, when I click cancel on the window that appears following the OK button on the PrintDialog (the same window that counts Printing Page 1, 2, 3, ...), the application just hangs and crashes. In VS2005 I get the error shown following my code:         private void btnPrintLabels_Click(object sender, EventArgs e)        {            try            {                iRegistrantCountForPrint = 0;                this.arrRegistrantsInDBForPrint = Form1.dbHandle.GetAllRegistrants(iEventID);                // Show Page Setup Dialog                PageSetupDialog psDlg = new PageSetupDialog();                PageSettings storedPageSettings = new PageSettings();                psDlg.PageSettings = storedPageSettings;                DialogResult PageSetupDialogResult = psDlg.ShowDialog();                if (storedPageSettings != null)                    printDocument1.DefaultPageSettings = storedPageSettings;                // If user didn't cancel out of Page Setup, continue with preview                if (PageSetupDialogResult != DialogResult.Cancel)                {                    // Show Print Dialog                    printDialog1.AllowSomePages = true;                    printDialog1.Document = this.printDocument1;                    DialogResult result = printDialog1.ShowDialog();                    // If the result is OK then print the document.                    if (result == DialogResult.OK)                    {                        // Get the pages to print                        if (printDocument1.PrinterSettings.PrintRange == PrintRange.SomePages)                        {                            _minPageNumber = printDialog1.PrinterSettings.FromPage;                            _maxPageNumber = printDialog1.PrinterSettings.ToPage;                        }                        else                        {                            _minPageNumber = 1;                            _maxPageNumber = (arrRegistrantsInDBForPrint.Count / 8);                            if (!(arrRegistrantsInDBForPrint.Count % 8 == 0))                                _maxPageNumber++;                        }                        Thread t = new Thread(new ThreadStart(PrintInBackground));                        t.IsBackground = true;                        t.Start();                    }                }            }            catch (Exception ex)            {                log.Info(ex.ToString());            }        }        private void PrintInBackground()        {            this.printDocument1.Print();            /*            try            {                this.printDocument1.Print();            }            catch (Exception ex)            {                log.Info(ex.ToString());            }            finally            {                _minPageNumber = 1;                _maxPageNumber = (arrRegistrantsInDBForPrint.Count / 8);                if (!(arrRegistrantsInDBForPrint.Count % 8 == 0))                    _maxPageNumber++;                _currentPageNumber = 1;            }             * */        }Even if I put a try/catch clause around the print command inside PrintInBackground, I still get the same behaviour. Here is the error. System.ComponentModel.Win32Exception was unhandled  Message=A StartDocPrinter call was not issued  Source=System.Drawing  ErrorCode=-2147467259  NativeErrorCode=3003  StackTrace:       at System.Drawing.Printing.StandardPrintController.OnEndPrint(PrintDocument document, PrintEventArgs e)       at System.Windows.Forms.PrintControllerWithStatusDialog.OnEndPrint(PrintDocument document, PrintEventArgs e)       at System.Drawing.Printing.PrintController.Print(PrintDocument document)       at System.Drawing.Printing.PrintDocument.Print()       at IMEventManager.FormEvent.PrintInBackground() in C:\Documents and Settings\AsKhan\My Documents\Visual Studio 2005\Projects\IMEventManager\IMEventManager\FormEvent.cs:line 991       at System.Threading.ThreadHelper.ThreadStart_Context(Object state)       at System.Threading.ExecutionContext.Run(ExecutionContext executionContext, ContextCallback callback, Object state)       at System.Threading.ThreadHelper.ThreadStart()

    DB:2.50:Error While Canceling Print: Startdocprinter Call Was Not Issued zz

    Hello, I'm having the same problem printing from SSRS BIDS 2005. Did you ever find a solution to the problem?
    Thanks,

  • RELEVANCY SCORE 2.49

    DB:2.49:Erreur C-991 Incessantes ja



    Bonsoir...

    Je vais éssayer de faire court, c'est la 3ème fois que je tente de me rendre à un de mes appartement, c'est la 3eme fois que j'ai une érreur C-991.

    C'est qui, qui a trébuché sur un câble cette fois ?

    Apparemment, il n'y a pas que moi dans ce cas

    J'ouvre le topic, comme ça d'autres pourront cracher leurs haines à ma place

    Ah... Et une M-10 qui vient d'arriver

    DB:2.49:Erreur C-991 Incessantes ja


    Arrête de me parler, ils risqueraient de croire qu'ils assistent à un monologue

  • RELEVANCY SCORE 2.49

    DB:2.49:Playstation Home C-991 Error Theory jm


    To be honest, I think they're still doing a server check. They might even have to do a PSN update, since it doesn't say anything on the Information Board. Plus, there must be too many people trying to go online at once, so let's try waiting for a bit. What do you think?

    DB:2.49:Playstation Home C-991 Error Theory jm

    and to think i was going to actually buy something from the mall... guess again sony who is gonna buy something they cant even login to use or showoff



  • RELEVANCY SCORE 2.48

    DB:2.48:All The Records Not Replicated On Destination Site sp


    I am setting up stream replication from solaris to linux. in my set up I inserted 1000 records at source and it just replicated 991 records, there is no error message in dba_apply/dba_capture/dba_propagation. what could be the problem. I did it again it worked fine.

  • RELEVANCY SCORE 2.48

    DB:2.48:Jabber Video Runtime Error 9z



    I have installed Jabber Video, and was running my first video conference and Jabber crashed and disconnected the conference.

    Error message:

    Runtime Error!                  

    Program: C:\Program Files\Cisco\JabberVideo\JabberVideo.exe

    This application has requested the Runtime to terminate it in an unsual way.

    Please contact the application's support team for more information.

    What can I check for the possible cause of this major issue? I cannot run video conferences without any confidence the conference will be shut down.  Thanks, Raylene

    DB:2.48:Jabber Video Runtime Error 9z


    I have installed Jabber Video, and was running my first video conference and Jabber crashed and disconnected the conference.

    Error message:

    Runtime Error!                  

    Program: C:\Program Files\Cisco\JabberVideo\JabberVideo.exe

    This application has requested the Runtime to terminate it in an unsual way.

    Please contact the application's support team for more information.

    What can I check for the possible cause of this major issue? I cannot run video conferences without any confidence the conference will be shut down.  Thanks, Raylene

  • RELEVANCY SCORE 2.48

    DB:2.48:Error Message "Hp Officejet J4500 Disconnected" 3k



    After repeated uninstalls and re-installs of my HP Officejet J4580 All-in-One on Windows 7 Professional, I continue to get the above error message. This happened after a recent re-install of the operating system because of a crash. Functionality seems to be ok but the error message won't go away.

    DB:2.48:Error Message "Hp Officejet J4500 Disconnected" 3k


    After repeated uninstalls and re-installs of my HP Officejet J4580 All-in-One on Windows 7 Professional, I continue to get the above error message. This happened after a recent re-install of the operating system because of a crash. Functionality seems to be ok but the error message won't go away.

  • RELEVANCY SCORE 2.47

    DB:2.47:Printer Disconnected Error j9


    I am testing windows 7RC. Though I installed printer driver(showing in control panel) and software for my HP printer when I start HP solution center printer disconnected message appears eventhough the printer is connected and power on while there is no
    such problem in XP. How can I get around the problem? Checked with HP support but they are helpless regarding windows 7

    DB:2.47:Printer Disconnected Error j9

    I just finished performing a 'clean install' of the official relase version (downloaded early today from MSDN Downloads) Windows 7 Ultimate 64-bit side-by-side (dual boot) with Vista Ultimate 32-bit. Before I installed any HP-supplied software, Windows
    7 was able to discover my HP J6480 All-in-One device on my wireless 802.11g network. It even properly performed a Windows 'Print Test Page' operation.

    Next, I pulled down the HP software for my printer (version 4.51) and tried to install it. It failed, so I searched the internet and found that if I first right-clicked on the install EXE and choose Vista SP2 compatibility mode, it would install.

    However, upon launching of HP Solution Center, it always says 'HP OfficeJect J6400 series Disconnected' at the top. I also notice that Windows 7 thinks there are two HP J6480 printers and one HP J6480 fax. The second printer, the one I presume was installed
    via the HP-supplied software, is now the Default Printer.

    I am able to scan picturesand print simple,basic stuff (haven't tried anything fancy), so it would appear that the 'error message' is just a cosmetic glitch.

    During a 'HP Chat' session, the person I was chatting with said that HP would not have 'drivers' (odd, I was trying to talk to her about HP Solution Center, not drivers) until later this year.

    For now, if I don't want to see what is apparently a bogus error message,I always have the fall-back solution of using Vista Ultimate 32-bit, which has zero problems with the AIO device.

    So long as I can print and scan (don't really need to fax) on my J6480, I can't say I'm all that bothered by the fact that HP Solution Center cannot seem to properly determine the connectivity of my AIO device.

    If you think development is tough now, try doing it on punched cards :-)

  • RELEVANCY SCORE 2.47

    DB:2.47:Getting Error 991 When Trying To Install Browser. What Does This Mean? 89



    Toshiba AT100 tablet
    Android version 4.0

    DB:2.47:Getting Error 991 When Trying To Install Browser. What Does This Mean? 89



    From http://forum.xda-developers.com/showthread.php?t=2733038

    Error 911:

    App could not be downloaded due to an error 911

    Solution:

    Method 1: Clear the Google Play store data

    Go to Settings Manage Applications or Apps Open “All” tab
    From the list of “All” apps Scroll Down and Select “Play Store” Select Force stop, Clear cache and Clear data

    Method 2: If you are using a wifi connection that requires a webpage login, then your authentication has probably expired. Log in to the APN again via your android browser. Open Google Play store and run the app update again . If that didn’t work the problem is with the wifi network itself.

    Method 3: Simply switch to another Wifi network and run the update. The error 911 should disappear for the new Wifi network.

    Method 4: Use your mobile network data services instead of wifi. Turn wifi off and then turn your data on and now open your Google Play Store and download/update your apps or games. However, this method is only suited for apps and games that are small sized. For larger updates you should use your wifi network to save data charge.

  • RELEVANCY SCORE 2.47

    DB:2.47:Timeout Problem sa


    I'm running into some kind of time out during a C program which use OCI.

    My version Info is as follows:
    OS - IBM z/OS: 1.3
    DB - Oracle Client: 9.2.0.4.21
    Language - C (using OCI libraries)

    The errror message I'm receiving is...

    15.26.51 JOB08696 BPXP013I THREAD 10C5190000000000, IN PROCESS 83886443, WAS 990
    990 TERMINATED BY SIGNAL SIGXCPU, DUE TO CPU TIME OUT.
    15.26.51 JOB08696 IEF450I C1DF01DQ DQBUSAGE - ABEND=SEC6 U0000 REASON=0000FD1D 991
    991 TIME=15.26.51

    The QuickRef explanation of SEC6 is as follows:
    An error occurred during processing of a callable service to z/OS UNIX System Services (z/OS UNIX). The callable service may have been originally issued as a function in a program or as a shell command.

    FDxx Terminating signal with dump.

    (The reason code is FD1D, which is in hex. I found this equate for the 0x1D (decimal 29) in one of the z/OS Unix manuals: SIGXCPU# EQU 29 CPU time limit exceeded)

    I didn't want to include my full program here, because only the first part really deals with Oracle. I'm basically connecting to oracle, performing some SELECTs and writing the results to a file. After all results are retrieved I disconnect from Oracle and continue with the main processing that needs to be done. For short runs I have no problems, everything runs fine, but for longer runs (and it generally seems to be after about 3 hours) I get a time out error message. The weird part (at least to me anyway) is that this happens after all of the Oracle calls have been processed and I've disconnected?!? The portion of the code that deals with Oracle (connect, select, write results, disconnect) executes very quickly and is a very small portion of the overall execution time (i.e. the processing I'm doing with the results from Oracle is the bulk of the execution time). Why after disconnecting am I still timing out?

    Here is a brief overview of what my program does. (if you interested in the full source let me know). I'm checking all return codes from the OCI function calls as well, but left that out of this overview...

    Begin Program
    Initialize using OCIEnvCreate()
    Allocate Error Handle
    Connect using OCILogon()

    Loop to perform x Number of SELECTs
    Allocate Statement handle
    Call OCIStmtPrepare
    Perform a series of Binds/Defines
    Call OCIStmtExecute()
    Call OCIStmtFetch2()
    Writes results to a file (continuing to call OCIStmtFetch2() until no more data)
    Free Statement handle
    End Loop

    Call OCILogoff
    Free Error Handle
    Free Environment Handle

    Loop to process x Number of results files
    ...
    End Loop
    End Program

    DB:2.47:Timeout Problem sa

    This is not an Oracle problem. It sounds like your program is exceeding process resource limits set in the OS, specifically the max amount of CPU that a process can consume. If the soft limit is exceeded, a SIGXCPU signal is sent to the program. If you program does not handle this signal, then the process is killed with the SEC6 abend, reason code FD1D that you are seeing.

  • RELEVANCY SCORE 2.47

    DB:2.47:Get The Imsi Number Without Disconnected The Modem mm


    HI

    my question is how can i connect and disconnect my usb 3G modem automatically in c#;
    because I want to get the IMSI number of my 3G modem SIM Card, but when the modem has the status connected I can't acceded
    into it, and I get a port message error.

    Best regards
    Yassine

    DB:2.47:Get The Imsi Number Without Disconnected The Modem mm

    Yes I use a desktop application, can you please give me more details on IMbnSubscriberInformation !
    and it's possible to get the Manufacturer or IMEi number of my Modem.

  • RELEVANCY SCORE 2.47

    DB:2.47:Usb Daq Card(6509) Disconnected Automatically mf



    Hi,

    I am working with USB6509 DAQ card.

    it works fine some time after that i will be disconnected automatically.

    when i try to reset the card it gives below message.

    how to fix this problem.

    i attached error message screen shot.

    thank you,

    Regards,

    hari










    Attachments:







    Image 1.png ‏430 KB

    DB:2.47:Usb Daq Card(6509) Disconnected Automatically mf


    Hi,

    I am working with USB6509 DAQ card.

    it works fine some time after that i will be disconnected automatically.

    when i try to reset the card it gives below message.

    how to fix this problem.

    i attached error message screen shot.

    thank you,

    Regards,

    hari










    Attachments:







    Image 1.png ‏430 KB

  • RELEVANCY SCORE 2.46

    DB:2.46:Itunes Could Not Back Up The Iphone, The Iphone Disconnected sa


    When backing up my iPhone 4S to my computer I get this error message, iTunes could not back up the iPhone as the iPhone disconnected. Have tried a few things but still get the same error message.Anyone help me. ?Thank YouAl

    DB:2.46:Itunes Could Not Back Up The Iphone, The Iphone Disconnected sa

    When backing up my iPhone 4S to my computer I get this error message, iTunes could not back up the iPhone as the iPhone disconnected. Have tried a few things but still get the same error message.Anyone help me. ?Thank YouAl

  • RELEVANCY SCORE 2.46

    DB:2.46:Home "Error" Message C-931 C-991 Needs Urgent Attention Sony!!!! 1m



    Hi people i live in the UK and im getting the error message. Now i downloaded Home software at start and it installed but as i get to sign in at the Home screen it says its loseing connection to server and this is the resulting error message.

    Now as for this open beta i am not impressed by it at all at the moment as i can't even get into Home itself because of error. Sony sort this mess out urgently as not impressed so far from the Home experience.

    DB:2.46:Home "Error" Message C-931 C-991 Needs Urgent Attention Sony!!!! 1m


    me 2 getting network error the connection to the server was losr c-931

  • RELEVANCY SCORE 2.46

    DB:2.46:8510 Mcu Error - Disconnected By Mse ff



    We have some 8510 MCUs, when you’re logged into one, and viewing active conferences, you can see a list of current participants, as well as participants who disconnected, along with how they disconnected.  What I’ve seen related to the audio is the outdial to our third party voice conference supplier, with a disconnect message of “disconnected by MSE”. The third party voice conference supplier has confirmed that they don’t see the calls dropping from their side, and the drop must be coming from our end.

    What causes the “disconnected by MSE” message, as this is something I've tried to research, but nothing obvious comes up?

    DB:2.46:8510 Mcu Error - Disconnected By Mse ff


    We have some 8510 MCUs, when you’re logged into one, and viewing active conferences, you can see a list of current participants, as well as participants who disconnected, along with how they disconnected.  What I’ve seen related to the audio is the outdial to our third party voice conference supplier, with a disconnect message of “disconnected by MSE”. The third party voice conference supplier has confirmed that they don’t see the calls dropping from their side, and the drop must be coming from our end.

    What causes the “disconnected by MSE” message, as this is something I've tried to research, but nothing obvious comes up?

  • RELEVANCY SCORE 2.46

    DB:2.46:Join Using The Same Table sk



    Hi BO Gurus,

    I am starting using Business Objects

    I am using Information Design Tool and i need to create a join using the same table.

    I have a table with the following lines

    Field1 Field2 Fielf3

    991 HR1

    992 SUP HR1

    I need a result like this:

    991 HR1 SUP 992

    How can i obtain that in a report?

    I tryed to create an alias or a derivate table but i get the message.

    This connection supports only detection based on database keys.

    Can someone give some advices for this question?

    Thank you and best regards

    Joo Lages Fernandes

    DB:2.46:Join Using The Same Table sk


    I have only ever connected to Microsoft SQL Server. Could you create a view in the database that joins back to itself and then reference that view in the Information Design Tool.

    Noel

  • RELEVANCY SCORE 2.45

    DB:2.45:Error Message When Not Connected c3


    Kind of a quick question with EmailXtender (without User Cache):If a user is disconnected from the network and therefore has no access to the Exchange server, what archived messages can he still access:a. the old archived messages before he disconnected, orb. all archived messages (before and after he disconnected)and what error message will be sent to the outlook client if archived messages cannot be retrieved?Thanks

    DB:2.45:Error Message When Not Connected c3

    Archived messages are mail items that have been ingested by emailxtender and resides in the archive. This happens if real-time journaling is enabled, and/or when you run an Extract task (Archive/Shortcut).A Shortcut task (via Extract) archives the mail first, and then shortcuts the message. Essentially, an EX shortcut is an archived mail that has been moved from the exchange server, and resides on the EX server until it is restored.~Chris

  • RELEVANCY SCORE 2.45

    DB:2.45:Ora-03113 Sqlstate=08s01 At Sqldisconnect() ad


    Dear All,
    My application is developed in C++. It does not need to be restarted when network to database server is disconnected or oracle database is shut down because it can retry connecting to oracle database after network is reconnected or oracle database is restarted up.
    However, after the application is shut down, an error log message appears when the SQLDisconnect(hpHdbc) is executed like below:
    "SQLDisconnect() SQLSTATE=08S01 ERROR=[Oracle][ODBC][Ora]ORA-03113:
    end-of-file on communication channel"
    Error log information is also registed in alert.log file of oracle.
    Is there any way to solve the error at reconnecting database in order to avoid getting the error log message after shuting down the application? (Can I modify my application's program to avoid getting the error log message?)
    Thank you in advance!
    Phat

    DB:2.45:Ora-03113 Sqlstate=08s01 At Sqldisconnect() ad

    Dear All,
    My application is developed in C++. It does not need to be restarted when network to database server is disconnected or oracle database is shut down because it can retry connecting to oracle database after network is reconnected or oracle database is restarted up.
    However, after the application is shut down, an error log message appears when the SQLDisconnect(hpHdbc) is executed like below:
    "SQLDisconnect() SQLSTATE=08S01 ERROR=[Oracle][ODBC][Ora]ORA-03113:
    end-of-file on communication channel"
    Error log information is also registed in alert.log file of oracle.
    Is there any way to solve the error at reconnecting database in order to avoid getting the error log message after shuting down the application? (Can I modify my application's program to avoid getting the error log message?)
    Thank you in advance!
    Phat

  • RELEVANCY SCORE 2.45

    DB:2.45:Ical Sync Doesn't Work 83


    When I try to sync ical to my iphone it gives me an error message that it could not sync to my iphone b/c the iphone disconnected. Of course, it is not disconnected. I use Palm Desktop but converted it to a Vcal format before I tried the sync. I have the most recent version of itunes. Any ideas?

    DB:2.45:Ical Sync Doesn't Work 83

    The reason for the itunes throwing an error of the iphone being disconnected when trying to sync ical, is that the iphone does not like one or more of your events.

    One way to find out which one it is:
    1. instead of syncing all your calendars at once, try syncing one calendar at a time.
    2. when you come across the offending calendar, try setting the feature to not sync anything older than 7 days.
    4. If it still does not work, create a new calendar in ical, call it iphone or something
    5. sync the iphone to that blank calendar replacing all calendar data
    6. create a test event on the iphone and a test event in ical in the test calendar and sync the iphone. This makes sure that ical and the iphone are syncing both ways
    7. start moving a few of your events from the offending calendar to the test calendar and sync the iphone
    8. keep repeating step 7 until you get the error message that the iphone was not connected.

    This way you can narrow down the event or event's that are causing the iphone to disconnect.

  • RELEVANCY SCORE 2.44

    DB:2.44:Ora-08103: Object No Longer Exists Error. Please Help 73



    Hi Everyone,

    I triggered a informatica mapping through DAC.

    The mapping failed with the above error. But when i run it the second time it succeeds ( A mystery ). I want to find the root cause for this.

    Message Code RR_4035

    Message: SQL Error [

    ORA-08103: object no longer exists

    ERROR: Prepare Failed

    (In the disconnected lookup SQ Query)#


    When i check the failed session log, it says

    ERROR : ( Transformation [Exp_A_Derive] had an error evaluating variable column [V_A_lkp]. Error message is [Expression Fatal Error [f::LKP.LKP_A_TEMP]: transformation execution failed

    ... f::LKP.LKP_A_TEMP(u:'A',u:B',f:100,u:'C',u:'025')].

    The lookup query in the Disconnected lookup is validating successfully.

    But when i check the input parameters to the disconnected lookup, they are fine. NULL values are coming from the lookup but it is getting replaced as 0 in the NULL check, in the expression.

    I debugged the mapping, data is getting inserted into the target.

    Please help me in resolving this error asap.

    Thanks Regards,

    Srividhya

    DB:2.44:Ora-08103: Object No Longer Exists Error. Please Help 73


    Hi Sri,

    Its a database issue, could be caused by some temp state change.

    Contact your DBA and check the database state at the time of the faliure.

    -Rakesh

  • RELEVANCY SCORE 2.44

    DB:2.44:Network Error 4/1 c8



    Hi!

    I can log in at home, but when i try to go somewhere i get networkerror all the time, no mather where i try to go.

    Only me?

    Error C-991




    DB:2.44:Network Error 4/1 c8

    Same...again...blumin errors looks like L.A. NOIRE then for me.

  • RELEVANCY SCORE 2.44

    DB:2.44:Config File For Disconnected Analytics.. kp


    Hi all,

    I'm trying to setup a disconnected analytics application but I'm getting the following error when trying to choose "Disconnected Analytics" on "More products":

    Error Codes: C3TDAJWI:UH6MBRBC
    Sax parser returned an exception. Message: An exception occurred! Type:UTFDataFormatException, Message:invalid byte 1 () of a 1-byte sequence., Entity publicId: C:\OracleBIData\disconnected\ABCanaliza\ABCanaliza.xml, Entity systemId: , Line number: 1, Column number: 1

    The content of my xml config file is the following:

    remotecfg
    application name="ABCanaliza"
    displayname=ABC analiza"
    dir="app"
    repository name="Mex_BI.rpd"/
    displayname lang="en" value="ABC analiza"/
    /application
    data dir="data" catalogfolder="/shared/Disconnected/Retail"
    dataset name ="ABC analiza
    incremental="true"
    syncmode="online"
    subjectarea="ABC Analiza"
    displayname lang="en" value="ABC analize"/
    table name="ro_abcartikli"
    tablesql name="ro_abcartikli.sql"/
    /table
    table name="ro_abcorganizacije"
    tablesql name="ro_abcorganizacije.sql"/
    /table
    table name="ro_abcskale"
    tablesql name="ro_abcskale.sql"/
    /table
    table name="SalesFact"
    tablesql name="ro_tmpabcanalize.sql"/
    indexsql name="indeksi.sql"/
    /table
    /dataset
    /data
    /remotecfg

    Does anyone have experience in setting up a Disconnected analytics app?

    tnx...

    Ivan

    DB:2.44:Config File For Disconnected Analytics.. kp

    Hi all,

    I'm trying to setup a disconnected analytics application but I'm getting the following error when trying to choose "Disconnected Analytics" on "More products":

    Error Codes: C3TDAJWI:UH6MBRBC
    Sax parser returned an exception. Message: An exception occurred! Type:UTFDataFormatException, Message:invalid byte 1 () of a 1-byte sequence., Entity publicId: C:\OracleBIData\disconnected\ABCanaliza\ABCanaliza.xml, Entity systemId: , Line number: 1, Column number: 1

    The content of my xml config file is the following:

    remotecfg
    application name="ABCanaliza"
    displayname=ABC analiza"
    dir="app"
    repository name="Mex_BI.rpd"/
    displayname lang="en" value="ABC analiza"/
    /application
    data dir="data" catalogfolder="/shared/Disconnected/Retail"
    dataset name ="ABC analiza
    incremental="true"
    syncmode="online"
    subjectarea="ABC Analiza"
    displayname lang="en" value="ABC analize"/
    table name="ro_abcartikli"
    tablesql name="ro_abcartikli.sql"/
    /table
    table name="ro_abcorganizacije"
    tablesql name="ro_abcorganizacije.sql"/
    /table
    table name="ro_abcskale"
    tablesql name="ro_abcskale.sql"/
    /table
    table name="SalesFact"
    tablesql name="ro_tmpabcanalize.sql"/
    indexsql name="indeksi.sql"/
    /table
    /dataset
    /data
    /remotecfg

    Does anyone have experience in setting up a Disconnected analytics app?

    tnx...

    Ivan

  • RELEVANCY SCORE 2.44

    DB:2.44:Ud32 Trouble - Need Help! 1f



    Dear All,
    I am new to Tuxedo and trying to get the UD32 command line tool to work. I
    am trying to use the example shown on the manual page titled "Querying and Updating
    the MIB with ud32" without much success.

    I have set the FIELDTBLS32 env variable to be $TUXDIR/udataobj and the FLDTBLDIR32
    env var to be Usysfl32,evt_mib,tpadm

    Here is what I am typing at the UNIX prompt (HP-UX):
    $ ud32 -C tpsysadm -i /tmp/ud32.txt

    The file /tmp/ud32.txt contains the following:
    SRVCNMTAB.tmibNL
    TA_OPERATIONTABgetNL
    TACLASSESTABt_serverNL
    NL

    Here is the error I am receiving:
    CMDTUX_CAT:988: ERROR: ud detected syntax error in fielded buffer #1
    LIBFML_CAT:8: ERROR: Unknown field name

    SRVCNM .tmib
    TA_OPERATION GET

    CMDTUX_CAT:991: ERROR: Can't send buffer TPENOENT - no entry found

    All help/comments would be really appreciated. I have been working on this a
    full day and have hit the wall.

    Regards,
    Paul

    DB:2.44:Ud32 Trouble - Need Help! 1f


    Thank you for your assistance Peter. You were correct on both counts - she works
    like a dream now. Thanks again.

    Paul
    Peter Holditch Peter.Holditch.nospam@nospam.bea.com wrote:
    Paul,

    2 problems...

    1. From what you said below, you have set FLDTBLDIR32 to what
    FIELBTBLS32 should be set to, and vice-versa.

    2. The service name should be .TMIB not .tmib (service names are case

    sensitive) - this seems to be the problem the error message is referring
    to.

    I hope that helps.

    Regards,
    Peter.
    __________________________________________________________
    Got a Question? Ask BEA at http://askbea.bea.com

    The views expressed in this posting are solely those of the author, and
    BEA
    Systems, Inc. does not endorse any of these views.
    BEA Systems, Inc. is not responsible for the accuracy or completeness
    of the
    information provided
    and assumes no duty to correct, expand upon, delete or update any of
    the
    information contained in this posting.
    ___________________________________________________________

    Paul Fitzgerald wrote:

    Dear All,
    I am new to Tuxedo and trying to get the UD32 command line tool towork. I
    am trying to use the example shown on the manual page titled "Queryingand Updating
    the MIB with ud32" without much success.

    I have set the FIELDTBLS32 env variable to be $TUXDIR/udataobj andthe FLDTBLDIR32
    env var to be Usysfl32,evt_mib,tpadm

    Here is what I am typing at the UNIX prompt (HP-UX):
    $ ud32 -C tpsysadm -i /tmp/ud32.txt

    The file /tmp/ud32.txt contains the following:
    SRVCNMTAB.tmibNL
    TA_OPERATIONTABgetNL
    TACLASSESTABt_serverNL
    NL

    Here is the error I am receiving:
    CMDTUX_CAT:988: ERROR: ud detected syntax error in fielded buffer #1
    LIBFML_CAT:8: ERROR: Unknown field name

    SRVCNM .tmib
    TA_OPERATION GET

    CMDTUX_CAT:991: ERROR: Can't send buffer TPENOENT - no entry found

    All help/comments would be really appreciated. I have been workingon this a
    full day and have hit the wall.

    Regards,
    Paul

  • RELEVANCY SCORE 2.43

    DB:2.43:Com.Evermind.Server.Rmi.Rmiconnectionexception: Disconnected cs


    Hi,

    I'm getting the following error message and cannot figure out
    what it means; any idea ?

    com.evermind.server.rmi.RMIConnectionException: Disconnected

    at com.evermind.server.rmi.RemoteInvocationHandler.invoke
    (RemoteInvocationHandler.java:50)

    at __Proxy1.qfFareDisplay(Unknown Source)

    at
    de.proquest.server.impl.ejb.TEJBRequestServer.processInquiryReque
    st(TEJBRequestServer.java:186)

    Thanks
    Holger

    DB:2.43:Com.Evermind.Server.Rmi.Rmiconnectionexception: Disconnected cs

    I found out what the problem was: An Exception was thrown in the
    readExternal() method (on the client); this exception was not
    shown in the traces, and oas returned null as the result of the
    transaction.

    To trace that, I've put the following code on the top-level
    readExternal() method:

    public final void readExternal(ObjectInput o)
    throws IOException,
    ClassNotFoundException {

    try {
    setX(o.readInt());
    } catch(Throwable t) {
    t.printStackTrace()
    throw new IOException(t.getMessage());
    }
    }

    I did the same with writeExternal() just to be sure. That way
    exceptions that occur in readExternal/writeExternal are at least
    show in the trace files.

  • RELEVANCY SCORE 2.43

    DB:2.43:Iphone Error Sync Contacts fa


    iPhone syncs contacts correctly yet error message indicates (contacts could not sync because iPhone is disconnected). any suggestions !
    MacPro leopard 10.5.2 - iPhone 8G version 1.4 - Current iTunes 7.6.1

    DB:2.43:Iphone Error Sync Contacts fa

    I get this same error every time I edit a contact on the phone or address book. It is some kind of but. Here is how to fix this error:

    1.) Open iSync
    2.) Open the preferences and under Advanced click the button "Reset Sync history"
    3.) Go back to iTunes and Sync again

    Nothing is lost when iSync history is reset; however the contacts are syncronized and no data is lost.

  • RELEVANCY SCORE 2.43

    DB:2.43:Thread: Old Ip Shows In Gwia Log 3j


    In the GWIA log, I am seeing host down errors occasionally and it lists

    the old IP address of our mail servers. I get messages like the following:

    13:43:43 4D4 MSG 991 Analyzing result file: c:grpwisegwiaresultr77b4e24.003

    13:43:43 4D4 MSG 991 Detected error on SMTP command

    13:43:43 4D4 MSG 991 Command: [10.0.0.7]

    13:43:43 4D4 MSG 991 Response: 450 Host down ([10.0.0.7])

    The new address is 10.0.0.6. The strange thing is that everything seems

    to work fine. I wish I could grab the file that it places in the

    c:grpwisegwiaresult folder, but it happens infrequently so by the time I

    look in that folder, it\'s already gone.

    Does anyone know how I can determine what is causing this?

    Thanks!

    Brian

    DB:2.43:Thread: Old Ip Shows In Gwia Log 3j

    You also need to change the route.cfg file in the gwia folder to reflect the

    new ip.

    On 1/2/2008 at 1:58 PM, Brianblippold@bcs1.org wrote:

    In the GWIA log, I am seeing host down errors occasionally and it lists

    the old IP address of our mail servers. I get messages like the

    following:

    13:43:43 4D4 MSG 991 Analyzing result file:

    c:grpwisegwiaresultr77b4e24.003

    13:43:43 4D4 MSG 991 Detected error on SMTP command

    13:43:43 4D4 MSG 991 Command: [10.0.0.7]

    13:43:43 4D4 MSG 991 Response: 450 Host down ([10.0.0.7])

    The new address is 10.0.0.6. The strange thing is that everything seems

    to work fine. I wish I could grab the file that it places in the

    c:grpwisegwiaresult folder, but it happens infrequently so by the time

    I

    look in that folder, it\'s already gone.

    Does anyone know how I can determine what is causing this?

    Thanks!

    Brian

  • RELEVANCY SCORE 2.43

    DB:2.43:Club Channel Has Been Disconnected sz



    Just entered Home after maintenance and I'm getting a "club channel has been disconnected" message pop up on screen.

    Had a few psn and home error codes pop up today, so don't know if it's related.




    DB:2.43:Club Channel Has Been Disconnected sz


    Just entered Home after maintenance and I'm getting a "club channel has been disconnected" message pop up on screen.

    Had a few psn and home error codes pop up today, so don't know if it's related.




  • RELEVANCY SCORE 2.43

    DB:2.43:Use Of Advance = Yes And Eor Give No Warning/Error a9



    I think the snippet below should give at least a warning when compiled with standard warning is enabled since EOR cannot be specified for Advance == YES.

    I am using 11.1.038 on WinXP64 with VS2005.

    The command line for compilation is:

    /nologo /debug:full /Od /gen-interfaces /stand:f03 /warn:all /module:"Debug\" /object:"Debug\" /traceback /check:bounds /libs:static /threads /dbglibs /c

    Abhi

    ----

    Program Test_NoAdvance

    !
    ! Purpose: Test Advance = NO
    !

    Implicit None

    Integer, Parameter :: N = 5
    Real :: A(N), B
    Integer :: i

    Open(90, File='Input.dat', Form='Formatted', Status='Old')

    Rewind(90)

    Read(90,"(5(F4.1,1X))",ADVANCE='YES',ERR=990,END=991,EOR=992) (A(i), i=1,N)
    Read(90,*,ERR=995,END=996) B

    Close(90)

    990 Stop "ERR."
    991 Stop "END."
    992 Stop "EOR."

    995 Stop "ERR2."
    996 Stop "END2."

    End Program Test_NoAdvance

    DB:2.43:Use Of Advance = Yes And Eor Give No Warning/Error a9


    Sorry, I should have posted this on the main forum.

    Abhi

  • RELEVANCY SCORE 2.43

    DB:2.43:Installing 4.2.1 Ipad Upgrade 7k


    I have downloaded the software thru iTunes. When it should be installing it, I get the error message..."could not back up because the iPad disconnected". The iPad is not disconnected!!

    DB:2.43:Installing 4.2.1 Ipad Upgrade 7k

    You probably forgot to walk around it 3 times widdershins with your left index finger held vertical and your right hand holding a vial of holy water

  • RELEVANCY SCORE 2.42

    DB:2.42:Installation Error Sterm_Text, Sterm_Link 19



    Hello,

    I am installing EHP 4 for SAP ERP 6.0 but i got the following error Message:

    (DB) ERROR: DDL statement failed
    (DROP INDEX "STERM_LINK~002" ON "STERM_LINK")
    DbSlExecute: rc = 103
    (SQL error -4011)
    error message returned by DbSl:
    (IMP) INFO: a failed DROP attempt is not necessarily a problem
    ERROR : Execute for create index STERM_TEXT~001 on STERM_TEXT failed (dbrc=102).
    (SQL error -955)
    error message returned by DbSl:
    SQL-Statement: CREATE INDEX "STERM_TEXT~001" ON "STERM_TEXT" ( "LANGU" , "TEXT_UC" )
    (DB) INFO: disconnected from DB

    C:\usr\sap\AD5\SYS\exe\uc\NTAMD64\R3load.exe: job finished with 1 error(s)

    DB:2.42:Installation Error Sterm_Text, Sterm_Link 19


    Hello,

    I am installing EHP 4 for SAP ERP 6.0 but i got the following error Message:

    (DB) ERROR: DDL statement failed
    (DROP INDEX "STERM_LINK~002" ON "STERM_LINK")
    DbSlExecute: rc = 103
    (SQL error -4011)
    error message returned by DbSl:
    (IMP) INFO: a failed DROP attempt is not necessarily a problem
    ERROR : Execute for create index STERM_TEXT~001 on STERM_TEXT failed (dbrc=102).
    (SQL error -955)
    error message returned by DbSl:
    SQL-Statement: CREATE INDEX "STERM_TEXT~001" ON "STERM_TEXT" ( "LANGU" , "TEXT_UC" )
    (DB) INFO: disconnected from DB

    C:\usr\sap\AD5\SYS\exe\uc\NTAMD64\R3load.exe: job finished with 1 error(s)

  • RELEVANCY SCORE 2.42

    DB:2.42:Deployment Failure px


    After packaged my web application (developed in JDeveloper 9052). I got an error message when trying to deploying. Here is the error message: "Deployment failed: Nested exception Root Cause: Disconnected: RMIConnection Disconnected. Disconnected: RMIConnection Disconnected". This is a web application using the default web application template. No EJB is used. I am not using Strut either. Any help would be greatly appreciated.

    DB:2.42:Deployment Failure px

    Thanks to everybody who has responded to this message. I created my application using the web default template. So there are two packages in my application, Model and ViewController. Do I need to create two .war file then one .ear file or I can just create one .war file from JDeveloper? Somebody told me that using the jar utility outside of JDeveloper is more reliable. Anybody has experience packaging a Model-ViewController package in JDeveloper 1052 and deploy it to Oracle AS 9i?

    dsl

  • RELEVANCY SCORE 2.42

    DB:2.42:Flash Bios Update Turns Waste Of Promise Ultra Ide Controller Card? Help!! 78


    Scre**d up after flash Updating the Promise Ultra 66 ATA IDE BIOS
    ------------------------------------------------------------------------------------------------
    Details of the Ultra 66 PCI IDE harddisk controller card.

    Ultra ATA/66
    02-35-991-01-A1
    Rev A1
    1999/06/15

    Promise Chip BIOS - Ultra V1.10A
    PDC20262
    1998-9916

    I downloaded the drivers from the Promise FTP site and after applying them, found that the driver was listed with a Yellow exclaimation icon in Device Manager. Reading through the FAQs, I then tried to flash update the BIOS from 1.10A using the Promise FTP site BIOS Flash Update file - Ultra66\Archive\U66B114b0728.ZIP. Files in this zip file were....
    PTIFLSH.EXE 101KBFileDate 9/13/99
    Ulbios.bin 16KB FileDate 10/6/99
    I ran ptiflash.exe from a boot floppyand took a backup of the old BIOS in my c: drive and then updated the BIOS with file Ulbios.BIN as given above. Till here there was no problem and the system said 'Success and its now okay to re-boot the PC. So powered off the PC and re-booted. (Tried)

    However re-bootinggives an error message "BIOS Version 1.14 (Build 0728) - - - Cannot find the PCI Device - PDC20262"

    System hangs at this stage and even clearing the NVRAM does not help. Could anyone please HELP!!!

    Harddisk is Maxtor 13 Gb ......Ultra 4...7200

    DB:2.42:Flash Bios Update Turns Waste Of Promise Ultra Ide Controller Card? Help!! 78


    The Retail version comes in a factory box, has all the manuals, cables and software from the manufacturer. The Retail is covered by the manufacturer's warranty.

    The OEM comes in a plain box, usually lacks some of the manuals, cables and software that the Retail version had. In viewing the pictures at Newegg it would appear though that most of the "retail" accessories are included with the OEM. Usually the OEM will come with a warranty from the seller rather than the manufacturer and the warranty period may not be as long.

    If the BIOS for the card isn't even posting then there is a problem withthe card itself.

  • RELEVANCY SCORE 2.42

    DB:2.42:Receiving The Following Error Message - Onenote Cannot Sync This Notebook Because The Network Is Disconnected Or The Network Location Is Not Available. Error Code 0x80070002 k3


    Receiving the following error message - OneNote cannot sync this notebook because the network is disconnected or the network location is not available. (Error code: 0x80070002) The notebook is on skydrive and has been syncing for many hours. I received he
    following error message.

    What does the error message mean and how do I fix it?

    The same error message is repeated many times.

    Thanks, Stan

  • RELEVANCY SCORE 2.41

    DB:2.41:Unable To Remove Files From Datastore zz



    I have implemented VMware using 3 host, VC and an EQ SAN. After a couple of failed P2V attempts I checked the volumes I have created and found files from test VMs that are no longer used. When I try to delete them I receive a message that I cannot.

    I am also trying to troubleshoot an error from a P2V saying that the guest has accessed an I/O range where it programmed multiple devices to overlap. Using KB 991 I attempt to delete the nvram file as instructed only to be told I cannot.

    Any help would be appreciated

    DB:2.41:Unable To Remove Files From Datastore zz


    I am moving this to a more appropiate forum

    If you found this or any other answer useful please consider the use of the Helpful or correct buttons to award points

    Tom Howarth VCP / vExpert

    VMware Communities User Moderator

    Blog: www.planetvm.net

    Contributing author for the upcoming book "[VMware vSphere and Virtual Infrastructure Security: Securing ESX and the Virtual Environment|http://my.safaribooksonline.com/9780136083214]. Currently available on roughcuts

  • RELEVANCY SCORE 2.41

    DB:2.41:Trying The Update To The New Iphone Software zs


    I keep getting the same error message, "Iphone was disconnected". I've gone through the steps that come up with the message (checking USBs, suppressing firewalls, etc).

    DB:2.41:Trying The Update To The New Iphone Software zs

    I keep getting the same error message, "Iphone was disconnected". I've gone through the steps that come up with the message (checking USBs, suppressing firewalls, etc).

  • RELEVANCY SCORE 2.41

    DB:2.41:Network Error C-991 4/1 2014 98



    Hi!

    I can log in at home, but when i try to go somewhere i get network error all the time, no mather where i try to go.

    Error code is C-991

    I have delete and install Home again, restart PS, but still problem.




    DB:2.41:Network Error C-991 4/1 2014 98


    I'm not getting that error, I see this one specifically when I change spaces, please what does this one mean?

    Network Error

    C-931




    (¯´'·.¸.Duct Tape is like the Force, said Carl Zwanzig.¸.·'´¯)It has a light side and a dark side, and it holds the Universe together.

  • RELEVANCY SCORE 2.41

    DB:2.41:Goods Movement Not Possible With Mvmt Type 991 7d



    Hi,

    As per requirement I need to create a GR for Purchase order wise. I tried to create using BAPI BAPI_GOODSMVT_CREATE but It returns the error message.

    error: Goods movement not possible with mvmt type 991

    LOOP AT gt_outtab1.

    gt_outtab1-gr_wght = gt_outtab1-gr_wght.

    MOVE: gt_outtab1-matnr TO gt_item-material,

    gt_zseed_po_qty-werks TO gt_item-plant,

    gt_zseed_po_qty-lgort TO gt_item-stge_loc,

    '901' TO gt_item-move_type,

    gt_outtab1-gr_wght TO gt_item-entry_qnt,

    'B' TO gt_item-mvt_ind,

    '1' TO gt_item-stck_type,

    v_lifnr TO gt_item-vendor,

    gt_outtab1-ebeln TO gt_item-po_number,

    gt_outtab1-ebelp TO gt_item-po_item.

    APPEND gt_item.

    ENDLOOP.

    CLEAR gt_item.

    LOOP AT gt_outtab3 WHERE bqty IS NOT INITIAL.

    MOVE: gt_outtab3-bmatnr TO gt_item-material,

    gt_zseed_po_qty-werks TO gt_item-plant,

    gt_zseed_po_qty-lgort TO gt_item-stge_loc,

    '991' TO gt_item-move_type,

    gt_outtab3-bqty TO gt_item-entry_qnt,

    '' TO gt_item-mvt_ind,

    '1' TO gt_item-stck_type,

    v_lifnr TO gt_item-vendor.

    APPEND gt_item.

    ENDLOOP.

    CLEAR gt_item.

    LOOP AT gt_outtab3 WHERE pqty IS NOT INITIAL.

    MOVE: gt_outtab3-bmatnr TO gt_item-material,

    gt_zseed_po_qty-werks TO gt_item-plant,

    gt_zseed_po_qty-lgort TO gt_item-stge_loc,

    '942' TO gt_item-move_type,

    gt_outtab3-pqty TO gt_item-entry_qnt,

    '' TO gt_item-mvt_ind,

    '1' TO gt_item-stck_type,

    v_lifnr TO gt_item-vendor.

    APPEND gt_item.

    ENDLOOP.

    ***********Call goods movement BAPI

    CALL FUNCTION 'BAPI_GOODSMVT_CREATE'

    EXPORTING

    goodsmvt_header = gs_header

    goodsmvt_code = gs_code

    IMPORTING

    goodsmvt_headret = gs_headret

    materialdocument = gs_retmtd

    matdocumentyear = gs_year

    TABLES

    goodsmvt_item = gt_item

    return = gt_return.

    so could you please let me know which are the parameters I need to pass to create GR?

    regards,

    tarun

    DB:2.41:Goods Movement Not Possible With Mvmt Type 991 7d


    Hi,

    Go to T.code OMJJ . Give your your movement type 991. Check the allowed transaction and all the details in your left hand side and the settings done.

    Thanks

    Arbind

  • RELEVANCY SCORE 2.40

    DB:2.40:*** Error = Zdate_Gettime: Service For Abap Time In Emergency Mode xc



    Hi Team,

    Our BPC System is down. In MMC message server Dispatcher were running fine in green. But we are unable to open the GUI.

    We found the log

    As per log we checked both the Application and database time time zones ., both are running in the same time. But we are unable to login into sap.

    Kindly help us to resolve this issue.

    A The local time of the application server is not correct..

    A

    A *** ERROR = zdate_gettime: Service for ABAP time in EMERGENCY MODE. [zdate.c 1409]

    A *** ERROR = zdate_gettime: Service for ABAP time in EMERGENCY MODE. [zdate.c 1409]

    A *** ERROR = zdate_gettime: Service for ABAP time in EMERGENCY MODE. [zdate.c 1409]

    A *** ERROR = zdate_gettime: Service for ABAP time in EMERGENCY MODE. [zdate.c 1409]

    A *** ERROR = zdate_gettime: Service for ABAP time in EMERGENCY MODE. [zdate.c 1409]

    A *** ERROR = zdate_gettime: Service for ABAP time in EMERGENCY MODE. [zdate.c 1409]

    A *** ERROR = zdate_gettime: Service for ABAP time in EMERGENCY MODE. [zdate.c 1409]

    M *** WARNING = PfStatWrite: missing STAT_END for opcode STAT_COMMIT [pfxxstat.c 4239]

    E *** ERROR = EnqMemMakeNewStamp: negative local time progress: Utc = 1358063864, LastUtc = 1358064281, Diff: -417 [enxxmgen.h 988]

    E *** ERROR = EnqMemMakeNewStamp: negative time progress: shared 1 358064282 6000 local 1 358063864 [enxxmgen.h 1037]

    E EnqMemMakeNewStamp: try to compensate internally

    E *** ERROR = EnqMemMakeNewStamp: negative time progress: shared 1 358064282 7000 local 1 358063864 [enxxmgen.h 1037]

    E EnqMemMakeNewStamp: try to compensate internally

    B

    B Sun Jan 13 19:22:26 2013

    B Disconnected from connection 1, con_da={++DBO++0010,13000490}

    A

    A Sun Jan 13 19:57:27 2013

    A *** ERROR = zdate_gettime: Service for ABAP time in EMERGENCY MODE. [zdate.c 1409]

    B

    B Sun Jan 13 20:57:28 2013

    B Connect to ++DBO++0010 as with MSSQL_SERVER=SSGMELDQDB2\BPQ MSSQL_DBNAME=BPQ OBJECT_SOURCE=bpq

    C Thread ID:4664

    C Network connection used from SSGMELBPQCI1 to SSGMELDQDB2\BPQ using tcp:SSGMELDQDB2\BPQ

    C Network connection used from SSGMELBPQCI1 to SSGMELDQDB2\BPQ using tcp:SSGMELDQDB2\BPQ

    C GetDbRelease: 10.50.2769

    C GetDbRelease: Got DB release numbers (10,50,2769)

    B Connection 1 opened (DBSL handle 1)

    B

    B Sun Jan 13 21:17:26 2013

    B Disconnected from connection 1, con_da={++DBO++0010,13000492}

    B

    B Sun Jan 13 22:57:30 2013

    B Connect to ++DBO++0010 as with MSSQL_SERVER=SSGMELDQDB2\BPQ MSSQL_DBNAME=BPQ OBJECT_SOURCE=bpq

    C Thread ID:4664

    C Network connection used from SSGMELBPQCI1 to SSGMELDQDB2\BPQ using tcp:SSGMELDQDB2\BPQ

    C Network connection used from SSGMELBPQCI1 to SSGMELDQDB2\BPQ using tcp:SSGMELDQDB2\BPQ

    C GetDbRelease: 10.50.2769

    C GetDbRelease: Got DB release numbers (10,50,2769)

    B Connection 1 opened (DBSL handle 1)

    B

    B Sun Jan 13 23:17:26 2013

    B Disconnected from connection 1, con_da={++DBO++0010,13000494}

    Regards

    Raghu

  • RELEVANCY SCORE 2.40

    DB:2.40:I Cannot Restore Aback Up From My Computer After A Softwared Update. I Kep Getting An Error Message Saying The Phoneis Disconnected Even Though It It Not. cc


    cannot restore aback up from my computer after a softwared update. i kep getting an error message saying the phoneis disconnected even though it it not.

    DB:2.40:I Cannot Restore Aback Up From My Computer After A Softwared Update. I Kep Getting An Error Message Saying The Phoneis Disconnected Even Though It It Not. cc

    cannot restore aback up from my computer after a softwared update. i kep getting an error message saying the phoneis disconnected even though it it not.

  • RELEVANCY SCORE 2.40

    DB:2.40:Microsoft Visual C Runtime Library Runtime Error 8776995743 ak


    Hello -

    At startup, I continually get the following error message, "Microsoft Visual C++ Runtime Library Runtime error 8776995743 has caused Runtime to terminate in an unusual way." Additionally, my fully functional Dell AIO 962 printer has been disconnected from
    communicating with my computer. I have a Dell Dimension 3000 system. Any fixes ?

    DB:2.40:Microsoft Visual C Runtime Library Runtime Error 8776995743 ak

    Hi James,

    · Since when are you getting the error?
    · Have you made any changes with the printer settings?

    These errors can be mostly caused by two factors:

    · Runtime components of Visual C++ Libraries are missing.

    · Software problem.

    Method 1:
    Step 1:
    Place the computer in a clean boot state and see if you get the error.

    a. Click Start. Click Run, type “msconfig.exe” (without quotes), and then press Enter to start the System Configuration Utility
    b. On the General tab, click Selective Startup, and then click to clear the Load startup items check box
    c. On the Services tab, click to select the Hide all Microsoft services check box, and then click Disable all. Click OK, and then click Restart.

    Step 2: If the issue does not occur in a clean boot state then you can find the cause if the problem. Refer to the following article to do the same.
    Perform a clean startup to determine whether background programs are interfering with your game or program

    Note:Make sure you put the computer back to Normal Startup once you are done.
    How to configure Windows XP to start in a "clean boot" state

    Method 2: Try installing the latest Microsoft Visual C++redistributable package and check for the issue. First, you may want to see

    this.
    For 32 bit:
    Download details: Microsoft Visual C++ 2010 Redistributable Package (x86)
    For 64 bit:
    Download details: Microsoft Visual C++ 2010 Redistributable Package (x64)

    Method 3: Run this automated troubleshooter for the printer issue and check if it helps. Reply with more information about the issue.
    Printing problems and printing errors

  • RELEVANCY SCORE 2.40

    DB:2.40:Installing Firmware f9


    Hi there, Can anyone help me with this? I am attempting to install the latest firmware for version 8 of the WRT54G Wireless Router. Unfortunately I keep getting the following error message: Unrecognized format for 'C:\Documents and Settings\xxxxxxxxxxxx\Desktop\WRT54Gv8_v8.00.2_fw.​bin' I've disconnected all wireless connections from the router. I am using a WIN XP Home Edition operating system. Any ideas? Thanks.

    DB:2.40:Installing Firmware f9

    Download the firmware file once again ...... make sure that this time you will save it on different location .......Also check that if the firewall settings allow such downloads or not .....

  • RELEVANCY SCORE 2.40

    DB:2.40:Bw - Gateway Error Due To Terminated Tcp Connection sm



    BW - Gateway error due to terminated TCP connection

    I encounter regular issue with BW due to connection micro failures.

    In the Trace for RFC I have this message error :

    Trace file opened at 20081222 115642 NFT SAP-REL 700,0,159 RFC-VER nU 3 981

    ====== CPIC-CALL: 'ThSAPCMRCV' : cmRc=20 thRc=223

    Liaison avec un programme CPI-C interrompue (lecture impossible)

    ABAP Programm: SAPMSSY1 (Transaction: )

    Called function module: RSR_NET_INTERFACE

    User: HEDCX001 (Client: 603)

    Destination: bp1adm_BP1_00 (handle: 1, 71609932, {7C00D0DD-DE36-F162-8D53-0015

    SERVER RFC Server Session (handle: 1, 71609932, {7C00D0DD-DE36-F162-8D53-001500

    SERVER Caller host:

    SERVER Caller transaction code: (Caller Program: EXCEL)

    SERVER Called function module: RSR_NET_INTERFACE

    Error RFCIO_ERROR_SYSERROR in abrfcpic.c : 3295

    CPIC-CALL: 'ThSAPCMRCV' : cmRc=20 thRc=223

    Liaison avec un programme CPI-C interrompue (lecture impossible)

    Error RFCIO_ERROR_MESSAGE in abrfcio.c : 1833

    In the Gateway Trace file I have this same message :

    Mon Dec 22 10:29:20 2008

    ***LOG Q0I= NiIRead: recv (73: Connection reset by peer) [nixxi.cpp 4424]

    ERROR = NiIRead: SiRecv failed for hdl 61 / sock 61

    (SI_ECONN_BROKEN/73; I4; ST; 10.32.1.51:1304) [nixxi.cpp 4424]

    ***LOG S23= GwIDisconnectClient, client disconnected (755) [gwxxrd.c 11658]

    ***LOG S74= GwIDisconnectClient, client disconnected ( DAIXPRES) [gwxxrd.c 11669]

    ***LOG S0R= GwIDisconnectClient, client disconnected () [gwxxrd.c 11704]

    ***LOG S0I= GwIDisconnectClient, client disconnected ( EXCEL) [gwxxrd.c 11717]

    LOCATION SAP-Gateway on host bp1prd / sapgw00

    ERROR connection to partner '100.1.2.3:1304' broken

    TIME Mon Dec 22 10:29:20 2008

    RELEASE 700

    COMPONENT NI (network interface)

    VERSION 38

    RC -6

    MODULE nixxi.cpp

    LINE 4424

    DETAIL NiIRead

    SYSTEM CALL recv

    ERRNO 73

    ERRNO TEXT Connection reset by peer

    COUNTER 758

    Thanks in advance

    AK

    DB:2.40:Bw - Gateway Error Due To Terminated Tcp Connection sm


    Hi Adrien,

    Check the SAPnote 722514.

    Thanks Regards,

    Satyabrat

  • RELEVANCY SCORE 2.39

    DB:2.39:Just Got Disconnected! s8


    Are you disconnected?"Network error D5027"Maybe they will be patching it now?



  • RELEVANCY SCORE 2.39

    DB:2.39:Sqlplus Prompt And Ctrl C Command sp


    Hi,
    I am running into one situation in which i tried to login to one of our database(testdb) running on 10.2.0.5 from remote host using sqlplus(11R2 version) command and tried Ctrl+C right after login. It disconnected my session with following message. Is this a bug? It doesn't happen with other oracle version. Any idea what's happening here?

    testdb SQL --- Press Ctrl C here---

    testdb SQL select * from tab;
    select * from tab
    *
    ERROR at line 1:
    ORA-03113: end-of-file on communication channel
    Process ID: 0
    Session ID: 4056 Serial number: 13861

    Thanks much in advance.

    -Mal.

    DB:2.39:Sqlplus Prompt And Ctrl C Command sp

    Hi,
    I am running into one situation in which i tried to login to one of our database(testdb) running on 10.2.0.5 from remote host using sqlplus(11R2 version) command and tried Ctrl+C right after login. It disconnected my session with following message. Is this a bug? It doesn't happen with other oracle version. Any idea what's happening here?

    testdb SQL --- Press Ctrl C here---

    testdb SQL select * from tab;
    select * from tab
    *
    ERROR at line 1:
    ORA-03113: end-of-file on communication channel
    Process ID: 0
    Session ID: 4056 Serial number: 13861

    Thanks much in advance.

    -Mal.

  • RELEVANCY SCORE 2.39

    DB:2.39:Host Disconnected z8



    Hello,

    i have one host that has the state disconnected.

    If i want to connect a wizard appears and ask me for user root a password.

    After entry the password the wizard shows a error message:

    Already being managed by ....

    If i remove this host and want to install it, i receive the same message that this host is already manage and the host appears again disconnected.

    Has somebody a solution for this problem ?

    regards

    Alejandro

    DB:2.39:Host Disconnected z8


    The agent has gone stupid.

    Login or rsh to the server and execute:

    pkill -9 vmware-ccagent

    Then connect to the server in VC. Don't remove the server first as this is unnecessary.

  • RELEVANCY SCORE 2.39

    DB:2.39:Server Dies And Then Fails To Start !! 38


    I am not an expert on Tuxedo but have been facing an issued in our environment.We have a cron job defined which direct to ud32 , which is basically a file transfer to another system. . Its running every 5 minutes.ud32 /fhs_integration/fhstux/env/am_scripts_prod/kog_send_param /var/fhs/log/send_kog.$TIMESTAMP 21 /fhs_integration/fhstux/env/am_scripts_prod/kog_send_paramnFFML_VERSION 1FFML_RH_SIZE 9FFML_RECORDS 0SRVCNM FHS_TRANS_KOG--------Service FHS_TRANS_KOG runs on Server FHS_KOG.--------Now the problem is that the Server FHS_KOG fails to maintain it status and dies after a while----the ud32 output shows which is because of as SERVER is now no longer present.-CMDTUX_CAT:991: ERROR: Can't send buffer TPENOENT - no entry foundCMDTUX_CAT:991: ERROR: Can't send buffer TPENOENT - no entry foundand in ULOG I only find following information :231923.aapfhst1!XML_PROXY.504032.1.0: INFO 0 Service FHS_PUBLISH returned ok, return buffer trace generated231923.aapfhst1!XML_PROXY.504032.1.0: INFO 0 Generated XML string (len:2172)235529.aapfhst1!BBL.1171696.1.0: LIBTUX_CAT:541: WARN: Server AM_GROUP/60 terminated235529.aapfhst1!BBL.1171696.1.0: LIBTUX_CAT:557: INFO: Server AM_GROUP/60 being restarted235529.aapfhst1!FHS_KOG.1212492.1.0: 09-05-2013: Tuxedo Version 9.1, 64-bit235529.aapfhst1!FHS_KOG.1212492.1.0: LIBTUX_CAT:262: INFO: Standard main starting235529.aapfhst1!FHS_KOG.1212492.1.0: LIBTUX_CAT:250: ERROR: tpsvrinit() failed235529.aapfhst1!restartsrv.856280.1.-2: 09-05-2013: Tuxedo Version 9.1, 64-bit235529.aapfhst1!restartsrv.856280.1.-2: server AM_GROUP/60: CMDTUX_CAT:579: ERROR: Cannot restart a server - unknown process creation error: 23235529.aapfhst1!restartsrv.856280.1.-2: server AM_GROUP/60: CMDTUX_CAT:587: INFO: Cannot restart server, scheduling for cleanup235529.aapfhst1!cleanupsrv.1880262.1.-2: 09-05-2013: Tuxedo Version 9.1, 64-bit235529.aapfhst1!cleanupsrv.1880262.1.-2: server AM_GROUP/60: CMDTUX_CAT:1073: WARN: Client process 1638494 - dropped message because server died, SERVICE=FHS_KOG

    DB:2.39:Server Dies And Then Fails To Start !! 38

    Hi,"error: 23" is an OS error. It is platform dependent but in general I think the errorno is defined as:#define ENFILE 23 /* File table overflow */You probably ran out of OS resources when tpsvrinit() tried to do a file open (e.g. maybe initializing a DB connection).Either the OS kernel is not configured properly for the application architecture requirements or the resources are not being reclaimed properly.Since this is occurring after a server crash I would think it was the second problem. Clean up resources (e.g. ipc, dead processes).Figure out why the server crashed. Make sure you have the highest Tuxedo 9.1 rolling patch level available installed.Regards,Bob Finan

  • RELEVANCY SCORE 2.39

    DB:2.39:Error Message...Help! 8f


    Everytime I try to load music on my Ipod touch, I get a message that says, "This device has either stopped responding or has been disconnected". How do I fix this?

    DB:2.39:Error Message...Help! 8f

    Everytime I try to load music on my Ipod touch, I get a message that says, "This device has either stopped responding or has been disconnected". How do I fix this?

  • RELEVANCY SCORE 2.39

    DB:2.39:Struts-Tiles App Won't Run When Migrating From App Server V7 To V8 jz


    Hi,
    I have this old Struts-Tiles web app that was running fine on Sun app server 7. When deployed on sun app server 8 there is a problem with the tiles config file:
    type Exception report

    message

    description The server encountered an internal error () that prevented it from fulfilling this request.

    exception

    javax.servlet.ServletException: Error while parsing file '/WEB-INF/tiles-config/tiles-defs.xml'. Error at (16, 70: org.apache.struts.tiles.xmlDefinition.XmlDefinition
    org.apache.struts.tiles.TilesPlugin.init(TilesPlugin.java:151)
    org.apache.struts.action.ActionServlet.initApplicationPlugIns(ActionServlet.java:991)
    org.apache.struts.action.ActionServlet.init(ActionServlet.java:458)
    javax.servlet.GenericServlet.init(GenericServlet.java:261)
    sun.reflect.NativeMethodAccessorImpl.invoke0(Native Method)
    sun.reflect.NativeMethodAccessorImpl.invoke(NativeMethodAccessorImpl.java:39)
    sun.reflect.DelegatingMethodAccessorImpl.invoke(DelegatingMethodAccessorImpl.java:25)
    java.lang.reflect.Method.invoke(Method.java:324)
    org.apache.catalina.security.SecurityUtil$1.run(SecurityUtil.java:249)
    java.security.AccessController.doPrivileged(Native Method)
    javax.security.auth.Subject.doAsPrivileged(Subject.java:500)
    org.apache.catalina.security.SecurityUtil.execute(SecurityUtil.java:282)
    org.apache.catalina.security.SecurityUtil.doAsPrivilege(SecurityUtil.java:165)
    org.apache.catalina.security.SecurityUtil.doAsPrivilege(SecurityUtil.java:118)
    org.apache.coyote.tomcat5.CoyoteAdapter.service(CoyoteAdapter.java:184)
    com.sun.enterprise.web.connector.grizzly.ProcessorTask.process(ProcessorTask.java:653)
    com.sun.enterprise.web.connector.grizzly.ProcessorTask.process(ProcessorTask.java:534)
    com.sun.enterprise.web.connector.grizzly.ProcessorTask.doTask(ProcessorTask.java:403)
    com.sun.enterprise.web.connector.grizzly.WorkerThread.run(WorkerThread.java:55)

    root cause

    org.apache.struts.tiles.DefinitionsFactoryException: Error while parsing file '/WEB-INF/tiles-config/tiles-defs.xml'. Error at (16, 70: org.apache.struts.tiles.xmlDefinition.XmlDefinition
    org.apache.struts.tiles.xmlDefinition.I18nFactorySet.parseXmlFile(I18nFactorySet.java:538)
    org.apache.struts.tiles.xmlDefinition.I18nFactorySet.parseXmlFiles(I18nFactorySet.java:466)
    org.apache.struts.tiles.xmlDefinition.I18nFactorySet.createDefaultFactory(I18nFactorySet.java:294)
    org.apache.struts.tiles.xmlDefinition.I18nFactorySet.initFactory(I18nFactorySet.java:267)
    org.apache.struts.tiles.xmlDefinition.I18nFactorySet.initFactory(I18nFactorySet.java:215)
    org.apache.struts.tiles.definition.ComponentDefinitionsFactoryWrapper.init(ComponentDefinitionsFactoryWrapper.java:69)
    org.apache.struts.tiles.DefinitionsUtil.createDefinitionsFactory(DefinitionsUtil.java:276)
    org.apache.struts.tiles.TilesPlugin.init(TilesPlugin.java:147)
    org.apache.struts.action.ActionServlet.initApplicationPlugIns(ActionServlet.java:991)
    org.apache.struts.action.ActionServlet.init(ActionServlet.java:458)
    javax.servlet.GenericServlet.init(GenericServlet.java:261)
    sun.reflect.NativeMethodAccessorImpl.invoke0(Native Method)
    sun.reflect.NativeMethodAccessorImpl.invoke(NativeMethodAccessorImpl.java:39)
    sun.reflect.DelegatingMethodAccessorImpl.invoke(DelegatingMethodAccessorImpl.java:25)
    java.lang.reflect.Method.invoke(Method.java:324)
    org.apache.catalina.security.SecurityUtil$1.run(SecurityUtil.java:249)
    java.security.AccessController.doPrivileged(Native Method)
    javax.security.auth.Subject.doAsPrivileged(Subject.java:500)
    org.apache.catalina.security.SecurityUtil.execute(SecurityUtil.java:282)
    org.apache.catalina.security.SecurityUtil.doAsPrivilege(SecurityUtil.java:165)
    org.apache.catalina.security.SecurityUtil.doAsPrivilege(SecurityUtil.java:118)
    org.apache.coyote.tomcat5.CoyoteAdapter.service(CoyoteAdapter.java:184)
    com.sun.enterprise.web.connector.grizzly.ProcessorTask.process(ProcessorTask.java:653)
    com.sun.enterprise.web.connector.grizzly.ProcessorTask.process(ProcessorTask.java:534)
    com.sun.enterprise.web.connector.grizzly.ProcessorTask.doTask(ProcessorTask.java:403)
    com.sun.enterprise.web.connector.grizzly.WorkerThread.run(WorkerThread.java:55)

    Did anyone encounter this problem? The libraries inside lib/ are exactly the same as before. Does app server 8 implement stricter rules for xml validation? This is the beginning of my tiles-config file:

    !DOCTYPE tiles-definitions PUBLIC
    "-//Apache Software Foundation//DTD Tiles Configuration//EN"
    "http://jakarta.apache.org/struts/dtds/tiles-config.dtd"

    tiles-definitions
    ...

    Thanks!

    DB:2.39:Struts-Tiles App Won't Run When Migrating From App Server V7 To V8 jz

    Did you ever get this resolved, I'm having the exact same issue?
    Thanks,
    David

  • RELEVANCY SCORE 2.39

    DB:2.39:C-977 Error 13



    Can someone please help me. I`ve played Home for 25-30minutes then i`ve got disconnected and i`ve been trying to reconnect but i`ve been gettin these messages;

    C-977 Error

    /HUBPS3_SVML/account/SP/Login_Submit.jsp

    Please Help.

    Thanks.




    DB:2.39:C-977 Error 13


    Can someone please help me. I`ve played Home for 25-30minutes then i`ve got disconnected and i`ve been trying to reconnect but i`ve been gettin these messages;

    C-977 Error

    /HUBPS3_SVML/account/SP/Login_Submit.jsp

    Please Help.

    Thanks.




  • RELEVANCY SCORE 2.39

    DB:2.39:Need Help On Disconnected Analytics In Obiee z7


    Hi there,
    am trying to access the Disconnected Analytics application in OBIEE. But am getting an message which reads as "There is no disconnected application set for usage". Can someone let me know what is the error and how to resolve it?

    Thanks,

  • RELEVANCY SCORE 2.39

    DB:2.39:Whole Home Dvr zc



    error message - dvr disconnected from network. in status "multi-room: authorized", but "no network dvr's found". any suggestions for fix?

    DB:2.39:Whole Home Dvr zc


    First thing to try is resetting your HD Receivers/DVRs using the red button behind the front panel access card door.

  • RELEVANCY SCORE 2.38

    DB:2.38:When I Updated To Itunes Version 11 And Iphone Will Not Sync. The Error Message That I Get Is Itunes Cannot Sync Because The Iphone Is Disconnected.&Nbsp; The Iphone Is Not Disconnected And I Get A Partial Backup xf


    When I updated to Itunes version 11 and iPhone will not sync. The error message that I get is iTunes cannot sync because the iPhone is disconnected. The iPhone is not disconnected and I get a partial backup

    DB:2.38:When I Updated To Itunes Version 11 And Iphone Will Not Sync. The Error Message That I Get Is Itunes Cannot Sync Because The Iphone Is Disconnected.&Nbsp; The Iphone Is Not Disconnected And I Get A Partial Backup xf

    When I updated to Itunes version 11 and iPhone will not sync. The error message that I get is iTunes cannot sync because the iPhone is disconnected. The iPhone is not disconnected and I get a partial backup

  • RELEVANCY SCORE 2.38

    DB:2.38:Context Disconnected Error 3f


    I sometimes get a Context Disconnected Exception on the second line: ManagementObject disk = new ManagementObject(Win32_LogicalDisk.DeviceID=\ + drive + :\); disk.Get(); The value of drive is C

    DB:2.38:Context Disconnected Error 3f

    I sometimes get a Context Disconnected Exception on the second line: ManagementObject disk = new ManagementObject(Win32_LogicalDisk.DeviceID=\ + drive + :\); disk.Get(); The value of drive is C

  • RELEVANCY SCORE 2.38

    DB:2.38:Error Says Printer Disconnected But Its Not zs


    Earlier my printer worked well. But now when I start HP solution Center on My Windows XP it says printer disconnected message. Please help me , I checked all my power lines and all is well but I cant find the solution to this problem..

  • RELEVANCY SCORE 2.38

    DB:2.38:"Iphone Disconnected" Error At Sync! 3x


    When I try sycn I get the error message "iTunes could not sync contacts with the iPhone "iPhone" because the iPhone disconnected." I don't get it? It shows up as a device in iTunes and I can go through the tabs... but it wont sync anything. It charges on the dock, that's it.

    Help!!

    Kim

    DB:2.38:"Iphone Disconnected" Error At Sync! 3x

    Glad it worked. That's what these forums are for.

  • RELEVANCY SCORE 2.38

    DB:2.38:Get The Imsi Number Without Disconnected The Modem zk


    HI

    my question is how can i connect and disconnect my usb 3G modem automatically in c#;
    because I want to get the IMSI number of my 3G modem SIM Card, but when the modem has the status connected I can't acceded into it, and I get a port message error.

    Best regards
    Yassine

  • RELEVANCY SCORE 2.38

    DB:2.38:Seam 2.0.0 B1 Validateall pa



    Hi,I have just ported my application to Seam 2.0.0 B1 following the migration guide and the seamdiscs example.It look likes to work fine except I had to remove s:validateall from all my xhtml pages.With I get the following error each time I submit the page:

    java.lang.NullPointerException:
    at org.jboss.seam.ui.validator.ModelValidator.validate(ModelValidator.java:44)
    at org.apache.myfaces.trinidad.component.UIXEditableValue.validateValue(UIXEditableValue.java:348)
    at org.apache.myfaces.trinidad.component.UIXEditableValue.validate(UIXEditableValue.java:172)
    at org.apache.myfaces.trinidad.component.UIXEditableValue._executeValidate(UIXEditableValue.java:491)
    at org.apache.myfaces.trinidad.component.UIXEditableValue.processValidators(UIXEditableValue.java:271)
    at org.apache.myfaces.trinidad.component.UIXComponentBase.validateChildrenImpl(UIXComponentBase.java:991)
    at org.apache.myfaces.trinidad.component.UIXComponentBase.validateChildren(UIXComponentBase.java:976)
    at org.apache.myfaces.trinidad.component.UIXComponentBase.processValidators(UIXComponentBase.java:811)
    at org.apache.myfaces.trinidad.component.UIXComponentBase.validateChildrenImpl(UIXComponentBase.java:991)
    at org.apache.myfaces.trinidad.component.UIXComponentBase.validateChildren(UIXComponentBase.java:976)
    at org.apache.myfaces.trinidad.component.UIXComponentBase.processValidators(UIXComponentBase.java:811)
    at org.apache.myfaces.trinidad.component.UIXComponentBase.validateChildrenImpl(UIXComponentBase.java:991)
    at org.apache.myfaces.trinidad.component.UIXComponentBase.validateChildren(UIXComponentBase.java:976)
    at org.apache.myfaces.trinidad.component.UIXComponentBase.processValidators(UIXComponentBase.java:811)
    at org.apache.myfaces.trinidad.component.UIXComponentBase.validateChildrenImpl(UIXComponentBase.java:991)
    at org.apache.myfaces.trinidad.component.UIXComponentBase.validateChildren(UIXComponentBase.java:976)
    at org.apache.myfaces.trinidad.component.UIXComponentBase.processValidators(UIXComponentBase.java:811)
    at org.apache.myfaces.trinidad.component.UIXComponentBase.validateChildrenImpl(UIXComponentBase.java:991)
    at org.apache.myfaces.trinidad.component.UIXComponentBase.validateChildren(UIXComponentBase.java:976)
    at org.apache.myfaces.trinidad.component.UIXComponentBase.processValidators(UIXComponentBase.java:811)
    at org.apache.myfaces.trinidad.component.UIXForm.processValidators(UIXForm.java:82)
    at org.apache.myfaces.trinidad.component.UIXComponentBase.validateChildrenImpl(UIXComponentBase.java:991)
    at org.apache.myfaces.trinidad.component.UIXComponentBase.validateChildren(UIXComponentBase.java:976)
    at org.apache.myfaces.trinidad.component.UIXComponentBase.processValidators(UIXComponentBase.java:811)
    at org.apache.myfaces.trinidad.component.UIXComponentBase.validateChildrenImpl(UIXComponentBase.java:991)
    at org.apache.myfaces.trinidad.component.UIXComponentBase.validateChildren(UIXComponentBase.java:976)
    at org.apache.myfaces.trinidad.component.UIXComponentBase.processValidators(UIXComponentBase.java:811)
    at javax.faces.component.UIComponentBase.processValidators(UIComponentBase.java:1030)
    at javax.faces.component.UIViewRoot.processValidators(UIViewRoot.java:662)
    at com.sun.faces.lifecycle.ProcessValidationsPhase.execute(ProcessValidationsPhase.java:100)
    at com.sun.faces.lifecycle.LifecycleImpl.phase(LifecycleImpl.java:251)
    at com.sun.faces.lifecycle.LifecycleImpl.execute(LifecycleImpl.java:117)
    08:19:57,929 WARN [lifecycle] executePhase(PROCESS_VALIDATIONS 3,org.apache.myfaces.trinidadinternal.context.FacesContextFactoryImpl$CacheRenderKit@1a684dd) threw exception
    javax.faces.FacesException:
    at com.sun.faces.lifecycle.ProcessValidationsPhase.execute(ProcessValidationsPhase.java:108)
    at com.sun.faces.lifecycle.LifecycleImpl.phase(LifecycleImpl.java:251)
    at com.sun.faces.lifecycle.LifecycleImpl.execute(LifecycleImpl.java:117)
    at javax.faces.webapp.FacesServlet.service(FacesServlet.java:244)
    at org.apache.catalina.core.ApplicationFilterChain.internalDoFilter(ApplicationFilterChain.java:290)
    at org.apache.catalina.core.ApplicationFilterChain.doFilter(ApplicationFilterChain.java:206)
    at org.apache.myfaces.trinidadinternal.webapp.TrinidadFilterImpl._invokeDoFilter(TrinidadFilterImpl.java:208)
    at org.apache.myfaces.trinidadinternal.webapp.TrinidadFilterImpl._doFilterImpl(TrinidadFilterImpl.java:165)
    at org.apache.myfaces.trinidadinternal.webapp.TrinidadFilterImpl.doFilter(TrinidadFilterImpl.java:138)
    at org.apache.myfaces.trinidad.webapp.TrinidadFilter.doFilter(TrinidadFilter.java:92)
    at org.apache.catalina.core.ApplicationFilterChain.internalDoFilter(ApplicationFilterChain.java:235)
    at org.apache.catalina.core.ApplicationFilterChain.doFilter(ApplicationFilterChain.java:206)
    at org.jboss.seam.servlet.SeamFilter$FilterChainImpl.doFilter(SeamFilter.java:83)
    at org.jboss.seam.debug.hot.HotDeployFilter.doFilter(HotDeployFilter.java:63)
    at org.jboss.seam.servlet.SeamFilter$FilterChainImpl.doFilter(SeamFilter.java:69)
    at org.jboss.seam.web.MultipartFilter.doFilter(MultipartFilter.java:87)
    at org.jboss.seam.servlet.SeamFilter$FilterChainImpl.doFilter(SeamFilter.java:69)
    at org.jboss.seam.web.ExceptionFilter.doFilter(ExceptionFilter.java:63)
    at org.jboss.seam.servlet.SeamFilter$FilterChainImpl.doFilter(SeamFilter.java:69)
    at org.jboss.seam.web.RedirectFilter.doFilter(RedirectFilter.java:46)
    at org.jboss.seam.servlet.SeamFilter$FilterChainImpl.doFilter(SeamFilter.java:69)
    at org.jboss.seam.servlet.SeamFilter.doFilter(SeamFilter.java:140)
    at org.apache.catalina.core.ApplicationFilterChain.internalDoFilter(ApplicationFilterChain.java:235)
    at org.apache.catalina.core.ApplicationFilterChain.doFilter(ApplicationFilterChain.java:206)
    at org.jboss.web.tomcat.filters.ReplyHeaderFilter.doFilter(ReplyHeaderFilter.java:96)
    at org.apache.catalina.core.ApplicationFilterChain.internalDoFilter(ApplicationFilterChain.java:235)
    at org.apache.catalina.core.ApplicationFilterChain.doFilter(ApplicationFilterChain.java:206)
    at org.apache.catalina.core.StandardWrapperValve.invoke(StandardWrapperValve.java:230)
    at org.apache.catalina.core.StandardContextValve.invoke(StandardContextValve.java:175)
    at org.jboss.web.tomcat.security.SecurityAssociationValve.invoke(SecurityAssociationValve.java:179)
    at org.apache.catalina.authenticator.AuthenticatorBase.invoke(AuthenticatorBase.java:433)
    at org.jboss.web.tomcat.security.JaccContextValve.invoke(JaccContextValve.java:84)
    Caused by: java.lang.NullPointerException:
    at org.jboss.seam.ui.validator.ModelValidator.validate(ModelValidator.java:44)
    at org.apache.myfaces.trinidad.component.UIXEditableValue.validateValue(UIXEditableValue.java:348)
    at org.apache.myfaces.trinidad.component.UIXEditableValue.validate(UIXEditableValue.java:172)
    at org.apache.myfaces.trinidad.component.UIXEditableValue._executeValidate(UIXEditableValue.java:491)
    at org.apache.myfaces.trinidad.component.UIXEditableValue.processValidators(UIXEditableValue.java:271)
    at org.apache.myfaces.trinidad.component.UIXComponentBase.validateChildrenImpl(UIXComponentBase.java:991)
    at org.apache.myfaces.trinidad.component.UIXComponentBase.validateChildren(UIXComponentBase.java:976)
    at org.apache.myfaces.trinidad.component.UIXComponentBase.processValidators(UIXComponentBase.java:811)
    at org.apache.myfaces.trinidad.component.UIXComponentBase.validateChildrenImpl(UIXComponentBase.java:991)
    at org.apache.myfaces.trinidad.component.UIXComponentBase.validateChildren(UIXComponentBase.java:976)
    at org.apache.myfaces.trinidad.component.UIXComponentBase.processValidators(UIXComponentBase.java:811)
    at org.apache.myfaces.trinidad.component.UIXComponentBase.validateChildrenImpl(UIXComponentBase.java:991)
    at org.apache.myfaces.trinidad.component.UIXComponentBase.validateChildren(UIXComponentBase.java:976)
    at org.apache.myfaces.trinidad.component.UIXComponentBase.processValidators(UIXComponentBase.java:811)
    at org.apache.myfaces.trinidad.component.UIXComponentBase.validateChildrenImpl(UIXComponentBase.java:991)
    at org.apache.myfaces.trinidad.component.UIXComponentBase.validateChildren(UIXComponentBase.java:976)
    at org.apache.myfaces.trinidad.component.UIXComponentBase.processValidators(UIXComponentBase.java:811)
    at org.apache.myfaces.trinidad.component.UIXComponentBase.validateChildrenImpl(UIXComponentBase.java:991)
    at org.apache.myfaces.trinidad.component.UIXComponentBase.validateChildren(UIXComponentBase.java:976)
    at org.apache.myfaces.trinidad.component.UIXComponentBase.processValidators(UIXComponentBase.java:811)
    at org.apache.myfaces.trinidad.component.UIXForm.processValidators(UIXForm.java:82)
    at org.apache.myfaces.trinidad.component.UIXComponentBase.validateChildrenImpl(UIXComponentBase.java:991)
    at org.apache.myfaces.trinidad.component.UIXComponentBase.validateChildren(UIXComponentBase.java:976)
    at org.apache.myfaces.trinidad.component.UIXComponentBase.processValidators(UIXComponentBase.java:811)
    at org.apache.myfaces.trinidad.component.UIXComponentBase.validateChildrenImpl(UIXComponentBase.java:991)
    at org.apache.myfaces.trinidad.component.UIXComponentBase.validateChildren(UIXComponentBase.java:976)
    at org.apache.myfaces.trinidad.component.UIXComponentBase.processValidators(UIXComponentBase.java:811)
    at javax.faces.component.UIComponentBase.processValidators(UIComponentBase.java:1030)
    at javax.faces.component.UIViewRoot.processValidators(UIViewRoot.java:662)
    at com.sun.faces.lifecycle.ProcessValidationsPhase.execute(ProcessValidationsPhase.java:100)
    at com.sun.faces.lifecycle.LifecycleImpl.phase(LifecycleImpl.java:251)
    at com.sun.faces.lifecycle.LifecycleImpl.execute(LifecycleImpl.java:117)
    08:19:57,940 ERROR [ExceptionFilter] handling uncaught exception
    javax.servlet.ServletException:
    at javax.faces.webapp.FacesServlet.service(FacesServlet.java:256)
    at org.apache.catalina.core.ApplicationFilterChain.internalDoFilter(ApplicationFilterChain.java:290)
    at org.apache.catalina.core.ApplicationFilterChain.doFilter(ApplicationFilterChain.java:206)
    at org.apache.myfaces.trinidadinternal.webapp.TrinidadFilterImpl._invokeDoFilter(TrinidadFilterImpl.java:208)
    at org.apache.myfaces.trinidadinternal.webapp.TrinidadFilterImpl._doFilterImpl(TrinidadFilterImpl.java:165)
    at org.apache.myfaces.trinidadinternal.webapp.TrinidadFilterImpl.doFilter(TrinidadFilterImpl.java:138)
    at org.apache.myfaces.trinidad.webapp.TrinidadFilter.doFilter(TrinidadFilter.java:92)
    at org.apache.catalina.core.ApplicationFilterChain.internalDoFilter(ApplicationFilterChain.java:235)
    at org.apache.catalina.core.ApplicationFilterChain.doFilter(ApplicationFilterChain.java:206)
    at org.jboss.seam.servlet.SeamFilter$FilterChainImpl.doFilter(SeamFilter.java:83)
    at org.jboss.seam.debug.hot.HotDeployFilter.doFilter(HotDeployFilter.java:63)
    at org.jboss.seam.servlet.SeamFilter$FilterChainImpl.doFilter(SeamFilter.java:69)
    at org.jboss.seam.web.MultipartFilter.doFilter(MultipartFilter.java:87)
    at org.jboss.seam.servlet.SeamFilter$FilterChainImpl.doFilter(SeamFilter.java:69)
    at org.jboss.seam.web.ExceptionFilter.doFilter(ExceptionFilter.java:63)
    at org.jboss.seam.servlet.SeamFilter$FilterChainImpl.doFilter(SeamFilter.java:69)
    at org.jboss.seam.web.RedirectFilter.doFilter(RedirectFilter.java:46)
    at org.jboss.seam.servlet.SeamFilter$FilterChainImpl.doFilter(SeamFilter.java:69)
    at org.jboss.seam.servlet.SeamFilter.doFilter(SeamFilter.java:140)
    at org.apache.catalina.core.ApplicationFilterChain.internalDoFilter(ApplicationFilterChain.java:235)
    at org.apache.catalina.core.ApplicationFilterChain.doFilter(ApplicationFilterChain.java:206)
    at org.jboss.web.tomcat.filters.ReplyHeaderFilter.doFilter(ReplyHeaderFilter.java:96)
    at org.apache.catalina.core.ApplicationFilterChain.internalDoFilter(ApplicationFilterChain.java:235)
    at org.apache.catalina.core.ApplicationFilterChain.doFilter(ApplicationFilterChain.java:206)
    at org.apache.catalina.core.StandardWrapperValve.invoke(StandardWrapperValve.java:230)
    at org.apache.catalina.core.StandardContextValve.invoke(StandardContextValve.java:175)
    at org.jboss.web.tomcat.security.SecurityAssociationValve.invoke(SecurityAssociationValve.java:179)
    at org.apache.catalina.authenticator.AuthenticatorBase.invoke(AuthenticatorBase.java:433)
    at org.jboss.web.tomcat.security.JaccContextValve.invoke(JaccContextValve.java:84)
    at org.apache.catalina.core.StandardHostValve.invoke(StandardHostValve.java:128)
    at org.apache.catalina.valves.ErrorReportValve.invoke(ErrorReportValve.java:104)
    at org.jboss.web.tomcat.service.jca.CachedConnectionValve.invoke(CachedConnectionValve.java:156)
    Caused by: java.lang.NullPointerException:
    at org.jboss.seam.ui.validator.ModelValidator.validate(ModelValidator.java:44)
    at org.apache.myfaces.trinidad.component.UIXEditableValue.validateValue(UIXEditableValue.java:348)
    at org.apache.myfaces.trinidad.component.UIXEditableValue.validate(UIXEditableValue.java:172)
    at org.apache.myfaces.trinidad.component.UIXEditableValue._executeValidate(UIXEditableValue.java:491)
    at org.apache.myfaces.trinidad.component.UIXEditableValue.processValidators(UIXEditableValue.java:271)
    at org.apache.myfaces.trinidad.component.UIXComponentBase.validateChildrenImpl(UIXComponentBase.java:991)
    at org.apache.myfaces.trinidad.component.UIXComponentBase.validateChildren(UIXComponentBase.java:976)
    at org.apache.myfaces.trinidad.component.UIXComponentBase.processValidators(UIXComponentBase.java:811)
    at org.apache.myfaces.trinidad.component.UIXComponentBase.validateChildrenImpl(UIXComponentBase.java:991)
    at org.apache.myfaces.trinidad.component.UIXComponentBase.validateChildren(UIXComponentBase.java:976)
    at org.apache.myfaces.trinidad.component.UIXComponentBase.processValidators(UIXComponentBase.java:811)
    at org.apache.myfaces.trinidad.component.UIXComponentBase.validateChildrenImpl(UIXComponentBase.java:991)
    at org.apache.myfaces.trinidad.component.UIXComponentBase.validateChildren(UIXComponentBase.java:976)
    at org.apache.myfaces.trinidad.component.UIXComponentBase.processValidators(UIXComponentBase.java:811)
    at org.apache.myfaces.trinidad.component.UIXComponentBase.validateChildrenImpl(UIXComponentBase.java:991)
    at org.apache.myfaces.trinidad.component.UIXComponentBase.validateChildren(UIXComponentBase.java:976)
    at org.apache.myfaces.trinidad.component.UIXComponentBase.processValidators(UIXComponentBase.java:811)
    at org.apache.myfaces.trinidad.component.UIXComponentBase.validateChildrenImpl(UIXComponentBase.java:991)
    at org.apache.myfaces.trinidad.component.UIXComponentBase.validateChildren(UIXComponentBase.java:976)
    at org.apache.myfaces.trinidad.component.UIXComponentBase.processValidators(UIXComponentBase.java:811)
    at org.apache.myfaces.trinidad.component.UIXForm.processValidators(UIXForm.java:82)
    at org.apache.myfaces.trinidad.component.UIXComponentBase.validateChildrenImpl(UIXComponentBase.java:991)
    at org.apache.myfaces.trinidad.component.UIXComponentBase.validateChildren(UIXComponentBase.java:976)
    at org.apache.myfaces.trinidad.component.UIXComponentBase.processValidators(UIXComponentBase.java:811)
    at org.apache.myfaces.trinidad.component.UIXComponentBase.validateChildrenImpl(UIXComponentBase.java:991)
    at org.apache.myfaces.trinidad.component.UIXComponentBase.validateChildren(UIXComponentBase.java:976)
    at org.apache.myfaces.trinidad.component.UIXComponentBase.processValidators(UIXComponentBase.java:811)
    at javax.faces.component.UIComponentBase.processValidators(UIComponentBase.java:1030)
    at javax.faces.component.UIViewRoot.processValidators(UIViewRoot.java:662)
    at com.sun.faces.lifecycle.ProcessValidationsPhase.execute(ProcessValidationsPhase.java:100)
    at com.sun.faces.lifecycle.LifecycleImpl.phase(LifecycleImpl.java:251)
    at com.sun.faces.lifecycle.LifecycleImpl.execute(LifecycleImpl.java:117)
    08:19:57,948 ERROR [ExceptionFilter] exception root cause
    java.lang.NullPointerException:
    at org.jboss.seam.ui.validator.ModelValidator.validate(ModelValidator.java:44)
    at org.apache.myfaces.trinidad.component.UIXEditableValue.validateValue(UIXEditableValue.java:348)
    at org.apache.myfaces.trinidad.component.UIXEditableValue.validate(UIXEditableValue.java:172)
    at org.apache.myfaces.trinidad.component.UIXEditableValue._executeValidate(UIXEditableValue.java:491)
    at org.apache.myfaces.trinidad.component.UIXEditableValue.processValidators(UIXEditableValue.java:271)
    at org.apache.myfaces.trinidad.component.UIXComponentBase.validateChildrenImpl(UIXComponentBase.java:991)
    at org.apache.myfaces.trinidad.component.UIXComponentBase.validateChildren(UIXComponentBase.java:976)
    at org.apache.myfaces.trinidad.component.UIXComponentBase.processValidators(UIXComponentBase.java:811)
    at org.apache.myfaces.trinidad.component.UIXComponentBase.validateChildrenImpl(UIXComponentBase.java:991)
    at org.apache.myfaces.trinidad.component.UIXComponentBase.validateChildren(UIXComponentBase.java:976)
    at org.apache.myfaces.trinidad.component.UIXComponentBase.processValidators(UIXComponentBase.java:811)
    at org.apache.myfaces.trinidad.component.UIXComponentBase.validateChildrenImpl(UIXComponentBase.java:991)
    at org.apache.myfaces.trinidad.component.UIXComponentBase.validateChildren(UIXComponentBase.java:976)
    at org.apache.myfaces.trinidad.component.UIXComponentBase.processValidators(UIXComponentBase.java:811)
    at org.apache.myfaces.trinidad.component.UIXComponentBase.validateChildrenImpl(UIXComponentBase.java:991)
    at org.apache.myfaces.trinidad.component.UIXComponentBase.validateChildren(UIXComponentBase.java:976)
    at org.apache.myfaces.trinidad.component.UIXComponentBase.processValidators(UIXComponentBase.java:811)
    at org.apache.myfaces.trinidad.component.UIXComponentBase.validateChildrenImpl(UIXComponentBase.java:991)
    at org.apache.myfaces.trinidad.component.UIXComponentBase.validateChildren(UIXComponentBase.java:976)
    at org.apache.myfaces.trinidad.component.UIXComponentBase.processValidators(UIXComponentBase.java:811)
    at org.apache.myfaces.trinidad.component.UIXForm.processValidators(UIXForm.java:82)
    at org.apache.myfaces.trinidad.component.UIXComponentBase.validateChildrenImpl(UIXComponentBase.java:991)
    at org.apache.myfaces.trinidad.component.UIXComponentBase.validateChildren(UIXComponentBase.java:976)
    at org.apache.myfaces.trinidad.component.UIXComponentBase.processValidators(UIXComponentBase.java:811)
    at org.apache.myfaces.trinidad.component.UIXComponentBase.validateChildrenImpl(UIXComponentBase.java:991)
    at org.apache.myfaces.trinidad.component.UIXComponentBase.validateChildren(UIXComponentBase.java:976)
    at org.apache.myfaces.trinidad.component.UIXComponentBase.processValidators(UIXComponentBase.java:811)
    at javax.faces.component.UIComponentBase.processValidators(UIComponentBase.java:1030)
    at javax.faces.component.UIViewRoot.processValidators(UIViewRoot.java:662)
    at com.sun.faces.lifecycle.ProcessValidationsPhase.execute(ProcessValidationsPhase.java:100)
    at com.sun.faces.lifecycle.LifecycleImpl.phase(LifecycleImpl.java:251)
    at com.sun.faces.lifecycle.LifecycleImpl.execute(LifecycleImpl.java:117)
    08:19:57,960 ERROR [DebugPageHandler] redirecting to debug page
    java.lang.NullPointerException:
    at org.jboss.seam.ui.validator.ModelValidator.validate(ModelValidator.java:44)
    at org.apache.myfaces.trinidad.component.UIXEditableValue.validateValue(UIXEditableValue.java:348)
    at org.apache.myfaces.trinidad.component.UIXEditableValue.validate(UIXEditableValue.java:172)
    at org.apache.myfaces.trinidad.component.UIXEditableValue._executeValidate(UIXEditableValue.java:491)
    at org.apache.myfaces.trinidad.component.UIXEditableValue.processValidators(UIXEditableValue.java:271)
    at org.apache.myfaces.trinidad.component.UIXComponentBase.validateChildrenImpl(UIXComponentBase.java:991)
    at org.apache.myfaces.trinidad.component.UIXComponentBase.validateChildren(UIXComponentBase.java:976)
    at org.apache.myfaces.trinidad.component.UIXComponentBase.processValidators(UIXComponentBase.java:811)
    at org.apache.myfaces.trinidad.component.UIXComponentBase.validateChildrenImpl(UIXComponentBase.java:991)
    at org.apache.myfaces.trinidad.component.UIXComponentBase.validateChildren(UIXComponentBase.java:976)
    at org.apache.myfaces.trinidad.component.UIXComponentBase.processValidators(UIXComponentBase.java:811)
    at org.apache.myfaces.trinidad.component.UIXComponentBase.validateChildrenImpl(UIXComponentBase.java:991)
    at org.apache.myfaces.trinidad.component.UIXComponentBase.validateChildren(UIXComponentBase.java:976)
    at org.apache.myfaces.trinidad.component.UIXComponentBase.processValidators(UIXComponentBase.java:811)
    at org.apache.myfaces.trinidad.component.UIXComponentBase.validateChildrenImpl(UIXComponentBase.java:991)
    at org.apache.myfaces.trinidad.component.UIXComponentBase.validateChildren(UIXComponentBase.java:976)
    at org.apache.myfaces.trinidad.component.UIXComponentBase.processValidators(UIXComponentBase.java:811)
    at org.apache.myfaces.trinidad.component.UIXComponentBase.validateChildrenImpl(UIXComponentBase.java:991)
    at org.apache.myfaces.trinidad.component.UIXComponentBase.validateChildren(UIXComponentBase.java:976)
    at org.apache.myfaces.trinidad.component.UIXComponentBase.processValidators(UIXComponentBase.java:811)
    at org.apache.myfaces.trinidad.component.UIXForm.processValidators(UIXForm.java:82)
    at org.apache.myfaces.trinidad.component.UIXComponentBase.validateChildrenImpl(UIXComponentBase.java:991)
    at org.apache.myfaces.trinidad.component.UIXComponentBase.validateChildren(UIXComponentBase.java:976)
    at org.apache.myfaces.trinidad.component.UIXComponentBase.processValidators(UIXComponentBase.java:811)
    at org.apache.myfaces.trinidad.component.UIXComponentBase.validateChildrenImpl(UIXComponentBase.java:991)
    at org.apache.myfaces.trinidad.component.UIXComponentBase.validateChildren(UIXComponentBase.java:976)
    at org.apache.myfaces.trinidad.component.UIXComponentBase.processValidators(UIXComponentBase.java:811)
    at javax.faces.component.UIComponentBase.processValidators(UIComponentBase.java:1030)
    at javax.faces.component.UIViewRoot.processValidators(UIViewRoot.java:662)
    at com.sun.faces.lifecycle.ProcessValidationsPhase.execute(ProcessValidationsPhase.java:100)
    at com.sun.faces.lifecycle.LifecycleImpl.phase(LifecycleImpl.java:251)
    at com.sun.faces.lifecycle.LifecycleImpl.execute(LifecycleImpl.java:117)

    DB:2.38:Seam 2.0.0 B1 Validateall pa


    Ok, the seamdiscs example is back in CVS (examples/seamdiscs). It would be great if you would test it!I was able to replicate your problem http://jira.jboss.com/jira/browse/JBSEAM-1667

  • RELEVANCY SCORE 2.38

    DB:2.38:Vbscript: Remote Comuputer Disconnected Message am



    When I in the office. I can remote to server 2000 with URL is: http://204.72.x.x:8080/tsweb/default.htm. But when I at home, I am getting an error: vbscripts: remote desktop disconnected. Please advice.

    DB:2.38:Vbscript: Remote Comuputer Disconnected Message am


    Hi,

    Below is the link. There might be one or all reasons matching to it.

    http://www.chicagotech.net/sbs/rwwvbscript11.htm

    Regards,

    Pravin

  • RELEVANCY SCORE 2.37

    DB:2.37:Web Services Tutorial (9.0.3) mc


    Hi,

    I'm new at Web Services using Oracle9iAS (9.0.3.0.0)and am having a problem running the tutorial at http://www.oracle.com/technology/tech/webservices/htdocs/series/statelessjava/index.html.

    I manage to get to the point of deploying the Web Service and everything is fine. I then create the Web Service Stub and that seems to be created OK, but when I come to run it I get the error:

    C:\OC4J\jdk\bin\javaw.exe -client -Xdebug -Xrunjdwp:transport=dt_socket,server=y,address=1328 -classpath C:\WorkArea\JDeveloper\Project\classes;C:\jdev\lib\jdev-rt.jar;C:\jdev\lib\jdev-rt.jar;C:\soap\lib\soap.jar;C:\lib\xmlparserv2.jar;C:\jlib\javax-ssl-1_2.jar;C:\jlib\jssl-1_2.jar;C:\j2ee\home\lib\activation.jar;C:\j2ee\home\lib\mail.jar;C:\j2ee\home\lib\http_client.jar HelloImplStub
    Debugger connected to local process.

    [SOAPException: faultCode=SOAP-ENV:Protocol; msg=Unsupported response content type "text/html", must be: "text/xml". Response was:
    HTMLHEADTITLE500 Internal Server Error/TITLE/HEADBODYH1500 Internal Server Error/H1PREServlet error: Cannot generate Class: C:\OC4J\j2ee\home\application-deployments\WorkspaceStatelessJava-ProjectStatelessJava-WS\WebServices\temp\__java_stateless_rpc\__HelloImplStatelessWrapper.java:9: '.' expected

    import IHelloImpl;

    ^

    1 error

    /PRE/BODY/HTML

    ]

    at org.apache.soap.rpc.Call.getEnvelopeString(Call.java:209)

    at org.apache.soap.rpc.Call.invoke(Call.java:268)

    at HelloImplStub.sayHello(HelloImplStub.java:73)

    at HelloImplStub.main(HelloImplStub.java:34)

    Debugger disconnected from local process.
    Process exited with exit code 0.

    I have even tried creating the client using Axis but receive the same error message, so the problem is withthe Web Service.

    Does anyone have any ideas?

    Nigel

    DB:2.37:Web Services Tutorial (9.0.3) mc

    Hi,

    I'm new at Web Services using Oracle9iAS (9.0.3.0.0)and am having a problem running the tutorial at http://www.oracle.com/technology/tech/webservices/htdocs/series/statelessjava/index.html.

    I manage to get to the point of deploying the Web Service and everything is fine. I then create the Web Service Stub and that seems to be created OK, but when I come to run it I get the error:

    C:\OC4J\jdk\bin\javaw.exe -client -Xdebug -Xrunjdwp:transport=dt_socket,server=y,address=1328 -classpath C:\WorkArea\JDeveloper\Project\classes;C:\jdev\lib\jdev-rt.jar;C:\jdev\lib\jdev-rt.jar;C:\soap\lib\soap.jar;C:\lib\xmlparserv2.jar;C:\jlib\javax-ssl-1_2.jar;C:\jlib\jssl-1_2.jar;C:\j2ee\home\lib\activation.jar;C:\j2ee\home\lib\mail.jar;C:\j2ee\home\lib\http_client.jar HelloImplStub
    Debugger connected to local process.

    [SOAPException: faultCode=SOAP-ENV:Protocol; msg=Unsupported response content type "text/html", must be: "text/xml". Response was:
    HTMLHEADTITLE500 Internal Server Error/TITLE/HEADBODYH1500 Internal Server Error/H1PREServlet error: Cannot generate Class: C:\OC4J\j2ee\home\application-deployments\WorkspaceStatelessJava-ProjectStatelessJava-WS\WebServices\temp\__java_stateless_rpc\__HelloImplStatelessWrapper.java:9: '.' expected

    import IHelloImpl;

    ^

    1 error

    /PRE/BODY/HTML

    ]

    at org.apache.soap.rpc.Call.getEnvelopeString(Call.java:209)

    at org.apache.soap.rpc.Call.invoke(Call.java:268)

    at HelloImplStub.sayHello(HelloImplStub.java:73)

    at HelloImplStub.main(HelloImplStub.java:34)

    Debugger disconnected from local process.
    Process exited with exit code 0.

    I have even tried creating the client using Axis but receive the same error message, so the problem is withthe Web Service.

    Does anyone have any ideas?

    Nigel

  • RELEVANCY SCORE 2.37

    DB:2.37:Error Start J2ee (Solution Manager) ds



    Hi, start instance solution manager but not start j2ee, only run instance abap.

    the operation system is windows 32 bits, 8 GB RAM.

    Show error in the file log dev_jcontrol:

    [Thr 5192] JControlExecuteBootstrap: execute bootstrap process [bootstrap]

    [Thr 8048] JControlDPMessageProxy: Thread 8048 started as handler thread for R/3 dispatcher messages.

    [Thr 5192] [Node: bootstrap] java home is set by profile parameter

    #Java Home: C:\j2sdk1.4.2_12

    [Thr 5192] *** ERROR = JStartupIGetJDKInfo: Cannot find Java compiler [C:\j2sdk1.4.2_12\bin\javac.exe]. [jstartxxi.c 991]

    [Thr 5192] *** ERROR = can't get JDK information (rc = -1) [jstartxxi.c 1257]

    [Thr 5192] **********************************************************************

    ERROR = JDK Detection failed.

    Please see SAP Note 943602 , section 'JDK detection issues'

    for additional information and trouble shooting.

    **********************************************************************

    [Thr 5192] *** ERROR = node [bootstrap] not found [jstartxx.c 1593]

    [Thr 5192] JControlExecuteBootstrap: error executing bootstrap node [bootstrap] (rc = -18)

    [Thr 5192] JControlCloseProgram: started (exitcode = -18)

    [Thr 5192] JControlCloseProgram: good bye... (exitcode = -18)

    Best Regards,

    EDRS

    DB:2.37:Error Start J2ee (Solution Manager) ds


    Hello,

    It appears from the trace that your JAVA_HOME is set correctly (note: JAVA_HOME must not include the "bin" directory) but that the executable javac.exe (the Java compiler) is missing in %JAVA_HOME%\bin. Check whether javac.exe exists and if not, reinstall the 1.4.2_12 Java SDK (the SDK, not the JRE!).

    Regards,

    Mark

  • RELEVANCY SCORE 2.37

    DB:2.37:Cant Install Sql Server 2005 Std ja


    I'm trying to install the product and can't get past the point where it is trying to install the SQL Server Native client. Here is the log...
    === Verbose logging started: 10/29/2009 19:10:11 Build type: SHIP UNICODE 3.01.4000.4042 Calling process: C:\WINDOWS\system32\msiexec.exe ===
    MSI (c) (78:E4) [19:10:11:991]: Resetting cached policy values
    MSI (c) (78:E4) [19:10:11:991]: Machine policy value 'Debug' is 0
    MSI (c) (78:E4) [19:10:11:991]: ******* RunEngine:
    ******* Product: d:\setup\sqlncli.msi
    ******* Action:
    ******* CommandLine: **********
    MSI (c) (78:E4) [19:10:11:991]: Client-side and UI is none or basic: Running entire install on the server.
    MSI (c) (78:E4) [19:10:11:991]: Grabbed execution mutex.
    MSI (c) (78:E4) [19:10:13:006]: Failed to connect to server. Error: 0x80070005
    MSI (c) (78:E4) [19:10:13:006]: Failed to connect to server.
    MSI (c) (78:E4) [19:10:13:006]: MainEngineThread is returning 1601
    === Verbose logging stopped: 10/29/2009 19:10:13 ===

    DB:2.37:Cant Install Sql Server 2005 Std ja

    you are correct. my windows installer was messed up. i installed 4.5 and was able to continue with the installation.thanks!

  • RELEVANCY SCORE 2.37

    DB:2.37:Nsoftware Biztalk Ftp Over Ssl Transmit Adapter, Error Uploading Ftp Data: Timeout cz


    Hi,
    I am using third party nsoftware FTPS adapter over SSL implicit encryption to send message from BizTalkto FTP location.
    I have all the details like server name, Port, Username and password.
    Using above details message has been sent successfully using CoreFTP or FileZilla. But when I posted message using nsoftware FTPS adapter I got below errorwith message got dehydrated in BizTalk and at the same time FTP location received azero byte
    file.
    Error Details:
    Source: nsoftware BizTalk FTP Transmit Adapter ()
    Source URI: FTP://Username@IPAddress:991/%SourceFileName%
    Message Type: Error
    Current Thread: 49
    Transmission failed for message Meessage ID: Error uploading FTP data: Timeout.
    I have spent so much time by applying different configuration possibilitiesin nsoftware FTPS adapter configuration, but no luck.

    Kindly help.ganesh

    DB:2.37:Nsoftware Biztalk Ftp Over Ssl Transmit Adapter, Error Uploading Ftp Data: Timeout cz

    Hi Ben,
    I know its been while this post was updated. But if you coudl share those extra FTP commands, it would be helpful. I am also getting the timeout error.

    Cheers

  • RELEVANCY SCORE 2.37

    DB:2.37:Login Problems dx


    when attemping to login it i kept getting error codes c-991, c-971,and c-931 and alot of timed out this was all in the morning but i was finaly able to login at 9:00pm. Why was that?

    DB:2.37:Login Problems dx

    when attemping to login it i kept getting error codes c-991, c-971,and c-931 and alot of timed out this was all in the morning but i was finaly able to login at 9:00pm. Why was that?