• RELEVANCY SCORE 6.00

    DB:6.00:Error Reading Trayicon1-Visible pz





    I keep getting this error message on my windows 8 "Error Reading TrayIcon1-Visible: cannot Create System Shell Notification Icon". Anyone got any idea why?

    DB:6.00:Error Reading Trayicon1-Visible pz

    Hi Horace,

    Let us know few more details about the issue.
    1. When do you get the error message?
    2. Since when are you getting the error message?

    I would suggest you to perform a clean boot and check which application is causing the issue.
    Clean boot: To help troubleshoot error messages and other issues, you can start Windows by using a minimal set of drivers and startup programs. This kind of startup is known as a "clean boot." A clean
    boot helps eliminate software conflicts.

    How to perform a clean boot to troubleshoot a problem in Windows 8, Windows 7, or Windows Vista

    http://support.microsoft.com/kb/929135

    Note: Please refer to the section: How to reset the computer to start as usual after troubleshooting with clean boot of the Kb article to boot the computer in normal startup after fixing the issue.

    You can also run Microsoft security scanner and check for virus on the computer.

    The Microsoft Safety Scanner is a free downloadable security tool that provides on-demand scanning and helps remove viruses, spyware, and other malicious software. It works with your existing antivirus software. Here is
    the link to run Microsoft security scanner.

    http://www.microsoft.com/security/scanner/en-us/default.aspx

    Disclaimer: Any data files that are infected may only be cleaned by deleting the file entirely, which means there is a potential for data loss.

    Note: The Microsoft Safety Scanner expires 10 days after being downloaded. To rerun a scan with the latest anti-malware definitions, download and run the Microsoft Safety Scanner again.

    Let us know about the status of the issue. We would be happy to help you further.

  • RELEVANCY SCORE 5.40

    DB:5.40: Error Reading Trayicon1-Visible Canot Create Shelll Notificationn Icon f3





    I get this error when I reboot XP anybody know why?
    " Error Reading TrayIcon1-Visible: canot Create Shelll Notificationn Icon "

    DB:5.40: Error Reading Trayicon1-Visible Canot Create Shelll Notificationn Icon f3

    Try this ... very helpful
    http://www.dllshepherd.net/2011/01/fixing-error-error-reading-trayicon1.html

  • RELEVANCY SCORE 4.14

    DB:4.14:Linking Vs2010 Project To Tfs2010 (Full Release) 8c





    Hi All,I have installed VS2010 ultimate on xp Pro SP3. I then installed team Foundation Server 2010. I wanted to create a project in vs2010 and add it into TFS for sourcecontrol purposes. In vs2010 I enter the name of my server in 'Add Team Foundation Server' and accept the rest, but it error's 'TF31002: unable to connect......'I then open TFS Admin console and under my Server There is a build configuration and logs option. Select Build Configuration and properties of my server. My connection to team Project Collection (outgoing) is blank so I select browse, but no servers are visible. Reading up more it seems that IIS7 is required for TFS2010. I only had IIS5 installed. So I have installed IIS 7 and again I can see my server and user but there is no connection. I try to connect to localhost, but I receive an error.'There was an error when trying to connect. Do you want to retype your credentials an try again?Could not load file or assembly 'Microsoft.web.administration, version= 7.0.0.0...... or one of it's dependencies. The System cannot find the file specified'Anybody any ideas where I go from here?

    DB:4.14:Linking Vs2010 Project To Tfs2010 (Full Release) 8c

    The dll must be marked as Copy Local True and Specific Version True.

  • RELEVANCY SCORE 4.07

    DB:4.07:Cannot Create System Restore Point Error8007000e mz


    When I try to create sysrem resore point I get error 8007000e

    DB:4.07:Cannot Create System Restore Point Error8007000e mz

    I would suggest you get away from the Windows backup program and get yourself a good commercial backup program. This forum is frought with problem reports for the Windows one. I know I was very unimpressed when I tried it. Two I'm familiar with and like
    are Norton Ghost (which I've been using for 7 years without the 1st problem), and Memeo which has a 30 day free trial and you can buy it for $29.99 - you can download it from http://memeo.com . You can get Ghost for next to nothing (like I did) if you watch
    the sales.
    CNET has a lot of backup program reviews at
    http://download.cnet.com/windows/backup-software/?tag=contentBody;sideBar
    .
    Some of these are free (last time I checked there were 315), some have free trials (over 1000), and some are purchase only (over 200).
    Good luck

  • RELEVANCY SCORE 2.77

    DB:2.77:Sap Plm System Integration With Portal 9d



    Hi Experts,

    We have a requirement in our portal where in we need to add some links which are coming in the Detail Level navigation of sap portal. The SAP PLM system is present in the landscape and we have the standard roles creating being done through spro e.g. Portfolio Management.

    When we try using spro to create new links, the new links are visible in the Detail level navigation but the content of these links is not visible its giving us a page not found error.

    Please advice and share some documents on SAP PLM integration to portal.

    Regards

    Shivas Bhan

    DB:2.77:Sap Plm System Integration With Portal 9d


    Hi

    Closing the thread, it can be done using the configuration , were in the navigation in portal is controlled by the Link id and page ids in Abap PLM system.

    Regards

    Shivas Bhan

  • RELEVANCY SCORE 2.36

    DB:2.36:Need Help Reading Images Into An Imagelist d1


     
    Hi coders! I'm trying to read the names of some image files into an Imagelist, but I'm stuck. Here's the code:
     
    ImageList targetImages = new System.Windows.Forms.ImageList();
    string[] stringImagefiles = Directory.GetFiles(directoryName, *.jpg);
    Image newlistimage = new Image(targetImages);
    targetImages.Images.Add(newlistimage);
     
    I'm told this error: Error 2 Cannot create an instance of the abstract class or interface 'System.Drawing.Image' 
     
    any help would be great! thanks for reading this  

  • RELEVANCY SCORE 2.34

    DB:2.34:Error Handling In Proxy - Async Scenarios fx



    Hi,

    For async scneraios....if there is an exception in proxy ....how do we monitor / notify the error ( Do we create a Z table/raise mails ?? or can we create alerts in SAP as well ?? )

    I understand that we can raise fault messages but that will be visible only in the receiver SAP system. What is the use of that?

    DB:2.34:Error Handling In Proxy - Async Scenarios fx


    There is an another different approach. Again it is purely based on your requirement. You can create sync outbound and inbound interface. Whereas in the sender adapter you quality of service is EO or EOIO. This way the receiver proxy sends the error messages using fault message type. But since sender system is async you ignore the response. But you will see the response message in the monitoring section of target message.

    you might want to look at this approach

    http://scn.sap.com/community/icc/integration-scenario-pi/blog/2011/03/07/unleash-synchronous-scenarios

  • RELEVANCY SCORE 2.33

    DB:2.33:Print And Freeze Errors dc


    I have been reading posts and support info about preinting and program freezes but still have no idea what to do. I have checked my system and it does meet system requirements. Running XP SP3. Pentium 4 2.80GHz .99 GB RAM 30GB available hard drive.When I attempt to print a project I get an Elements error message saying cannot find priter. If print to Acrobat says Acrobat not "Activated".If attempt ot create a photo collage goes through entire process but then work just disappears at point it would be saved or displayed.

    DB:2.33:Print And Freeze Errors dc

    What is the model and make of the printer?

  • RELEVANCY SCORE 2.32

    DB:2.32:Backup Error: [Error 2] The System Cannot Find The File Specified 8k





    Hi,

    I want to create backup in my Plesk panel (10.4.4 Windows 2008 r2), I go to:
    Tools Settings Backup Manager Back Up

    and click on Back Up buttom.

    But i see this error:
    Error: [Error 2] The system cannot find the file specified

    What should i do?

    Thanks.

    DB:2.32:Backup Error: [Error 2] The System Cannot Find The File Specified 8k




    Hi,

    OS Microsoft Windows 6.1;build-7601;sp1.0;suite1296;product3
    Panel version 10.4.4 Update #56, last updated at Sept 27, 2013 05:44 AM

    Im seeing exactly the same error when I try and run manual or scheduled backups:
    4584: 2013-09-28 09:01:05,591 DEBUG -- pmmcli.MakeDumpAction object at 0x022CC6B0
    4584: 2013-09-28 09:01:05,591 INFO stdin: backup-task-descriptionmisc backup-profile-name=inspired_Test owner-guid=E5834F85-8FDA-451A-9FD1-706F8EAB8126 owner-type=server verbose-level=5/dumps-storage-credentials storage-type=localroot-dirD:\Plesk\DATA\Backup\/root-dir/dumps-storage-credentialsbackup-specificationbackup-options type=full compression-level=standard suspend=false mail-to=Paul.craven@selvatico.co.uk description=Domain backup.
    Creation date: Sep 28, 2013 09:00 AM/object-to-backup type=domain id=46 name=inspiredleads.com//backup-specification/backup-task-description
    4584: 2013-09-28 09:01:05,591 INFO Packet succesfully validated.
    4584: 2013-09-28 09:01:05,591 DEBUG pmmcli.ActionRunner object at 0x022CC490: doActivity
    4584: 2013-09-28 09:01:05,668 CRITICAL Runtime error in pmmcli:
    type exceptions.WindowsError [Error 2] The system cannot find the file specified
    Traceback (most recent call last):
    File D:\Plesk\admin\share\pmmcli\pmmcli.py, line 2203, in main
    data_action_response, errcode_response, error_message = actions.get(sys.argv[1][2:])(parameters)
    File D:\Plesk\admin\share\pmmcli\pmmcli.py, line 2076, in make_dump
    return ActionRunner(MakeDumpAction, backup_task_description, None).doActivity()
    File D:\Plesk\admin\share\pmmcli\pmmcli.py, line 150, in doActivity
    result = self.processor.doActivity()
    File D:\Plesk\admin\share\pmmcli\pmmcli.py, line 1252, in doActivity
    subprocess = cmd.asyncSpawn()
    File D:\Plesk\admin\lib\python\subproc.py, line 292, in asyncSpawn
    keepStderr = keepStderr)
    File D:\Plesk\admin\lib\python\subproc.py, line 73, in __init__
    self.__forkexec()
    File D:\Plesk\admin\lib\python\subproc.py, line 127, in __forkexec
    self.__process = subprocess.Popen(self.__get_cmd(), stdin = _stdin , stdout = self.__stdout, stderr = self.__stderr, env = self.__env, universal_newlines = True)
    File D:\Plesk\admin\lib\python\compat\subprocess.py, line 594, in __init__
    errread, errwrite)
    File D:\Plesk\admin\lib\python\compat\subprocess.py, line 816, in _execute_child
    startupinfo)
    WindowsError: [Error 2] The system cannot find the file specified

    4584: 2013-09-28 09:01:05,668 INFO Outgoing packet:
    ?xml version=1.0 encoding=UTF-8?
    response
    errcode1001/errcode
    errmsg[Error 2] The system cannot find the file specified/errmsg
    /response

    Is there anything I can do to resolve this?

    Regards

    Paul

  • RELEVANCY SCORE 2.27

    DB:2.27:Listmng Failed: Listmng: Error: Cannot Create New List: Is Mailman Configured... kf





    Hello,

    This is Plesk 10, I upgraded it from Plesk 9. If I try to create a new e-mail list I get this error:
    Unable to create list: listmng failed: listmng: Error: cannot create new list: is Mailman configured properly?. System error 2: No such file or directory

    I already tried this with no luck!

    DB:2.27:Listmng Failed: Listmng: Error: Cannot Create New List: Is Mailman Configured... kf




    It may be related to inconsistancy of password and password policy.

    You may either try to set more complex password while creating maillist or try to decrease Minimal password Strength at Home - Settings - Mail Server Settings to Very Weak.

    Hope it will help =)

  • RELEVANCY SCORE 2.25

    DB:2.25:Hue/Saturation Adjustment Layer Bug In Photoshop Cs6 ks



    I noticed that most of the time I cannot copy a Hue/Saturation adjustment layer in Photoshop CS6. (In about a third of all cases it works, in all others I have to create a new Hue/Saturation adjustment layer).

    Hitting Command + J will cause my Mac to make an error sound.

    Option + delete also doesn't work half the time.

    Also: I cannot do a "Stamp visible" above a Hue/Saturation adjustment layer. Hitting Command + Option + Shift + E will bring another error sound.

    I have to creat a new layer, and then create a stamp visible. But half the time this doesn't work, either. Hitting Command + Shift + N will give me another error sound.

    I have to create a different adjustment layer, then an empty layer, and only then I can create a "stamp visible".

    Only Hue/Saturation adjustment layers are affected by this - but it's a true hold-up.

    DB:2.25:Hue/Saturation Adjustment Layer Bug In Photoshop Cs6 ks


    Mac OS X Mountain Lion 16Gb RAM on a MacBook Pro retina.

    I have more problems with Bridge, and maybe I should uninstall-reinstall

  • RELEVANCY SCORE 2.25

    DB:2.25:Budget-Main Budget Not Visible sd


    Have an issue with Budget setup.1. Fiscal Years currently existing in system are: 2007, 2008, 2009, 2010.2009 fiscal year is from 1/Oct/2008 to 30/Sep/2009.2. In Budget, there is a Main Budget - 01/01/2009 visible but this Main Budget is not visible in any Budget Scenarios.When I open Budget Scenarios window, I can only see Fiscal Years 2007, 2008, 2009 and 2010.I do not see any fiscal year starting 01/01/2009 at all.3. In the Budget Scenarios window, if I select 2009, I do not see any rows - not even Main Budget!!! If I try to add row, I get error message asking me to first delete Main Budget - 01/01/2009 - but I do not see this on any scenarios screen.Need to create a Main Budget for 2009 but cannot do so.It may be possible that there was earlier a Posting Period starting 01/01/2009 for which a Main Budget was created and then the Posting Period deleted. The Budget probably remains in the system. Working on 2007A, SP01, PL05.Any ideas?Thanks.

    DB:2.25:Budget-Main Budget Not Visible sd

    Thanks-but I had already referred to this same note in the thread above.This Note says the issue will be resolved in SP01-PL06.The release notes of SP01-PL06 also mentions that this issue rsolved in this patch.The database is currently on SP01-PL06.Thanks.

  • RELEVANCY SCORE 2.25

    DB:2.25:Ora-01552: Cannot Use System Rollback Segment For Non-System Tablespace zs


    i try to create a table in new schema test1 and got the following error. please help.

    SQL create table employer1 as select * from a.employer;
    create table employer1 as select * from a.employer
    *
    ERROR at line 1:
    ORA-01552: cannot use system rollback segment for non-system tablespace 'TEST1'

    DB:2.25:Ora-01552: Cannot Use System Rollback Segment For Non-System Tablespace zs

    Hi,

    This is an example:

    SQL
    CREATE UNDO TABLESPACE "UNDOTMP"
    DATAFILE 'UNDOTMP.DBF01' SIZE 100M REUSE
    AUTOEXTEND ON NEXT 51200K MAXSIZE 15000M

    ALTER SYSTEM SET undo_tablespace=UNDOTMP SCOPE=BOTH;

    Regards

    David Duenas

    Edited by: David Duenas on Jul 4, 2009 7:33 PM

  • RELEVANCY SCORE 2.25

    DB:2.25:Cannot Create System Repair Disc. Error 0x800705b9. xf


    original title:Cannot create system repair disc.
    Winows was unable to parse the XML data. 0x800705B9.
    Just bought a new laptop, have installed latest updates and restarted the computer.

    DB:2.25:Cannot Create System Repair Disc. Error 0x800705b9. xf

    This error may also be given if a repair disc had already been created previous (my HP desktop allows for ONE set to be made ONLY).

  • RELEVANCY SCORE 2.24

    DB:2.24:Failed To Run Function Security Report 3x


    Hi, All

    I always get failed to run the request set "Function Security Report" no matter what application name and responsibility name i specified for parameters. Could somebody help to figure out the problem. My EBS Version is 11.5.10.2.

    The detail log is as following:

    ================================================================================================
    Program exited with status 128

    Cause: The program terminated, returning status code 128.

    Action: Check your installation manual for the meaning of this code on this operating system.
    APP-FND-01630: Cannot open file d:\oracle\viscomn\temp\OF31E.tmp for reading

    Cause: USDINS encountered an error when attempting to open file d:\oracle\viscomn\temp\OF31E.tmp for reading.

    Action: Verify that the filename is correct and that the environment variables controlling that filename are correct.

    Action: If the file is opened in read mode, check that the file exists. Check that you have privileges to read the file in the file

    directory. Contact your system administrator to obtain read privileges.

    Action: If the file is opened in write or append mode, check that you have privileges to create and write files in the file directory.

    Contact your system administrator to obtain create and write privileges.
    Concurrent Manager encountered an error while running Oracle*Report for your concurrent request 2820600.

    Review your concurrent request log and/or report output file for more detailed information.
    =================================================================================================

    PS: I have checked the file system , d:\oracle\viscomn\temp is a valid path. So any advice?

    thanks in advance.

    DB:2.24:Failed To Run Function Security Report 3x

    Hi, All

    I always get failed to run the request set "Function Security Report" no matter what application name and responsibility name i specified for parameters. Could somebody help to figure out the problem. My EBS Version is 11.5.10.2.

    The detail log is as following:

    ================================================================================================
    Program exited with status 128

    Cause: The program terminated, returning status code 128.

    Action: Check your installation manual for the meaning of this code on this operating system.
    APP-FND-01630: Cannot open file d:\oracle\viscomn\temp\OF31E.tmp for reading

    Cause: USDINS encountered an error when attempting to open file d:\oracle\viscomn\temp\OF31E.tmp for reading.

    Action: Verify that the filename is correct and that the environment variables controlling that filename are correct.

    Action: If the file is opened in read mode, check that the file exists. Check that you have privileges to read the file in the file

    directory. Contact your system administrator to obtain read privileges.

    Action: If the file is opened in write or append mode, check that you have privileges to create and write files in the file directory.

    Contact your system administrator to obtain create and write privileges.
    Concurrent Manager encountered an error while running Oracle*Report for your concurrent request 2820600.

    Review your concurrent request log and/or report output file for more detailed information.
    =================================================================================================

    PS: I have checked the file system , d:\oracle\viscomn\temp is a valid path. So any advice?

    thanks in advance.

  • RELEVANCY SCORE 2.24

    DB:2.24:Xi Adapter Not Visible In Comm Channel Monitoring ? x9


    Hi friends ,I am trying a proxy scenario in Discovery System V3 .But when we create XI receiver adapter we cannot see the status of that channel in communication channel monitoring .What could be the reason ? Any input will be appreciated Thanks.,V.Rangarajan

  • RELEVANCY SCORE 2.24

    DB:2.24:Getting Cs1566 (Error Reading Resource File) When Adding A Resource In Vs2008 8c


    I can compile projects without a resource without any problems, but as soon as i add a resource or create a new project which includes a resource file (e.g. windows Forms application) i get a
    Error reading resource file 'K:\TestProject\' -- 'Das System kann den angegebenen Pfad nicht finden. '
    (translation: 'The system cannot find the file specified.'). But as i look into the project folder thereare Resource1.resx and Resource1.Designer.cs so they are there...
    the Error help tells me, its the
    Compiler Error CS1566
    After deleting the resource file I dont get the error anymore...
    Other files, like Classes or windows forms don't make any trouble.
    Any Ideas about what the problem is or how to solve it?
    Thanks for your help!
    PS: I'm still a beginner so that could be any very trivial problem.

    DB:2.24:Getting Cs1566 (Error Reading Resource File) When Adding A Resource In Vs2008 8c

    Thanks for your reply! But its not exactly what i mentioned
    I have to create a foo.resx (in VS2008 Solution Explorer- ProjectName - right click - add - new item - Resources File). Then i can edit the resouce file. After this i have to use the windows command prompt, go to the folder and
    execute 'resgen foo.resx'. This creates the foo.resources file. Back to VS2008 I delete the foo.resx and add foo.resources.
    But shouldn't it work without me creating the foo.resources file manually?
    If i don't convert it manually,I can see the compiler arguments on Output - Build screen:
    c:\WINNT\Microsoft.NET\Framework\v3.5\Csc.exe /noconfig /nowarn:1701,1702 /errorreport:prompt /warn:4 /define:TRACE /reference:c:\WINNT\Microsoft.NET\Framework\v2.0.50727\System.Data.dll /reference:c:\WINNT\Microsoft.NET\Framework\v2.0.50727\System.dll /reference:c:\WINNT\Microsoft.NET\Framework\v2.0.50727\System.Xml.dll
    /debug:pdbonly /filealign:512 /optimize /out:obj\Release\Error.exe /resource: /target:exe Program.cs Properties\AssemblyInfo.cs Resource.Designer.cs
    And he tellswhat the problem is:
    error CS1566: Error reading resource file 'K:\ResourceFileFehler\Error\' -- 'Das System kann den angegebenen Pfad nicht finden. '
    Its the emtpy /resource: Argument, so it searches the folder itself as the resource file (Resource file would be 'K:\ResourceFileFehler\Error\Resource.resx) Its the same if I create the resx file in a sub folder (again K:\ResourceFileFehler\Error\ instead
    of K:\ResourceFileFehler\Error\subfolder\Resource.resx). With a second resx it even says there are2 resources with the name .
    Is there any setting that could prevent the program from giving the path of the resource files to the compiler?

  • RELEVANCY SCORE 2.24

    DB:2.24:Getting Cryptographic Error While Creating Strong Name For Assembly a8


    hi all,I am trying yo create strong name for assembly by giving below code:
    [

    assembly: AssemblyDelaySign(false)][assembly: AssemblyKeyFile(@Users\Anjali\Documents\Visual Studio 2008\Projects\codeaccesssecurity\codeaccesssecurity\bin\Debug\Anjali.snk)]
    [

    assembly: AssemblyKeyName()]after compiling the project i am getting error:Error1Cryptographic failure while signing assembly 'C:\Users\Anjali\Documents\Visual Studio 2008\Projects\codeaccesssecurity\codeaccesssecurity\obj\Release\codeaccesssecurity.exe' -- 'Error reading key file 'Users\Anjali\Documents\Visual Studio 2008\Projects\codeaccesssecurity\codeaccesssecurity\bin\Debug\Anjali.snk' -- The system cannot find the path specified. 'pls help.....

  • RELEVANCY SCORE 2.23

    DB:2.23:Cannot Create A New System Restorp Point s3


    When I try to createa new system restore point or restore to an existing restore point I get an error that the writer failed error code 0x800423F3

    DB:2.23:Cannot Create A New System Restorp Point s3

    Here's an article relating to that error message code (it would have helped if you included the entire error message EXACTLY as it was presented so we could target a better solution) which I think might help you with your problem:
    http://www.winvistaclub.com/t89.html.

    If you're using a Norton product, deactivate it before trying to do the system restore (it sometimes has an adverse effect).

    Although this won't fix the problem, you may try booting into safe mode (click repeatededly on the F8 button during the system boot until you get the menu) and seeing if you can set a restore point from there. If it works, then at least you'll have your restore
    point (and a workaround) but the problem will not be solved since you should be able to do it in normal mode and don't want to have to boot to safe mode every time you want to set a restore point). Besides that, the automatic restore points probably won't
    function until it works in normal mode.

    Go to Start / Control Panel / System / System Protection / and make sure that the C:\ drive is listed and checked in the Available Disks section. If it isn't checked, check it and that should solve the problem.

    System restore is often a target of malware so you may be infected by something. What A/V product(s) are you currently using (name and version)?
    Try to run anti-malware programs (in safe mode with networking if
    necessary).To fix this problem (if it is a problem) download,install, and run the following two programs:
    http://www.malwarebytes.org/mbam.phpand
    http://www.safer-networking.org/en/index.html. You may also want to try a free trial of Pandasoft (http://www.pandasecurity.com/usa/homeusers/solutions/global-protection/).
    Before downloading pandasoft, uninstall whatever anti-virus program you are currently using (because installing and running two at the same time can cause conflicts, freezes, and all sorts of problems). Once you've uninstalled your current AV program, download,
    install, update, and scan using Pandasoft. I think you might be amazed at how much it finds that the other software missed. Once complete, uninstall pandasoft and re-install your current AV program (unless you decide to switch which I did when I first tried
    it about 4 years ago). You may also want totry the new, free Microsoft Security Essentials
    http://www.softpedia.com/progDownload/Microsoft-Security-Essentials-Download-131683.html
    (with the same caveat that only ONE AV program can be installed and running on your system at any one time).
    You may also want to try the free Avira at: http://www.free-av.com/ and Avast at:
    http://www.avast.com/index.
    Reboot after completing all the scans. You may also want to try the free OneCare at
    http://onecare.live.com/site/en-us/default.htm and let it run all the options (except the registry cleaner) because that’s good
    maintenance (it will take some time to complete but can be done in the background). I realize this is a lot of programs, but if you are infected no one program is going to fix the problem (unless you luck out with your first choice). We want to run several
    to make SURE your system is clean and this can't happen again.

    I hope this helps.

    Good luck!

    Lorien - MCSE/MCSA/Network+/A+ --- If this post helps to resolve your issue, please click the "Mark as Answer" or "Helpful" button at the top of this message. By marking a post as Answered, or Helpful you help others find the answer faster.

  • RELEVANCY SCORE 2.23

    DB:2.23:Error In Crm Web Ui :Crm_Iu_Ic_Bi013 j3


    After i confirm the BP and premise in web UI 2007 i go to Meter Reading then I get 2 messages one is error message Details: CRM_IU_IC_BI013when i click on details I get the following infoDiagnosisAn error (communication error) occurred during the remote call of function module ISU_METERREAD_GET_REMOTE in meter reading data processing.System ResponseThe system cannot execute the action.ProcedureThis is probably only a temporary disruption. Restart your application later.If the problem is a permanent one, contact SAP.and second message is a information message saying New Meter Reading Results will be createdany suggestions?Thanks,

    DB:2.23:Error In Crm Web Ui :Crm_Iu_Ic_Bi013 j3

    Hi Review note 1113935 and apply latest support package for your system. Please check if notes 1145665, 1142946 and 1137523 are implemented in that system as well. Seem the correction is only via support package.Best regards,David

  • RELEVANCY SCORE 2.23

    DB:2.23:P2v Convert Failed At 95% A General System Error Occurred: Reconfiguration Failed kx



    Trying to convert HP dv2000 WinXP Home Laptop.

    Here are some of the errors in the logs. Any help would be much appreciated. My searching has yielded little.

    One warning in the Log Highlights was: Failed while updating drive letters for the target volume layout.

    ===========

    error Failed to retrieve media type for ?\Volume{380506fc-2ddd-11db-b221-806d6172696f}\: Incorrect function (1)

    2009-12-29 05:53:17.171 02096 verbose 'Ufa.HTTPService' User agent is 'VMware-client/4.0.0'

    ===========

    Partition:Invalid sector magic number.

    Disk number 1 has been skipped because of errors while reading partition table

    Partition:Invalid sector magic number.

    Disk number 1 has been skipped because of errors while reading dynamic disks header or LDM database is corrupted

    Partition:Invalid sector magic number.

    Partition:Invalid sector magic number.

    Partition:Invalid sector magic number.

    Partition:Invalid sector magic number.

    ===========

    error creating directory using CreateDirectoryEx: Cannot create a file when that file already exists (183)

    ===========

    Error 3 (error loading hive: The system cannot find the path specified (3)) loading temporary hive .\vstor2-mntapi10-374D384D007E00000000000001000000WINDOWS\system32\config\SYSTEM under key name mntApi286208973830050397.

    Unable to load registry hive .\vstor2-mntapi10-374D384D007E00000000000001000000WINDOWS\system32\config\SYSTEM, error 0x3.

    Failed to open registry hive, MNTAPI_ERROR = 50

    Cannot open the system registry hive. Skipping preserving drive letter mapping

    ===========

    Error 3 (error loading hive: The system cannot find the path specified (3)) loading temporary hive .\vstor2-mntapi10-374D384D007E00000000000003000000Boot\BCD under key name mntApi300615223830050397.

    Unable to load registry hive .\vstor2-mntapi10-374D384D007E00000000000003000000Boot\BCD, error 0x3.

    Error reading boot.ini file .\vstor2-mntapi10-374D384D007E00000000000003000000boot.ini

    ===========

    timeout=30

    default=multi(0)disk(0)rdisk(0)partition(1)\WINDOWS

    multi(0)disk(0)rdisk(0)partition(1)\WINDOWS="Microsoft Windows XP Home Edition" /noexecute=optin /fastdetect

    ReconfigurationTransaction: cached guest system volume

    Error 3 (error loading hive: The system cannot find the path specified (3)) loading temporary hive .\vstor2-mntapi10-374D384D007E00000000000003000000\WINDOWS\system32\config\SOFTWARE under key name mntApi301193348830050397.

    Unable to load registry hive .\vstor2-mntapi10-374D384D007E00000000000003000000\WINDOWS\system32\config\SOFTWARE, error 0x3.

    Error 50 when opening software hive

    Unable to read OS info from system disk: 50

    LocalPathToGuestSystemFolder: .\vstor2-mntapi10-374D384D007E00000000000003000000\

    LocalUndoFolder: .\vstor2-mntapi10-374D384D007E00000000000003000000\$Reconfig$

    Error 3 (error loading hive: The system cannot find the path specified (3)) loading temporary hive .\vstor2-mntapi10-374D384D007E00000000000003000000system32\config\SYSTEM under key name mntApi301224598830050397.

    Unable to load registry hive .\vstor2-mntapi10-374D384D007E00000000000003000000system32\config\SYSTEM, error 0x3.

    Can't access guest SYSTEM registry, error 50

    Writing the undo log ...

    Cleaning up temp directory C:\WINDOWS\TEMP\vmware-temp\vmware-SYSTEM\sysReconfig ...

    TaskImpl has failed with MethodFault::Exception: vmodl.fault.SystemError

    RecordOp ADD: event[9], task-1

    ConvertTask updates, state: 4, percentage: 95, xfer rate (Bps): 1615946

    Converter Task GetEvent(taskID=task-1)

    RecordOp ASSIGN: info, task-1

    Task failed:

    Converter Task SetError(taskID=task-1)

    Completing task task-1 with state=3

    ===========

    Error 1 setting SFN

    ===========

  • RELEVANCY SCORE 2.22

    DB:2.22: F-Menu Bar Buttons Partially Visible. How To Remove Bar? f8


    The system comes with a menu bar for the F-key functionalities. By moving mouse pointer to top of screen, it appears. I cannot seem to find out where I can uninstall og disable this annoying bar. It looks like a software error when it's not used. A small line of the buttons are visible and it irritates me. Help me how to remove, please?

    DB:2.22: F-Menu Bar Buttons Partially Visible. How To Remove Bar? f8

    Yes, if you want, you can turn it on again

    Glad I could help

    Bye

  • RELEVANCY SCORE 2.22

    DB:2.22:Interface Rs232 With Visual Basic 6.0... 1x


    here i got the coding for interface parallel port to visual...but with using this coding i would like to modify the which address should edit inthis coding so that can be connected both...actually im doing project in traffic light which can detect the fault
    indicator..im using ATmega32 and interface with rs232..could anybody help me...

    Option Explicit 'Declaration on all the input and output file
    Private Declare Function Inp32 Lib Dllport.dll (ByVal PortAddress As Integer) As Integer
    Private Declare Sub Out32 Lib Dllport.dll (ByVal PortAddress As Integer, ByVal Value As Integer)
    Dim Mydate As Date

    Private Sub Command1_click() 'Stop button
    Timer1.Interval = 0 'the timer for the program run
    Timer2.Interval = 0 'the timer for the date run
    End Sub

    Private Sub Command2_click() 'Run button
    Timer1.Interval = 500
    Timer2.Interval = 100
    End Sub

    Private Sub Command3_Click() 'Cancel button
    Unload Me
    Form4.Show
    End Sub

    Private Sub Timer1_Timer()
    'Reading input
    Label1.Caption = (Inp32(H379)) And 8 'red
    Label2.Caption = (Inp32(H379)) And 16 'orange
    Label3.Caption = (Inp32(H379)) And 32
    'green
    Label4.Caption = (Inp32(H379)) And 64
    'fault1

    If Label1.Caption = 8 Then 'the red light
    Shape2.Visible = True
    Shape1.Visible = False
    Label11.Caption = OK
    ElseIf Label1.Caption = 0 Then
    Shape2.Visible = False
    Shape1.Visible = True
    Label11.Caption = ERROR
    Beep
    End If

    If Label2.Caption = 16 Then 'the orange light
    Shape4.Visible = True
    Shape3.Visible = False
    Label16.Caption = OK
    ElseIf Label2.Caption = 0 Then
    Shape4.Visible = False
    Shape3.Visible = True
    Label16.Caption = ERROR
    Beep
    End If

    If Label3.Caption = 32 Then 'the green light
    Shape6.Visible = True
    Shape5.Visible = False
    Label17.Caption = OK
    ElseIf Label3.Caption = 0 Then
    Shape6.Visible = False
    Shape5.Visible = True
    Label17.Caption = ERROR
    Beep
    End If

    If Label4.Caption = 64 Then 'the fault 1
    Label10.Caption = OK
    ElseIf Label4.Caption = 0 Then
    Label10.Caption = ERROR
    Beep
    End If

    'Send the input to output data line
    If Label1.Caption = 8 Then Out32 H378, 1 'the output of red light
    If Label2.Caption = 16 Then Out32 H378, 2 'the output of orange light
    If Label3.Caption = 32 Then Out32 H378, 4 'the output of green light
    If Label4.Caption = 64 Then Out32 H378, 8 'the output of fault 1

    End Sub

    Private Sub Timer2_Timer()
    Label7.Caption = Date 'system date
    Label8.Caption = Time 'system date
    Mydate = Format(Label7.Caption, D - MMMM - YY)
    'system date
    Label9.Caption = Format(Mydate, dddd)

    End Sub

    Private Sub Form_Load() ' Set the traffic light at the start of the software
    Shape1.Visible = False
    Shape3.Visible = False
    Shape5.Visible = False
    Shape2.Visible = True
    Shape4.Visible = True
    Shape6.Visible = True
    End Sub

    DB:2.22:Interface Rs232 With Visual Basic 6.0... 1x


    Please Read
    http://social.msdn.microsoft.com/Forums/is/vblanguage/thread/aa350a38-3bb9-4919-9cc1-afaf7fed52f5

    These forums are for VB.NET questions and not VB6.
    So the link has resources that you can use for VB6 or you could download VB Express and start writing VB.NET code.

    Hi
    hanukaran,
    In addition to the above post from
    spotty you could go to this website for
    VB6 questions:
    http://www.programmersheaven.com/mb/VBasic/Board.aspx

    Regards,

    John

    Click this link to see how to insert a picture into a forum post.

    Installing VB6 on Windows 7

  • RELEVANCY SCORE 2.22

    DB:2.22:Payload Issues In Pi7.11 System 78



    hi,

    we have upgraded our pi system recently from PI7.0 to 7.11, we are seeing few payload issues in the newly upgraded system.

    scenario: file to file, using Central Adapter Engine and

    basically for a file to file interface , we are not able to see the payload in the messages. Though the message is failing at the recevicer determination pipeline. we are curious that why payload is not being displayed at the header level. But for other interfaces the payload is being visible.

    error: xml cannot be displayed

    cannot view xml input using style sheet, please correct the error and click the refresh button.

    Invalid at the top level of the document, error processing file:///c:/documents and settings

    1 TMECHBP 89912 85940 31.57

    missing equals sing between attribute and attribute value.

    The same scenario is working in 7.0 system and payload is visible but not in 7.11

    please share your inputs.

    thanks,

    durga

    DB:2.22:Payload Issues In Pi7.11 System 78


    As already mentioned above, it looks like the message shown in the monitor is no XML, but rather a flat file.

    Probably the file content conversion in the sender file communication channel is not migrated (in PI 7.0 you would see the same error in case a flat file would show up in the monitor without being converted).

    To check the 'real' content of the payload, you can go to the SXMB_MONI transaction and use a right mouse click on the payload to get a context menu which should have an entry "View Source". If you do so, then the content should be shown in some text editor and it should become clear whether the content is XML or not. If it is not, then please check the configuration of the file content conversion; if so, then check whether the content is valid XML.

  • RELEVANCY SCORE 2.22

    DB:2.22:I Have Just Installed My Back Up To A New Drive And Now I Am Getting An Error Message. Overclk. Error Reading Trayicon Clk- Visible Cannot Create Shell Notification Icon There Is No Overclocking On The System. ds


    Xp pro, pentium D 3200, 3Gb ram, nVidia graphics. I installed a new drive and re-installed my back up from a ghost image ( Acronis ) and everything went smoothly until I tried re-loading Word Pro. PC didn't boot, so removed Word Pro in safe mode. When
    I booted again I got the above error message, and each time I re-boot. Would appreciate a reply as to what could be causing this. Many thanks

    DB:2.22:I Have Just Installed My Back Up To A New Drive And Now I Am Getting An Error Message. Overclk. Error Reading Trayicon Clk- Visible Cannot Create Shell Notification Icon There Is No Overclocking On The System. ds

    Xp pro, pentium D 3200, 3Gb ram, nVidia graphics. I installed a new drive and re-installed my back up from a ghost image ( Acronis ) and everything went smoothly until I tried re-loading Word Pro. PC didn't boot, so removed Word Pro in safe mode. When
    I booted again I got the above error message, and each time I re-boot. Would appreciate a reply as to what could be causing this. Many thanks

  • RELEVANCY SCORE 2.22

    DB:2.22:Getting An Exception Eread Effor In Module Desktop At Startup fc


    Hi. I have a Vostro 220s Dell computer that I bought 6 months ago. I've just recently started getting this error message when I start up the computer:
    "JLE4059 Exception Eread Error in module desktop.exe at 002FC22. Error reading reading triDesktop Visible: Cannot create shell notification icon."
    Can someone tell me what this means and if there is anything I can do about it?

    Thank you,
    paulavac

    DB:2.22:Getting An Exception Eread Effor In Module Desktop At Startup fc

    4shared application for windows named desktop.exe, remove it from startup, solve the problem

  • RELEVANCY SCORE 2.22

    DB:2.22:Serviceadmin A/C In Iplanet 5.2 71


    ServiceAdmin account is not visible in startconsole search. When I try to create this A/C it says Cannot save to directory server netscape.ldap.LDAPException: error result (68); Already exists. Cannot login to Delegated Administrator as NDAUser. Says invalid credentials. Can anyone help?

    DB:2.22:Serviceadmin A/C In Iplanet 5.2 71

    You're not supposed to log into iDA as NDAuser. iDA uses NDAuser to log into LDAP.

    The password it will try to use is in clear text in DA's "resource.properties" file.

    Examine your LDAP access log when you try to log into iDA as ServiceAdmin. See the BIND attempt as NDAUser?

    Use the Console to re-set the NDAuser password to match the value in the file, or set a new password, and edit the file. Then try again.

    For the ServiceAdmin account, search for "admin", you should find it. Be logged into Console as "cn=Directory Manager"

  • RELEVANCY SCORE 2.21

    DB:2.21:Error Reading And Cannot Connect On Tv j1



    error message RDK 03006 HAVE UNPLUGED CABLE BOX WAITED 10 SEC. AND PLUGED BACK IN. TWICE NO RESULTS

    DB:2.21:Error Reading And Cannot Connect On Tv j1


    Hey guys

    I apologize for the issues. This is something Comcast is aware of and we are working for a resolution.

    You are not alone.

    This thread provides great info on the situation http://forums.comcast.com/t5/X1/Error-Encountered-​RDK-00104/td-p/2375573

  • RELEVANCY SCORE 2.21

    DB:2.21:W7 - Cannot Create System Image - Error Code Ox8078012d - Io Device Error Ox8007045d 79


    Just impossible to create a system image or to complete a back up ! copy system eimage and back up ae sent, seperately, to partition on original hard disk of 1.5 TB (bacj-k up partition is 500GB).
    Any idea how to solve this ?
    All help appreciated.

  • RELEVANCY SCORE 2.21

    DB:2.21:Thread: New Resource - Invalid Attribute dj


    Hi

    I have a GW7 SP3 system with a recently added GW8 Domain and Test PO. The GW8 domain is the Primary domain. eDir is 8.8 SP5

    All is fine except I cannot create Resources - I always get an Invalid Attrbute error message from ConsoleOne. While the resource is subsequently visible in the GroupWise system view, there is no eDir object.

    When trying to access the new resource object in the GroupWise system view, I get the error error occured converting the GW object to its eDirectory counterpart [...] the eDir counterpart does not exisit

    I have tried connecting to different domains (GW8 Pri and the other GW7 doms) as well as associating the resource to different post offices and users.

    Can any one suggest where to go looking for further detail here?

    Cheers, Dave

    DB:2.21:Thread: New Resource - Invalid Attribute dj

    Great solution. Whe had the same problem, with adding a resource. Whe have installed the right snapins, but looks that was not enough. But with this Tools, Groupwise Utilities, eDirectory schema check it works. And whe can add new resources in Groupwise.

    HKO

  • RELEVANCY SCORE 2.21

    DB:2.21:Error Creating Win32 Resources: Error Reading Icon... 8c


    In VS 2010 whenever I try to create a new Class Library type of project in VB.net I am getting the strange error while building - Error creating Win32 resources: Error reading icon 'C:\Users\jjames2\AppData\Roaming\Microsoft\VisualStudio\10.0\VSProjectApplication.ico'
    -- The system cannot find the path specified. ClassLibrary6 . Any answers?

    DB:2.21:Error Creating Win32 Resources: Error Reading Icon... 8c

    Hi JerinJames,
    Error message The system cannot find the path specified means the path does not exist for the drive specified, or the path was entered incorrectly. Please check if this path exists in your machine. If you can't find it, please repair your compiler
    to see if this issue can be solved. If you can find it, please check the permission of the folder.Please change the permission to fullcontrol to see if the system can find the path. Right-click the folder, choose properties, click security
    menu, then click advance. Like the picture below.

    Set the value of access as full control.
    Best regards,

    We are trying to better understand customer views on social support experience, so your participation in this interview project would be greatly appreciated if you have time. Thanks for helping make community forums a great place.

    Click
    HERE to participate the survey.

  • RELEVANCY SCORE 2.21

    DB:2.21:Failed To Create Printer Driver ... The System Cannot Find The Path Specified (3) j8


    I have just taken delivery of a shiny new Dell Laser Printer 1710n and Wireless Printer Adapter 3300. Unfortunately, it won't install. Here's what I did:

    Install 1710 driver

    Select Network Installation

    Select Local Installation
    pressed Next

    Highlighted listbox entry is ET0020004c2dd8|Discovered Printer|192.168.1.102
    pressed Next

    Dell Laser Printer 1710n|PCL
    Dell Laser Printer 1710n|PS
    Printer Name:Dell Laser Printer 1710n XL
    Share this printer with other computers:FALSE
    Set this printer as default:TRUE
    pressed Next

    Dell toner management system:FALSE
    User's Guide:TRUE
    Set IP Address Utility:FALSE
    Driver Profiler:FALSE
    Status Monitor Centre:FALSE
    Destination:C:\Program Files\Dell\Printer Software
    pressed Install

    Installation error:
    Failed to create printer driver Dell Laser Printer 1710n XL
    The system cannot find the path specified
    (3)

    Failed to create printer driver Dell Laser Printer 1710n PS
    The system cannot find the path specified
    (3)

    Congratulations!
    pressed Finish

    No printer visible in Printers & Faxes control panel applet

    I can open the printer server web page in a browser and see that the printer is connected and ready to go. But I can't see a printer on my machine. I'm running Windows XP SP2 on a Dell Inspiron 8200 with 512MB of RAM and about 1Gb of space on my hard drive. Any clues?

    Cheers,
    Guy Davidson

    DB:2.21:Failed To Create Printer Driver ... The System Cannot Find The Path Specified (3) j8

    I have just taken delivery of a shiny new Dell Laser Printer 1710n and Wireless Printer Adapter 3300. Unfortunately, it won't install. Here's what I did:

    Install 1710 driver

    Select Network Installation

    Select Local Installation
    pressed Next

    Highlighted listbox entry is ET0020004c2dd8|Discovered Printer|192.168.1.102
    pressed Next

    Dell Laser Printer 1710n|PCL
    Dell Laser Printer 1710n|PS
    Printer Name:Dell Laser Printer 1710n XL
    Share this printer with other computers:FALSE
    Set this printer as default:TRUE
    pressed Next

    Dell toner management system:FALSE
    User's Guide:TRUE
    Set IP Address Utility:FALSE
    Driver Profiler:FALSE
    Status Monitor Centre:FALSE
    Destination:C:\Program Files\Dell\Printer Software
    pressed Install

    Installation error:
    Failed to create printer driver Dell Laser Printer 1710n XL
    The system cannot find the path specified
    (3)

    Failed to create printer driver Dell Laser Printer 1710n PS
    The system cannot find the path specified
    (3)

    Congratulations!
    pressed Finish

    No printer visible in Printers & Faxes control panel applet

    I can open the printer server web page in a browser and see that the printer is connected and ready to go. But I can't see a printer on my machine. I'm running Windows XP SP2 on a Dell Inspiron 8200 with 512MB of RAM and about 1Gb of space on my hard drive. Any clues?

    Cheers,
    Guy Davidson

  • RELEVANCY SCORE 2.21

    DB:2.21:Error In Java Compilation: \S7u.Log (The System Cannot Find The File Specified) js


    Hi there,

    I got an error when I tried to compile a group of sqlj and java files. The error below:

    ----------------------------------------------sqlj -status -passes -compile=true -ser2class -d=. -classpath=.;%CLASSPATH% E:\work\src\java\com\interadnet\persistence\*.sqlj E:\work\src\java\com\interadnet\persistence\*.java

    out [Translating 53 files]
    out [Reading file AdServerInformationType]
    out [Reading file AdsType]
    out [Reading file AgencyType]
    out [Reading file CampaigntocompletionType]
    out [Reading file CampaignType]
    out [Reading file ChannelType]
    out [Reading file ClientType]
    out [Reading file CompletionType]
    out [Reading file ContactType]
    out [Reading file CreativeType]
    out [Reading file FtpServerType]
    out [Reading file InsertioninstructionType]
    out [Reading file MediaServerType]
    out [Reading file SystemPropertyType]
    out [Reading file VendorType]
    out [Reading file AdServerInformationTypeRef]
    out [Reading file AdServerInformationView]
    out [Reading file AdsTypeRef]
    out [Reading file AdsView]
    out [Reading file AgencyTypeRef]
    out [Reading file AgencyView]
    out [Reading file CampaigntocompletionTypeRef]
    out [Reading file CampaignToCompletionView]
    out [Reading file CampaignTypeRef]
    out [Reading file CampaignTypeRefs]
    out [Reading file CampaignView]
    out [Reading file ChannelTypeRef]
    out [Reading file ChannelTypeRefs]
    out [Reading file ChannelView]
    out [Reading file ClientTypeRef]
    out [Reading file ClientTypeRefs]
    out [Reading file ClientView]
    out [Reading file CompletionTypeRef]
    out [Reading file CompletionTypeRefs]
    out [Reading file CompletionView]
    out [Reading file ContactTypeRef]
    out [Reading file ContactView]
    out [Reading file CreativeTypeRef]
    out [Reading file CreativeTypeRefs]
    out [Reading file CreativeView]
    out [Reading file FtpServerTypeRef]
    out [Reading file FtpServerView]
    out [Reading file InsertioninstructionTypeRef]
    out [Reading file InsertioninstructionTypeRefs]
    out [Reading file InsertionInstructionView]
    out [Reading file MediaServerTypeRef]
    out [Reading file MediaServerView]
    out [Reading file SystemPropertyTypeRef]
    out [Reading file SystemPropertyTypeRefs]
    out [Reading file SystemPropertyView]
    out [Reading file VendorTypeRef]
    out [Reading file VendorTypeRefs]
    out [Reading file VendorView]
    out [Translating file AdServerInformationType]
    out [Translating file AdsType]
    out [Translating file AgencyType]
    out [Translating file CampaigntocompletionType]
    out [Translating file CampaignType]
    out [Translating file ChannelType]
    out [Translating file ClientType]
    out [Translating file CompletionType]
    out [Translating file ContactType]
    out [Translating file CreativeType]
    out [Translating file FtpServerType]
    out [Translating file InsertioninstructionType]
    out [Translating file MediaServerType]
    out [Translating file SystemPropertyType]
    out [Translating file VendorType]
    out [Translating file AdServerInformationTypeRef]
    out [Translating file AdServerInformationView]
    out [Translating file AdsTypeRef]
    out [Translating file AdsView]
    out [Translating file AgencyTypeRef]
    out [Translating file AgencyView]
    out [Translating file CampaigntocompletionTypeRef]
    out [Translating file CampaignToCompletionView]
    out [Translating file CampaignTypeRef]
    out [Translating file CampaignTypeRefs]
    out [Translating file CampaignView]
    out [Translating file ChannelTypeRef]
    out [Translating file ChannelTypeRefs]
    out [Translating file ChannelView]
    out [Translating file ClientTypeRef]
    out [Translating file ClientTypeRefs]
    out [Translating file ClientView]
    out [Translating file CompletionTypeRef]
    out [Translating file CompletionTypeRefs]
    out [Translating file CompletionView]
    out [Translating file ContactTypeRef]
    out [Translating file ContactView]
    out [Translating file CreativeTypeRef]
    out [Translating file CreativeTypeRefs]
    out [Translating file CreativeView]
    out [Translating file FtpServerTypeRef]
    out [Translating file FtpServerView]
    out [Translating file InsertioninstructionTypeRef]
    out [Translating file InsertioninstructionTypeRefs]
    out [Translating file InsertionInstructionView]
    out [Translating file MediaServerTypeRef]
    out [Translating file MediaServerView]
    out [Translating file SystemPropertyTypeRef]
    out [Translating file SystemPropertyTypeRefs]
    out [Translating file SystemPropertyView]
    out [Translating file VendorTypeRef]
    out [Translating file VendorTypeRefs]
    out [Translating file VendorView]
    out [Compiling 53 Java files]
    err*** The following character string is too long:
    err***
    out Error in Java compilation: \s7u.log (The system cannot find the file specified)

    Any suggestion appreciated.

    Daniel Huang

    DB:2.21:Error In Java Compilation: \S7u.Log (The System Cannot Find The File Specified) js

    Having not seen this before, I assume that the issue is that the command line string is too long when Javac is invoked.

    Here are a few things to reduce the size of the command line:

    - do not use the CLASSPATH option, but set the CLASSPATH environment variable (you can to that in a .bat file)

    - do not provide the .java files but rely on the implicit make capability in both, the SQLJ translator and the Java compiler. (Note: you must mention all of the .sqlj files that your program requires, do not rely on implicit make to find all of those.)

    - you can perform the -ser2class conversion as a separate step (see the SQLJ FAQ), as well as the Java compilation

    - there may or may not be a facility in your operating system to increase the size of the environment (and this may or may not have an effect on the maximum command line length)

    - you could try to omit the -passes option and see if that helps (that may actually be where your invocation if failing in the first place, in that it cannot write to some temporary file).

    Let us know how it goes. Thanks!

  • RELEVANCY SCORE 2.20

    DB:2.20:Wondering About Microsofts Stance On Encryption Of Code 3j


    MSDN Community,
    I was reading about creating procedures via the page here on MSDN and I got to the encryption flag and noticed it stated thefollowing:

    ENCRYPTION
    Indicates thatSQL Server will convert the original text of the CREATE PROCEDURE statement to an obfuscated format. The output of the obfuscation is not directly visible in any of the catalog views inSQL Server.
    Users who have no access to system tables or database files cannot retrieve the obfuscated text. However, the text will be available to privileged users who can either access system tables over theDAC
    portor directly access database files. Also, users who can attach a debugger to the server process can retrieve the decrypted procedure from memory at runtime.For more information about accessing system metadata, seeMetadata
    Visibility Configuration.

    The bolded lines above are what confuse me... isn't encryption out there to prevent the code from being viewed? Why would Microsoft then go on to give users a hint on how to decrypt it?
    Is Microsoft promoting reverse engineering?
    Would decrypting a stored procedure violate support contracts with Microsoft?

    I would love to hear from the MVPs and various Microsoft personnel on this!

    Thanks!
    -AmarettoSlim

    DB:2.20:Wondering About Microsofts Stance On Encryption Of Code 3j

    Good and easy to use explanation you found. Yep, your understanding seems right on the mark.Tibor Karaszi, SQL Server MVP |
    web | blog

  • RELEVANCY SCORE 2.20

    DB:2.20:How To Create Default Xml Application xj


    Hello,When I was importing xml files, it reported an error "Error reading the xml configuration default xml application". then I checked the /System/application/, but I cannot find default xml application there. Is there is any way I can create it? how? like creating a regular xml application?Thanks!

    DB:2.20:How To Create Default Xml Application xj

    http://support.documentum.com/support/resolutions/dmfrmresolutionview.asp?id=28501

  • RELEVANCY SCORE 2.20

    DB:2.20:Web Dynpro Project Migration Error cs



    Hello Friends,

    I am migrating Web Dynpro Java Project from 7.0 to 7.3 System. All the compilation error has been resolved and i see there is no local component visible, but i am still getting this error "Cannot create local component interface: Component already has a local component interface". Is there any way i could fix this? Please guide me / help me how to resolve this.

    Error Trace

    Status ERROR

    Plugin : com.sap.ide.webdynpro.componentmigration

    code=0

    Internal Error

    Plug-In Name: Web Dynpro Component Migration

    Internal Error : com.sap.ide.webdynpro.componentmigration

    Class : com.sap.ide.webdynpro.componentmigration.internal.actions.TriggerMigrationAction

    Method : run()

    Message : Cannot create local component interface: Component already has a local component interface

    Exception :

    Thanks,

    Sridhar

    DB:2.20:Web Dynpro Project Migration Error cs


    After spending quite amount of time, I could able to resolve the migration issue. I fixed this way
    Went to previous version for all the files migrated.Removed files LocalComponentInterface files or entries in any files (Removed XXX.wdlocalcompintfdef file)
    Hope it saves time for you.

  • RELEVANCY SCORE 2.20

    DB:2.20:Compilation Clocking Options Not Visible In Sysgen Token z8



    I cannot set the simulink system period. When I open the SysGen settings dialog with the SysGen token, both compilation and clocking settings are not accessible (see attached screenshot).

    On a multirate design i'm getting this error:

    The "Simulink system period" setting on this System Generator token is not appropriate for the rates used in the design.

    How can I make these settings accessible?

    I'm using Matlab 2014b 64Bit and ISE 14.7, Windows 7.

    Thank you

    Andreas










    Attachments:




    DB:2.20:Compilation Clocking Options Not Visible In Sysgen Token z8


    Hello Andreas

    Unfortunately, R2014b isn't supported with ISE SysGen 14.7. See this AR for a list of supported versions:

    http://www.xilinx.com/support/answers/17966.html




    www.xilinx.com

  • RELEVANCY SCORE 2.20

    DB:2.20:Pricing Error f3



    Hi Gurus,

    I was trying to create sales order and it says, system

    cannot implement pricing procedure.(PFA)

    DB:2.20:Pricing Error f3


    Hi Gurus,

    I was trying to create sales order and it says, system

    cannot implement pricing procedure.(PFA)

  • RELEVANCY SCORE 2.20

    DB:2.20:Create Directory On Openvms cd


    Hi all i create a directory on ovms server

    CREATE OR REPLACE DIRECTORY MY_FILES AS '$DISK2:[ADG.DATI_SPOOL_1]';

    How i can veriify if exists or if the directory is right?

    I create a procedure that read a file from this directory and i get an error on the file reading so i suspect that the directory is not visible or the path format is wrong for oracle.
    help?

    DB:2.20:Create Directory On Openvms cd

    pedro.riky wrote:
    i get this error :
    ORA-00600: internal error code, arguments: [9999], [], [], [], [], [], [], []
    00600. 00000 - "internal error code, arguments: [%s], [%s], [%s], [%s], [%s], [%s], [%s], [%s]"Cause: This is the generic internal error number for Oracle program
    exceptions.This indicates that a process has encountered an
    exceptional condition.
    Action: Report as a bug - the first argument is the internal error numbergood luck.

  • RELEVANCY SCORE 2.20

    DB:2.20:Exchange Server Error pf


    Microsoft Exchange Error
    --------------------------------------------------------
    The following error(s) occurred while saving changes:

    Set-ActiveSyncVirtualDirectory
    Failed
    Error:
    Unable to create Internet Information Services (IIS) directory entry. Error message is: The system cannot find the path specified.
    . HResult = -2147024893.

    The system cannot find the path specified.

    DB:2.20:Exchange Server Error pf

    When does the error message happen? Is it when you change some settings for exchange server? Please let me know the detail.

    To troubleshoot this problem, I recommend you first try to reset IIS:

    1. Click start button, click run.
    2. Type: iisreset

    Then testing the problem again.

  • RELEVANCY SCORE 2.20

    DB:2.20:Error: Cannot Create Instance Of Jstartupinitialfactory, Solman7_0_Ehp1 cz



    Hello,

    We have a problem on the installation of solution manager releated with java. Begining of the error message in callSdmViaSapinst.log and java.exe.log files are following:

    We have tried to place jstartupimpl.jar file to the directory /usr/sap/SLM/DVEBMGS01/j2ee in order to another SDN message SDM wont start - Cannot create class loader for JStartup Framework , but nothing changed.

    Also we tried to change the JStartup-root-dir tag from /usr/sap/SRD/DVEBMGS01/j2ee to /usr/sap/SRD/DVEBMGS01/exe in sdmrepository.sdc, but it did not fix the problem. Would you like to help us about the problem.

    *System Information:

    Operating system is Windows 2008 Enterprise 64 bit and database is MS SQL 2005.

    Java version is "j2sdk1.4.2_20-x64",

    Ph memory: 8 GB, swap 40 GB.*

    Info: Ending deployment prerequisites. All items are correct.

    Mar 26, 2010 2:49:06 PM Error: Cannot create instance of JStartupInitialFactory.

    Additional error message is:

    com.sap.sdm.util.classloaders.SDMClassLoaderException: Cannot create class loader for JStartup Framework.

    Additional error message is:

    com.sap.sdm.util.classloaders.SDMClassLoaderException: Cannot create class loader for component com.sap.sdm.is.jstartup.UTIL_JSTARTUP.

    Additional error message is:

    com.sap.sdm.util.classloaders.SDMClassLoaderException: Cannot create class loader instance: Jar file #1 cannot be read: C:\j2sdk1.4.2_20-x64\jstartupimpl.jar

    Mar 26, 2010 2:49:06 PM Error: Could not create JStartupFactory: Cannot create instance of JStartupInitialFactory.

    Additional error message is:

    com.sap.sdm.util.classloaders.SDMClassLoaderException: Cannot create class loader for JStartup Framework.

    Additional error message is:

    com.sap.sdm.util.classloaders.SDMClassLoaderException: Cannot create class loader for component com.sap.sdm.is.jstartup.UTIL_JSTARTUP.

    Additional error message is:

    com.sap.sdm.util.classloaders.SDMClassLoaderException: Cannot create class loader instance: Jar file #1 cannot be read: C:\j2sdk1.4.2_20-x64\jstartupimpl.jar Throwable: java.lang.IllegalStateException Throwable message: Cannot create instance of JStartupInitialFactory.

    Additional error message is:

    com.sap.sdm.util.classloaders.SDMClassLoaderException: Cannot create class loader for JStartup Framework.

    Additional error message is:

    com.sap.sdm.util.classloaders.SDMClassLoaderException: Cannot create class loader for component com.sap.sdm.is.jstartup.UTIL_JSTARTUP.

    Additional error message is:

    com.sap.sdm.util.classloaders.SDMClassLoaderException: Cannot create class loader instance: Jar file #1 cannot be read: C:\j2sdk1.4.2_20-x64\jstartupimpl.jar

    Mar 26, 2010 2:49:06 PM Error: Cannot create instance of JStartupInitialFactory.

    Additional error message is:

    com.sap.sdm.util.classloaders.SDMClassLoaderException: Cannot create class loader for JStartup Framework.

    Additional error message is:

    com.sap.sdm.util.classloaders.SDMClassLoaderException: Cannot create class loader for component com.sap.sdm.is.jstartup.UTIL_JSTARTUP.

    Additional error message is:

    com.sap.sdm.util.classloaders.SDMClassLoaderException: Cannot create class loader instance: Jar file #1 cannot be read: C:\j2sdk1.4.2_20-x64\jstartupimpl.jar

    Mar 26, 2010 2:49:06 PM Error: Could not create JStartupFactory: Cannot create instance of JStartupInitialFactory.

    Additional error message is:

    com.sap.sdm.util.classloaders.SDMClassLoaderException: Cannot create class loader for JStartup Framework.

    Additional error message is:

    com.sap.sdm.util.classloaders.SDMClassLoaderException: Cannot create class loader for component com.sap.sdm.is.jstartup.UTIL_JSTARTUP.

    Additional error message is:

    com.sap.sdm.util.classloaders.SDMClassLoaderException: Cannot create class loader instance: Jar file #1 cannot be read: C:\j2sdk1.4.2_20-x64\jstartupimpl.jar Throwable: java.lang.IllegalStateException Throwable message: Cannot create instance of JStartupInitialFactory.

    Additional error message is:

    com.sap.sdm.util.classloaders.SDMClassLoaderException: Cannot create class loader for JStartup Framework.

    Additional error message is:

    com.sap.sdm.util.classloaders.SDMClassLoaderException: Cannot create class loader for component com.sap.sdm.is.jstartup.UTIL_JSTARTUP.

    Additional error message is:

    com.sap.sdm.util.classloaders.SDMClassLoaderException: Cannot create class loader instance: Jar file #1 cannot be read: C:\j2sdk1.4.2_20-x64\jstartupimpl.jar

    Mar 26, 2010 2:49:06 PM Error: Received exception when saving current Engine state: Could not create JStartupFactory: Cannot create instance of JStartupInitialFactory.

    Additional error message is:

    com.sap.sdm.util.classloaders.SDMClassLoaderException: Cannot create class loader for JStartup Framework.

    Additional error message is:

    com.sap.sdm.util.classloaders.SDMClassLoaderException: Cannot create class loader for component com.sap.sdm.is.jstartup.UTIL_JSTARTUP.

    Additional error message is:

    com.sap.sdm.util.classloaders.SDMClassLoaderException: Cannot create class loader instance: Jar file #1 cannot be read: C:\j2sdk1.4.2_20-x64\jstartupimpl.jar

    Mar 26, 2010 2:49:06 PM Info: Starting: Initial deployment: Selected development component 'tc/webadministrator/scheduler'/'sap.com'/'SAP AG'/'7.01.2.2.20090120160525'/'0' will be deployed.

    Mar 26, 2010 2:49:06 PM Info: SDA to be deployed: E:\usr\sap\SLM\DVEBMGS01\SDM\root\origin\sap.com\tc\webadministrator\scheduler\SAP AG\0\7.01.2.20090120160720.0559\sap.comtcwebadministrator~scheduler.ear

    Mar 26, 2010 2:49:06 PM Info: Software type of SDA: J2EE

    Mar 26, 2010 2:49:06 PM Info: ***** Begin of SAP J2EE Engine Deployment (J2EE Application) *****

    Mar 26, 2010 2:49:06 PM Error: Cannot create instance of JStartupInitialFactory.

    Additional error message is:

    com.sap.sdm.util.classloaders.SDMClassLoaderException: Cannot create class loader for JStartup Framework.

    Additional error message is:

    com.sap.sdm.util.classloaders.SDMClassLoaderException: Cannot create class loader for component com.sap.sdm.is.jstartup.UTIL_JSTARTUP.

    Additional error message is:

    com.sap.sdm.util.classloaders.SDMClassLoaderException: Cannot create class loader instance: Jar file #1 cannot be read: C:\j2sdk1.4.2_20-x64\jstartupimpl.jar

    Mar 26, 2010 2:49:06 PM Error: Could not create JStartupFactory: Cannot create instance of JStartupInitialFactory.

    Additional error message is:

    com.sap.sdm.util.classloaders.SDMClassLoaderException: Cannot create class loader for JStartup Framework.

    Additional error message is:

    com.sap.sdm.util.classloaders.SDMClassLoaderException: Cannot create class loader for component com.sap.sdm.is.jstartup.UTIL_JSTARTUP.

    Additional error message is:

    com.sap.sdm.util.classloaders.SDMClassLoaderException: Cannot create class loader instance: Jar file #1 cannot be read: C:\j2sdk1.4.2_20-x64\jstartupimpl.jar Throwable: java.lang.IllegalStateException Throwable message: Cannot create instance of JStartupInitialFactory.

    Additional error message is:

    com.sap.sdm.util.classloaders.SDMClassLoaderException: Cannot create class loader for JStartup Framework.

    Additional error message is:

    com.sap.sdm.util.classloaders.SDMClassLoaderException: Cannot create class loader for component com.sap.sdm.is.jstartup.UTIL_JSTARTUP.

    Additional error message is:

    com.sap.sdm.util.classloaders.SDMClassLoaderException: Cannot create class loader instance: Jar file #1 cannot be read: C:\j2sdk1.4.2_20-x64\jstartupimpl.jar

    Mar 26, 2010 2:49:06 PM Info: No information about the J2EE engine cluster is available.

    The online deployment process is continuing.

    Mar 26, 2010 2:49:07 PM Info: ***** End of SAP J2EE Engine Deployment (J2EE Application) *****

    Mar 26, 2010 2:49:07 PM Error: Aborted: development component 'tc/webadministrator/scheduler'/'sap.com'/'SAP AG'/'7.01.2.2.20090120160525'/'0', grouped by software component 'LM-SERVICE'/'sap.com'/'SAP AG'/'1000.7.01.2.2.20090120160720''/'17':

    Caught exception while checking the login credentials for SAP J2EE Engine. Check whether the SAP J2EE Engine is up and running.

    com.sap.engine.deploy.manager.DeployManagerException: ERROR: Cannot connect to Host: [SAP-TEST] with user name: [J2EE_ADMIN]

    Check your login information.

    Mar 26, 2010 2:49:07 PM Info: Starting to save the repository

    Mar 26, 2010 2:49:08 PM Info: Finished saving the repository

    Mar 26, 2010 2:49:08 PM Info: Starting: Initial deployment: Selected software component 'LM-SERVICE'/'sap.com'/'SAP AG'/'1000.7.01.2.2.20090120160720''/'17' will be deployed.

    Mar 26, 2010 2:49:08 PM Error: Aborted: software component 'LM-SERVICE'/'sap.com'/'SAP AG'/'1000.7.01.2.2.20090120160720''/'17':

    Failed deployment of SDAs:

    development component 'tc/webadministrator/scheduler'/'sap.com'/'SAP AG'/'7.01.2.2.20090120160525'/'0' : aborted

    Please, look at error logs above for more information!

    Mar 26, 2010 2:49:08 PM Info: Starting to save the repository

    Mar 26, 2010 2:49:08 PM Info: Finished saving the repository

    Mar 26, 2010 2:49:08 PM Error: Cannot create instance of JStartupInitialFactory.

    Additional error message is:

    com.sap.sdm.util.classloaders.SDMClassLoaderException: Cannot create class loader for JStartup Framework.

    Additional error message is:

    com.sap.sdm.util.classloaders.SDMClassLoaderException: Cannot create class loader for component com.sap.sdm.is.jstartup.UTIL_JSTARTUP.

    Additional error message is:

    com.sap.sdm.util.classloaders.SDMClassLoaderException: Cannot create class loader instance: Jar file #1 cannot be read: C:\j2sdk1.4.2_20-x64\jstartupimpl.jar

    Mar 26, 2010 2:49:08 PM Error: Could not create JStartupFactory: Cannot create instance of JStartupInitialFactory.

    Additional error message is:

    com.sap.sdm.util.classloaders.SDMClassLoaderException: Cannot create class loader for JStartup Framework.

    Additional error message is:

    com.sap.sdm.util.classloaders.SDMClassLoaderException: Cannot create class loader for component com.sap.sdm.is.jstartup.UTIL_JSTARTUP.

    Additional error message is:

    com.sap.sdm.util.classloaders.SDMClassLoaderException: Cannot create class loader instance: Jar file #1 cannot be read: C:\j2sdk1.4.2_20-x64\jstartupimpl.jar Throwable: java.lang.IllegalStateException Throwable message: Cannot create instance of JStartupInitialFactory.

    Additional error message is:

    com.sap.sdm.util.classloaders.SDMClassLoaderException: Cannot create class loader for JStartup Framework.

    Additional error message is:

    com.sap.sdm.util.classloaders.SDMClassLoaderException: Cannot create class loader for component com.sap.sdm.is.jstartup.UTIL_JSTARTUP.

    Additional error message is:

    com.sap.sdm.util.classloaders.SDMClassLoaderException: Cannot create class loader instance: Jar file #1 cannot be read: C:\j2sdk1.4.2_20-x64\jstartupimpl.jar

    Mar 26, 2010 2:49:08 PM Error: Received exception when restoring Engine state: Could not create JStartupFactory: Cannot create instance of JStartupInitialFactory.

    Additional error message is:

    com.sap.sdm.util.classloaders.SDMClassLoaderException: Cannot create class loader for JStartup Framework.

    Additional error message is:

    com.sap.sdm.util.classloaders.SDMClassLoaderException: Cannot create class loader for component com.sap.sdm.is.jstartup.UTIL_JSTARTUP.

    Additional error message is:

    com.sap.sdm.util.classloaders.SDMClassLoaderException: Cannot create class loader instance: Jar file #1 cannot be read: C:\j2sdk1.4.2_20-x64\jstartupimpl.jar

    Mar 26, 2010 2:49:08 PM Error: -

    At least one of the Deployments failed -

    Mar 26, 2010 2:49:08 PM Info: Summarizing the deployment results:

    Mar 26, 2010 2:49:08 PM Error: Aborted: E:\SOLMANDVDS\SOLMAN_EH_70\JAVA\DATA_UNITS\SOLMAN_JAVA_UT_SOLMAN\LMSERVICE02_2.SCA

    Mar 26, 2010 2:49:08 PM Error: Processing error. Return code: 4

    DB:2.20:Error: Cannot Create Instance Of Jstartupinitialfactory, Solman7_0_Ehp1 cz


    Hello,

    We have a problem on the installation of solution manager releated with java. Begining of the error message in callSdmViaSapinst.log and java.exe.log files are following:

    We have tried to place jstartupimpl.jar file to the directory /usr/sap/SLM/DVEBMGS01/j2ee in order to another SDN message SDM wont start - Cannot create class loader for JStartup Framework , but nothing changed.

    Also we tried to change the JStartup-root-dir tag from /usr/sap/SRD/DVEBMGS01/j2ee to /usr/sap/SRD/DVEBMGS01/exe in sdmrepository.sdc, but it did not fix the problem. Would you like to help us about the problem.

    *System Information:

    Operating system is Windows 2008 Enterprise 64 bit and database is MS SQL 2005.

    Java version is "j2sdk1.4.2_20-x64",

    Ph memory: 8 GB, swap 40 GB.*

    Info: Ending deployment prerequisites. All items are correct.

    Mar 26, 2010 2:49:06 PM Error: Cannot create instance of JStartupInitialFactory.

    Additional error message is:

    com.sap.sdm.util.classloaders.SDMClassLoaderException: Cannot create class loader for JStartup Framework.

    Additional error message is:

    com.sap.sdm.util.classloaders.SDMClassLoaderException: Cannot create class loader for component com.sap.sdm.is.jstartup.UTIL_JSTARTUP.

    Additional error message is:

    com.sap.sdm.util.classloaders.SDMClassLoaderException: Cannot create class loader instance: Jar file #1 cannot be read: C:\j2sdk1.4.2_20-x64\jstartupimpl.jar

    Mar 26, 2010 2:49:06 PM Error: Could not create JStartupFactory: Cannot create instance of JStartupInitialFactory.

    Additional error message is:

    com.sap.sdm.util.classloaders.SDMClassLoaderException: Cannot create class loader for JStartup Framework.

    Additional error message is:

    com.sap.sdm.util.classloaders.SDMClassLoaderException: Cannot create class loader for component com.sap.sdm.is.jstartup.UTIL_JSTARTUP.

    Additional error message is:

    com.sap.sdm.util.classloaders.SDMClassLoaderException: Cannot create class loader instance: Jar file #1 cannot be read: C:\j2sdk1.4.2_20-x64\jstartupimpl.jar Throwable: java.lang.IllegalStateException Throwable message: Cannot create instance of JStartupInitialFactory.

    Additional error message is:

    com.sap.sdm.util.classloaders.SDMClassLoaderException: Cannot create class loader for JStartup Framework.

    Additional error message is:

    com.sap.sdm.util.classloaders.SDMClassLoaderException: Cannot create class loader for component com.sap.sdm.is.jstartup.UTIL_JSTARTUP.

    Additional error message is:

    com.sap.sdm.util.classloaders.SDMClassLoaderException: Cannot create class loader instance: Jar file #1 cannot be read: C:\j2sdk1.4.2_20-x64\jstartupimpl.jar

    Mar 26, 2010 2:49:06 PM Error: Cannot create instance of JStartupInitialFactory.

    Additional error message is:

    com.sap.sdm.util.classloaders.SDMClassLoaderException: Cannot create class loader for JStartup Framework.

    Additional error message is:

    com.sap.sdm.util.classloaders.SDMClassLoaderException: Cannot create class loader for component com.sap.sdm.is.jstartup.UTIL_JSTARTUP.

    Additional error message is:

    com.sap.sdm.util.classloaders.SDMClassLoaderException: Cannot create class loader instance: Jar file #1 cannot be read: C:\j2sdk1.4.2_20-x64\jstartupimpl.jar

    Mar 26, 2010 2:49:06 PM Error: Could not create JStartupFactory: Cannot create instance of JStartupInitialFactory.

    Additional error message is:

    com.sap.sdm.util.classloaders.SDMClassLoaderException: Cannot create class loader for JStartup Framework.

    Additional error message is:

    com.sap.sdm.util.classloaders.SDMClassLoaderException: Cannot create class loader for component com.sap.sdm.is.jstartup.UTIL_JSTARTUP.

    Additional error message is:

    com.sap.sdm.util.classloaders.SDMClassLoaderException: Cannot create class loader instance: Jar file #1 cannot be read: C:\j2sdk1.4.2_20-x64\jstartupimpl.jar Throwable: java.lang.IllegalStateException Throwable message: Cannot create instance of JStartupInitialFactory.

    Additional error message is:

    com.sap.sdm.util.classloaders.SDMClassLoaderException: Cannot create class loader for JStartup Framework.

    Additional error message is:

    com.sap.sdm.util.classloaders.SDMClassLoaderException: Cannot create class loader for component com.sap.sdm.is.jstartup.UTIL_JSTARTUP.

    Additional error message is:

    com.sap.sdm.util.classloaders.SDMClassLoaderException: Cannot create class loader instance: Jar file #1 cannot be read: C:\j2sdk1.4.2_20-x64\jstartupimpl.jar

    Mar 26, 2010 2:49:06 PM Error: Received exception when saving current Engine state: Could not create JStartupFactory: Cannot create instance of JStartupInitialFactory.

    Additional error message is:

    com.sap.sdm.util.classloaders.SDMClassLoaderException: Cannot create class loader for JStartup Framework.

    Additional error message is:

    com.sap.sdm.util.classloaders.SDMClassLoaderException: Cannot create class loader for component com.sap.sdm.is.jstartup.UTIL_JSTARTUP.

    Additional error message is:

    com.sap.sdm.util.classloaders.SDMClassLoaderException: Cannot create class loader instance: Jar file #1 cannot be read: C:\j2sdk1.4.2_20-x64\jstartupimpl.jar

    Mar 26, 2010 2:49:06 PM Info: Starting: Initial deployment: Selected development component 'tc/webadministrator/scheduler'/'sap.com'/'SAP AG'/'7.01.2.2.20090120160525'/'0' will be deployed.

    Mar 26, 2010 2:49:06 PM Info: SDA to be deployed: E:\usr\sap\SLM\DVEBMGS01\SDM\root\origin\sap.com\tc\webadministrator\scheduler\SAP AG\0\7.01.2.20090120160720.0559\sap.comtcwebadministrator~scheduler.ear

    Mar 26, 2010 2:49:06 PM Info: Software type of SDA: J2EE

    Mar 26, 2010 2:49:06 PM Info: ***** Begin of SAP J2EE Engine Deployment (J2EE Application) *****

    Mar 26, 2010 2:49:06 PM Error: Cannot create instance of JStartupInitialFactory.

    Additional error message is:

    com.sap.sdm.util.classloaders.SDMClassLoaderException: Cannot create class loader for JStartup Framework.

    Additional error message is:

    com.sap.sdm.util.classloaders.SDMClassLoaderException: Cannot create class loader for component com.sap.sdm.is.jstartup.UTIL_JSTARTUP.

    Additional error message is:

    com.sap.sdm.util.classloaders.SDMClassLoaderException: Cannot create class loader instance: Jar file #1 cannot be read: C:\j2sdk1.4.2_20-x64\jstartupimpl.jar

    Mar 26, 2010 2:49:06 PM Error: Could not create JStartupFactory: Cannot create instance of JStartupInitialFactory.

    Additional error message is:

    com.sap.sdm.util.classloaders.SDMClassLoaderException: Cannot create class loader for JStartup Framework.

    Additional error message is:

    com.sap.sdm.util.classloaders.SDMClassLoaderException: Cannot create class loader for component com.sap.sdm.is.jstartup.UTIL_JSTARTUP.

    Additional error message is:

    com.sap.sdm.util.classloaders.SDMClassLoaderException: Cannot create class loader instance: Jar file #1 cannot be read: C:\j2sdk1.4.2_20-x64\jstartupimpl.jar Throwable: java.lang.IllegalStateException Throwable message: Cannot create instance of JStartupInitialFactory.

    Additional error message is:

    com.sap.sdm.util.classloaders.SDMClassLoaderException: Cannot create class loader for JStartup Framework.

    Additional error message is:

    com.sap.sdm.util.classloaders.SDMClassLoaderException: Cannot create class loader for component com.sap.sdm.is.jstartup.UTIL_JSTARTUP.

    Additional error message is:

    com.sap.sdm.util.classloaders.SDMClassLoaderException: Cannot create class loader instance: Jar file #1 cannot be read: C:\j2sdk1.4.2_20-x64\jstartupimpl.jar

    Mar 26, 2010 2:49:06 PM Info: No information about the J2EE engine cluster is available.

    The online deployment process is continuing.

    Mar 26, 2010 2:49:07 PM Info: ***** End of SAP J2EE Engine Deployment (J2EE Application) *****

    Mar 26, 2010 2:49:07 PM Error: Aborted: development component 'tc/webadministrator/scheduler'/'sap.com'/'SAP AG'/'7.01.2.2.20090120160525'/'0', grouped by software component 'LM-SERVICE'/'sap.com'/'SAP AG'/'1000.7.01.2.2.20090120160720''/'17':

    Caught exception while checking the login credentials for SAP J2EE Engine. Check whether the SAP J2EE Engine is up and running.

    com.sap.engine.deploy.manager.DeployManagerException: ERROR: Cannot connect to Host: [SAP-TEST] with user name: [J2EE_ADMIN]

    Check your login information.

    Mar 26, 2010 2:49:07 PM Info: Starting to save the repository

    Mar 26, 2010 2:49:08 PM Info: Finished saving the repository

    Mar 26, 2010 2:49:08 PM Info: Starting: Initial deployment: Selected software component 'LM-SERVICE'/'sap.com'/'SAP AG'/'1000.7.01.2.2.20090120160720''/'17' will be deployed.

    Mar 26, 2010 2:49:08 PM Error: Aborted: software component 'LM-SERVICE'/'sap.com'/'SAP AG'/'1000.7.01.2.2.20090120160720''/'17':

    Failed deployment of SDAs:

    development component 'tc/webadministrator/scheduler'/'sap.com'/'SAP AG'/'7.01.2.2.20090120160525'/'0' : aborted

    Please, look at error logs above for more information!

    Mar 26, 2010 2:49:08 PM Info: Starting to save the repository

    Mar 26, 2010 2:49:08 PM Info: Finished saving the repository

    Mar 26, 2010 2:49:08 PM Error: Cannot create instance of JStartupInitialFactory.

    Additional error message is:

    com.sap.sdm.util.classloaders.SDMClassLoaderException: Cannot create class loader for JStartup Framework.

    Additional error message is:

    com.sap.sdm.util.classloaders.SDMClassLoaderException: Cannot create class loader for component com.sap.sdm.is.jstartup.UTIL_JSTARTUP.

    Additional error message is:

    com.sap.sdm.util.classloaders.SDMClassLoaderException: Cannot create class loader instance: Jar file #1 cannot be read: C:\j2sdk1.4.2_20-x64\jstartupimpl.jar

    Mar 26, 2010 2:49:08 PM Error: Could not create JStartupFactory: Cannot create instance of JStartupInitialFactory.

    Additional error message is:

    com.sap.sdm.util.classloaders.SDMClassLoaderException: Cannot create class loader for JStartup Framework.

    Additional error message is:

    com.sap.sdm.util.classloaders.SDMClassLoaderException: Cannot create class loader for component com.sap.sdm.is.jstartup.UTIL_JSTARTUP.

    Additional error message is:

    com.sap.sdm.util.classloaders.SDMClassLoaderException: Cannot create class loader instance: Jar file #1 cannot be read: C:\j2sdk1.4.2_20-x64\jstartupimpl.jar Throwable: java.lang.IllegalStateException Throwable message: Cannot create instance of JStartupInitialFactory.

    Additional error message is:

    com.sap.sdm.util.classloaders.SDMClassLoaderException: Cannot create class loader for JStartup Framework.

    Additional error message is:

    com.sap.sdm.util.classloaders.SDMClassLoaderException: Cannot create class loader for component com.sap.sdm.is.jstartup.UTIL_JSTARTUP.

    Additional error message is:

    com.sap.sdm.util.classloaders.SDMClassLoaderException: Cannot create class loader instance: Jar file #1 cannot be read: C:\j2sdk1.4.2_20-x64\jstartupimpl.jar

    Mar 26, 2010 2:49:08 PM Error: Received exception when restoring Engine state: Could not create JStartupFactory: Cannot create instance of JStartupInitialFactory.

    Additional error message is:

    com.sap.sdm.util.classloaders.SDMClassLoaderException: Cannot create class loader for JStartup Framework.

    Additional error message is:

    com.sap.sdm.util.classloaders.SDMClassLoaderException: Cannot create class loader for component com.sap.sdm.is.jstartup.UTIL_JSTARTUP.

    Additional error message is:

    com.sap.sdm.util.classloaders.SDMClassLoaderException: Cannot create class loader instance: Jar file #1 cannot be read: C:\j2sdk1.4.2_20-x64\jstartupimpl.jar

    Mar 26, 2010 2:49:08 PM Error: -

    At least one of the Deployments failed -

    Mar 26, 2010 2:49:08 PM Info: Summarizing the deployment results:

    Mar 26, 2010 2:49:08 PM Error: Aborted: E:\SOLMANDVDS\SOLMAN_EH_70\JAVA\DATA_UNITS\SOLMAN_JAVA_UT_SOLMAN\LMSERVICE02_2.SCA

    Mar 26, 2010 2:49:08 PM Error: Processing error. Return code: 4

  • RELEVANCY SCORE 2.20

    DB:2.20:Users Are Not Visible In Cmc 73



    We are using BusinnessObjects 3.1 SP3 FP 3.3. In CMC, we don't see the user list. We know that there are users exist in BO because when I check the groups in CMC, I am able to see users. When i try to create a new user, it creates it, but when i try to join the new user to groups, i cannot see them in the list. I thought it didn't create the user, but when i tried to create it again, i gave me an error saying that there is a user with the same name. When I click on the USER LIST, no users are visible. When I click on the groups, I can see the users belong to that group.

    I am pretty sure that there are users because all the users can login to the system and work.

    Does any have any suggestion?

    Thanks.

    DB:2.20:Users Are Not Visible In Cmc 73


    hi,

    In CMC,

    Users and Groups - User List

    Manage - Top-level Security - All Users

    View Security and re-assign the appropriate security.

    Regards,

    Vamsee

  • RELEVANCY SCORE 2.20

    DB:2.20:Error : \\Pp\\Sapmnt Unable To Create Parent Node fa



    Dear ALL,

    I am installing ECC6 with SQL database

    error reading PPsapmnt Cannot create parent node

    REGARDs

    Jessy

  • RELEVANCY SCORE 2.20

    DB:2.20:Systems Not Showing 39



    I am trying to create a model. The systems are visible from within the portal system configuration. But when I choose "Find Data", from VC, no systems are visible.

    DB:2.20:Systems Not Showing 39


    Maybe you don't have the privilege, or it's not for VC actually. You can define system by yourself.

  • RELEVANCY SCORE 2.19

    DB:2.19:Reading Multiple Flatfiles 9d


    I need to read multiple flat files (csv format) from a folder and insert them into respective tables in Sql database. All these flat files have different columns. I am using For each Loop to read the files and trying to create table name dynamically as the
    file name is same as table name. If I use Bulk insert where I am using expressions to set the Destination Table name Source connection would be the Flat file connection manager but I am getting below error. Is there a better way to read the files
    and insert the data dynamically to respective table.

    [Bulk Insert Task] Error: An error occurred with the following error message: Cannot bulk load because the file C:\Test\Testing.csv
    could not be opened. Operating system error code 3(failed to retrieve text for this error. Reason: 1815)..

    Many Thanks in advance
    J

    Jaya

    DB:2.19:Reading Multiple Flatfiles 9d

    Hi Mike
    Thanks for the reply. I will the try the dynamic column mapping using the script component.
    Regards

    Jaya

  • RELEVANCY SCORE 2.19

    DB:2.19:Scheduled Agent Cannot Create System Shell Notification Icon md


    The subject error has appeared at boot up for some time. My os is Windows 7. Is this error a problem that needs resolving? Has someone a solution please? Thanks.

    DB:2.19:Scheduled Agent Cannot Create System Shell Notification Icon md

    Hi Roy,

    Since when are you facing this issue?

    If you have missing Icons in the system tray, it is most likely a timing issue in Startup of programs conflicting with one another. Or a program in your startup is corrupted in some way. In your case, since the error message
    doesn't specifically state which program, it's going to be a matter of narrowing down which one.

    You need to perform a clean boot and see if the message goes away. If it does, you will need to add back, one at a time, each item in startup until you isolate the program for which the issue is occuring, then uninstall it, reboot, reinstall. If the issuepersists,
    you will need to contact the support department for the program and see if they can help.

    Refer to:
    How to perform a clean boot to troubleshoot a problem in Windows 8, Windows 7, or Windows Vista

    http://support.microsoft.com/kb/929135

    Note: Once you are done with the troubleshooting, perform the steps from
    Step 3: to reset computer as usual.

    Please post with the issue status.

  • RELEVANCY SCORE 2.19

    DB:2.19:Thread: Cannot Create Broker cz


    Not sure if this is best for iPrint or iManager

    I am trying to create a new broker and it gives me an error when attempting to do this:

    A system error occurred

    NW 6.5 SP4

    iManager Version 2.0.2

    DB:2.19:Thread: Cannot Create Broker cz

    Mike,

    It appears that in the past few days you have not received a response

    to your

    posting. That concerns us, and has triggered this automated reply.

    Has your problem been resolved? If not, you might try one of the

    following options:

    - Do a search of our knowledgebase at

    http://support.novell.com/search/kb_index.jsp

    - Check all of the other support tools and options available at

    http://support.novell.com.

    - You could also try posting your message again. Make sure it is posted

    in the

    correct newsgroup. (http://support.novell.com/forums)

    Be sure to read the forum FAQ about what to expect in the way of

    responses:

    http://support.novell.com/forums/faq_general.html

    If this is a reply to a duplicate posting, please ignore and accept our

    apologies

    and rest assured we will issue a stern reprimand to our posting bot.

    Good luck!

    Your Novell Product Support Forums Team

    http://support.novell.com/forums/

    If your tring to install ndps and broker on a other volume than sys:

    example ndps: volume than you have first have to copy sys:ndps folder to

    the ndps: volume. Install of broker and manager can be done then.

    Regards,

    Richard

  • RELEVANCY SCORE 2.19

    DB:2.19:Labview Executable Error - System Cannot Find The File Specified 8a



    Hi

    I amtrying to create a stand-alone application and I'm getting the error message below:

    "System cannot find the file specified"

    This error message occurs when I run the setup.exe. Does any one know why this is happening? I've also attached the error message screenshot.

    Thanks










    Attachments:







    Specified file error.png ‏34 KB

  • RELEVANCY SCORE 2.19

    DB:2.19:Project Self Service (Pss) Cannot Show Favorites Project mf



    Hi all,

    I am a new of Project Self Service(PSS).

    I have just configed PSS with following system alias names

    + cProjects: SAP_cProjects - maybe config wrong

    + ERP system: SAP_ECC_cProjects - not config

    + J2EE-JCo connections: SAP_cProjects, SAP_cProjects_MetaData,

    SAP_ERP_cProjects, SAP_ERP_cProjects_MetaData,

    SAP_R3_HumanResources, SAP_R3_HumanResources_MetaData

    SAP_R3_SelfServiceGenerics, SAP_R3_SelfServiceGenerics_MetaData

    - test connections successful.

    I can create project by PSS and add into my favorites But I have some problems:

    + My worklist cannot show any project. It is show

    "bCannot display project data. Either no data exists or a reading error occurred/b."

    So. I cannot choose project for confirm task

    - Please help me solve problem .

    - Could you share documents/manuals of PSS? Thanks.

    My Yahoo mail: minhit83@yahoo.com.

    Many thanks in advance

  • RELEVANCY SCORE 2.19

    DB:2.19:Error Cannot Create System Shell Notification Icon sk


    When forst opening Windows 7 this message is on the monitor Photo Manager Error Reading Traylcon-Visible: Cannot Create System Shell Notification Icon

    DB:2.19:Error Cannot Create System Shell Notification Icon sk

    Hello,

    Great to know that the issue got resolved. Do let us know if you face any further issues with Windows operating system in future.

    Regards,
    Meghmala – Microsoft Support

  • RELEVANCY SCORE 2.19

    DB:2.19:Still Unable Windows Update Error 80246008. Bits Will Not Start 8j


    Windows Update Error 80246008.
    The last update was August 3. Each time update runs I get the failed to update error.
    I'm running Windows Vista Home Premium ver 6.0 (Build 6002) SP2
    After reading and searching I checked my BITS service. It was not even listed in Services so after reading forums, I re-registered BITS by typing the following the text in the cammand prompt box:
    "sc create BITS binpath= "c:\windows\system32\svchost.exe -k netsvcs" start= delayed-auto"
    I got the message, service enabled. I re-started, and found BITS on my service list for the first time (it hadn't been there before) but it looked like it was missing some information that the other services had. When I tried to start the service from Control
    Panel\System and Security\Administrative Tools, I got an error msg saying:
    "Windows can not start the BITS service"
    "Error 2 the system cannot find the file specified."
    I have run FixIt, and have read multiple forum relpys but nothing seems to work so far. Where do I go from here? I'm thinking I'll need to a system restore to original manufacturer's settings and re-install Windows, but I didn't get the software when I purchased
    this computer (software was pre-installed).
    Any help would be really appreciated!!

    DB:2.19:Still Unable Windows Update Error 80246008. Bits Will Not Start 8j

    [McAfee Security Scan Plus]is what I have used ever since I [removed the preinstalled Norton free-trialware] in 2010...I don't recall if I ran Norton Removal Tool.
    Then I have no choice but to conclude that you'reseeing the effects of an ongoing
    longstandinghijackware infection, most likely compounded by a W32/Alureon-variant rootkit infection! See...
    • Cleaning a Compromised System

    http://technet.microsoft.com/en-us/library/cc700813.aspx
    Then see the (my) ANSWER post in this thread and follow those instructions(to-the-letter
    in order! ) to return your computer to a secure functional state:
    http://answers.microsoft.com/thread/c44429fb-3f7c-4646-8529-5a97bb3cd0eb
    If you need additional assistance with the clean install,you canbeginyour own,new thread in this forum:

    http://answers.microsoft.com/en-us/windows/forum/windows_vista-system
    If these procedures are outside of your technical "comfort zone" - and there is no shame in admitting this isn't your cup of tea - take the computer to a local, reputable and
    independent (i.e., not a "BigBoxStore" or the Geek Squad!) computer repair shop let them do the work.
    Note: The computer should NOT be connected to the internet or any local networks (i.e., other computers) in its current state. All of your personal data (e.g., online banking credit-card passwords) should be considered at-risk, if not
    already compromised.
    Wish I'd had better news for you. Good luck!
    Since I have nothing further to add to this discussion, Iwillno longer bemonitoring this thread.

  • RELEVANCY SCORE 2.19

    DB:2.19:Smuff1asdccn Connection Error pc



    when I used tcode SMSY to create a RFC from Solution manager to Target system,the system displayed red light and had a error as follow:

    SDCCN connection error; connect manually

    Message no. SMSY_EDIT_LANDSCAPE154

    Diagnosis

    You tried to put the RFC destination SM_SLMCLNT100_BACK in the satellite system in the SAP Solution Data Manager (SDCCN). The action could not be performed.

    Procedure

    Put the RFC destination in the SAP Solution Data Manager (SDCCN) satellite system, if necessary.

    when I used Tcode SDCCN in satellite system,

    I found a error with

    error reading function module interface DSWP_API_SESSIONLIST_GET from SM_SLMCLNT100_BACK

    hostname 'slmprd01' unknown / CPI-C error CM_PRODUCT_SPECIFIC_ERROR.

    Sessions cannot be refreshed from destination SM_SLMCLNT100_BACK ( SLM , 0020230467 )

    Refresh of session overview failed from destination SM_SLMCLNT100_BACK

    who did meet this kind of problem?

    waiting for...

    thanks

    DB:2.19:Smuff1asdccn Connection Error pc


    Hi

    First u maintain the target sytem client user id profile as sap_all,sap_new,s_rfcacl_all.

    Then go to the smsy, maintain the rfc connection between solman and satlite system.

    RFC destination SM_SLMCLNT100_BACK, it means rfc connection not generated properly, First u delete the rfc conection in u r satlite system useing sm59. Then again try to maintain the connection between the system.

    Provide u r mail id i will sent the sddcn docs.

    Feel free to revert back

    ---venkat.

  • RELEVANCY SCORE 2.19

    DB:2.19:Thread: Address Book Not Visible mk


    Running gw7.0.2HP, and have issue w/ one user. When he connects to

    webaccess, he cannot see any address books, neither his nor system.

    Suggestions?

    DB:2.19:Thread: Address Book Not Visible mk

    Stevo,

    It appears that in the past few days you have not received a response to your posting. That concerns us, and has triggered this automated reply.

    Has your problem been resolved? If not, you might try one of the following options:

    - Visit http://support.novell.com/ to search the knowledgebase and check the other support options available on that page under Self Support and Support Programs.

    - You could also try posting your message again. Make sure it is posted in the correct newsgroup. (http://support.novell.com/forums)

    If this is a reply to a duplicate posting, please ignore and accept our apologies and rest assured we will issue a stern reprimand to our posting bot.

    Good luck!

    Your Novell Product Support Forums Team

    http://support.novell.com/forums/

  • RELEVANCY SCORE 2.19

    DB:2.19:Unable To Create New Collections In Sccm 2007 R2 93


     when trying to add a collection an error box pops up saying Form that is already visible cannot be displayed as a modal dialog box. Set the form's visible property to false before calling showDialog

    DB:2.19:Unable To Create New Collections In Sccm 2007 R2 93

    Hope this might help someone on how to disable the DDL audit trigger.
    http://social.technet.microsoft.com/Forums/en-US/configmgrgeneral/thread/1b38b94a-db80-4e48-bda1-94af825eb78escorpITs | http://scorpITs.blogspot.com

  • RELEVANCY SCORE 2.19

    DB:2.19:Error Message While Creating A/P Invoice 3m



    hi experts,

    I try to create AP invoice but system shows following error cannot create standalone AP/AR invoice with excisable item. please explain me the reason to understand.

    DB:2.19:Error Message While Creating A/P Invoice 3m


    Hi,

    Check this thread http://scn.sap.com/thread/2128160

    Thanks Regards,

    Nagarajan

  • RELEVANCY SCORE 2.19

    DB:2.19:Problem Creating Standby Database Using Rman 9c


    I am preparing standby database on Windows environment. For the same..
    1. I have taken full database,archivelog and standby control file backup on primary database.
    2.Backup pieces have been moved to standby server.
    3.TNS configured on both the servers.
    4.connected to target as well as auxiliary database and trying to create the standby database using the below command...
    duplicate target database for standby;

    But I am getting the below error........
    channel ORA_AUX_DISK_1: starting datafile backupset restore
    channel ORA_AUX_DISK_1: restoring control file
    channel ORA_AUX_DISK_1: reading from backup piece E:\BACKUP\STNDBY_CF_AIRPRIM_T690931864_S25_P1
    ORA-19870: error reading backup piece E:\BACKUP\STNDBY_CF_AIRPRIM_T690931864_S25_P1
    ORA-19504: failed to create file "E:\ORACLE\PRODUCT\10.2.0\ORADATA\AIRPRIM\CONTROL01.CTL"
    ORA-27040: file create error, unable to create file
    OSD-04002: unable to open file
    O/S-Error: (OS 3) The system cannot find the path specified.
    failover to previous backup

    RMAN-00571: ===========================================================
    RMAN-00569: =============== ERROR MESSAGE STACK FOLLOWS ===============
    RMAN-00571: ===========================================================
    RMAN-03002: failure of Duplicate Db command at 07/01/2009 10:35:48
    RMAN-03015: error occurred in stored script Memory Script
    RMAN-06026: some targets not found - aborting restore
    RMAN-06024: no backup or copy of the control file found to restore

    Please provide me the solution for the same...

    Thanks in Advance.....
    Sukanta

    DB:2.19:Problem Creating Standby Database Using Rman 9c

    I'm glad that i could help. if your issue is resolved please mark the thread accordingly.

    Thanks,
    Ravi.M

  • RELEVANCY SCORE 2.19

    DB:2.19:Create Subscriber On Demo System 71



    Can I still be able to create subscribers on a demo system - Unity VoiceMail without system key ? Unity comes up but cannot start the AvGaenSvr service - error message indicates system cannot find the file specified. When trying to create subscribers, got message "An unrecognized error has occurred. The new subscriber was not successfully added." Please help. Thank you very much.brDuc Vubrbr

    DB:2.19:Create Subscriber On Demo System 71


    yes, the demo system allows you to create users. It sounds as though your installation did not go through cleanly and the configuration is hosed up or something. You can disable the AvCsGaen service but I'm guessing there's more wrong under the covers if you were getting a "file missing" error. I'd recommend uninstalling and starting again.Jeff LindborgUnity Technical Lead/Answer MonkeyCisco Systemslindborg@cisco.comhttp://www.AnswerMonkey.net (new page for Unity support tools and scripts)

  • RELEVANCY SCORE 2.19

    DB:2.19:Error When Create New Report In Remedy fp



    Please help me , When I create a new report from Remedy get the following error:

    Cannot establish a network connection to the AR System Plug-In server : servername (9999)

    ARSYS.ARDBC.ARREPORTENGINE : RPC: Miscellaneous tli error - System error (Connection refused) (ARERR 8760)

  • RELEVANCY SCORE 2.19

    DB:2.19:Bo 4.0 Error: Overflow While Reading Long a3



    Hi All,

    I am using BO 4.0 and trying to create a connection to a BW query. When I click on 'Connect to server to choose a cube', it asks me to authenticate with my SAP BW ID (we are also using SAP authentication). After that it gives me this strange error message 'overflow while reading long'.

    We upgraded to SP02 and patch 6 and it seems after that we have started to get this message.

    What I have tried so far:

    1. All the input parameters to connect to the BW system are correct. Even tried to use a fully qualified name for the BW server. Also, tried to use the server IP address to connect. But it doesn't work.

    2. I purposely tried to input incorrect password, incorrect parameters for the BW system but it still throws the same error message. I think it is not an issue at the BW system but Business Objects 4.0 is not allowing to establish this connection.

    3. I have an alternate method to create connection from Information Design tool but it works only for Webi reporting. I can create a new report which means I am able to communicate between BO 4.0 and BW using this connection.

    But for Advanced Analysis OLAP, the connection created from Information design tool does not work and I cannot create a new connection from CMC.

    Has anyone seen this message before ?

    Thanks,

    Prasad

    DB:2.19:Bo 4.0 Error: Overflow While Reading Long a3


    Valentina,

    It depends on your BO 4.0 architecture and the type of Web Application server you are using. You may refer some of the deployment guides from SAP.

    Look for:

    'SAP BusinessObjects Enterprise Web Application Deployment Guide' -- SAP BusinessObjects Enterprise XI 4.0

    'Web Services Administrator Guide' -- SAP BusinessObjects Business Intelligence platform 4.0

    Thanks,

    Prasad

  • RELEVANCY SCORE 2.19

    DB:2.19:Could Not Create Header Data Delivery pz



    Dear Experts,

    While transferring inboud delivery from ECC to EWM we are getting error in EWM system inbound qu.

    The error is Could not create header data delivery delivery number, system ECC business system

    Message no. /SCWM/ERPINTEGRATION012
    Diagnosis
    Due to error messages, the system cannot create the header data for the delivery delivery number, from system ECC business system.

    Any pointer will be highly appreciated.

    With Regards,

    Malay

    DB:2.19:Could Not Create Header Data Delivery pz


    Thanks for your reply.

    The error was resolved.

    The issue was "own business system" was not properly maintained.

    It wsa different from that in maintained in node "Define Business system" node.

    With Regards,

    Malay

  • RELEVANCY SCORE 2.19

    DB:2.19:Re: Reading Old Concurrent Request, pj


    I am pretty sure the file is available in fnd_concurrent_request table and is also available at the OS level, but the file is not visible at the application level. What is the error you are getting when you try to view the concurrent request log/output file?

    Our system configuration is R12 running on OEL 5.4.

    Is there any ways by which I can populate or read out this file.... FYI, the request I m finding isCheck under $APPLCSF/$APPLLOG and $APPLCSF/$APPLOUT directories.

    - Create accounting request which has completed with error, and this has been run by User 'ABX'Do not expect to find an output file if the concurrent request completed with error.

    Thanks,
    Hussein

    DB:2.19:Re: Reading Old Concurrent Request, pj

    Hussein the request on create accounting goes through well except for the request which has ended on that particular day, that is the reason why I want to get the exact log file...

    Anyways, Hussein...

    Thanks a lot for your help and the guidance all the way through.

    Best regards and Take care,
    Asif Muhammad

  • RELEVANCY SCORE 2.19

    DB:2.19:Xmp File Does Not Exist Or Cannot Be Opened For Reading! Error pd



    Hi,

    This is my first time using the EDK and Platform Studio. I'm using the EDK Concepts, Tools, and Techniques Tutorial guide to learn how to design an embedded system. At page 14-1, I created a project with an embedded processor system as the top level following the tutorial. After running through the ISE Project Navigator new project wizard, XPS should run. However, after the XPS launched, it gives an error "directorysystem.xmp file does not exist or cannot be opened for reading! " I checked the directory and found that no xmp file is created. What could be wrong here?

    This is the report generated by the Project Navigator:

    Xilinx Platform StudioXilinx EDK 10.1 Build EDK_K.15Copyright (c) 1995-2008 Xilinx, Inc. All rights reserved.XPS% Evaluating file C:\Xilinx Tutorial\Test\system\system.create.tclXPS%Xilinx Platform StudioXilinx EDK 10.1 Build EDK_K.15Copyright (c) 1995-2008 Xilinx, Inc. All rights reserved.Launching XPS GUI...Process "XPS Process: Create XPS Source" completed successfully

    Any help would be much appreciated.

    Thank you.

  • RELEVANCY SCORE 2.18

    DB:2.18:Cannot Create A Restore Point In Windows 7. Error Message Specific Object Not Found 0x80042308 m1


    windows 7 will create a restore point when doing an update that requires restart. I cannot create a restore point before adding a program or
    making a system change.

    DB:2.18:Cannot Create A Restore Point In Windows 7. Error Message Specific Object Not Found 0x80042308 m1

    Hi Earl,

    Welcome to Microsoft Community Forums.

    As per the description, you are getting an error message "specific object not found 0x80042308" while trying to create System Restore point.

    Are you aware of making any changes to the computer prior to the issue?

    Method 1:

    Temporarily try to disable the computer`s anti-virus program and check if the issue persists.

    Note: Ensure to enable your anti-virus back on the computer after you finish these steps. It is not recommended to disable these settings on the computer. This is just to troubleshoot the issue.

    Method 2: Clean boot

    Place the computer in clean boot and check for the issue.
    How to perform a clean boot to troubleshoot a problem in Windows Vista, Windows 7, or Windows 8
    http://support.microsoft.com/kb/929135
    Note: Once you are done with clean boot, please follow the section ‘How to reset the computer to start as usual after troubleshooting with clean boot’ under ‘more information’ in the article to put your computer back to normal
    startup.

    Method 3:

    Perform an SFC scan on your computer. Refer to the following link:

    How to use the System File Checker tool to troubleshoot missing or corrupted system files on Windows Vista or on Windows 7
    http://support.microsoft.com/kb/929833

    Hope this information helps. Do get back to us if you have more queries regarding Windows.

  • RELEVANCY SCORE 2.18

    DB:2.18:Workflow Error k3



    Hi Experts,

    I am working on testing of SAP workflow. The system is migrated from development to testing and workflow testing is being done. I am facing the problem that, particular workflow is seen active in dev system (U02) and test system (K02). It consist of triggering event in it. When i create event for it from swue, it is created. But i am unable to see workflow definition in K02 to see till where it is completed. In SWEL it says workflow definition cannot be activated.

    And now if i check the same workflow in U02 it gives me syntax error. I am able to see the error from SWU7 but in workflow builder it is not visible and also my workflow is showing ACTIVE state.

    DB:2.18:Workflow Error k3


    Hi,

    You might have done some changes to your object in SWo1, do the implement, release and generate on the methods.

    Regards,

    Naresh.

  • RELEVANCY SCORE 2.18

    DB:2.18:Output Aghost.Err Application Error 437 Cannot Read From File Not Ready Reading Driver Q__Abort, Retry, Fail 9j



    Remember - This is a public forum so never post private information such as email or phone numbers!
    Ideas:

    Programs you are having problems with Error messages Not ready reading drive Q Recent changes you made to your computer What you have already tried to fix the problem

    DB:2.18:Output Aghost.Err Application Error 437 Cannot Read From File Not Ready Reading Driver Q__Abort, Retry, Fail 9j

    Do you have a Toshiba and you're trying to restore it to factory condition? If yes, then you have hardware failure. It could be a bad recovery disc, bad optical drive, bad hard drive, etc.
    http://www.elephantboycomputers.com/page2.html#Hardware_Tshoot

    MS-MVP - Elephant Boy Computers - Don't Panic!

  • RELEVANCY SCORE 2.18

    DB:2.18:System Error On Reading Internal Table Dyntab, Screen 7313 k1


    Hello,I'm trying to create a customer master in batch mode. I get this error when saving. If I create the customer on-line, I'm able to create with no errors. When I create using a program, I get the error and have to exit. Does anyone have a clue on what to do? Thanks,Theresa

    DB:2.18:System Error On Reading Internal Table Dyntab, Screen 7313 k1

    If you do have authorization to the transaction SHDB you may want to make a record of the transaction you are trying to make a batch of.This is the best way of making batch inputs since you can know exactly which fields and screen names, including tabstrips, you want to input.Hope it helps.Ling

  • RELEVANCY SCORE 2.18

    DB:2.18:Zone Installation Error 37


    Hi,
    I get this error when I try to install a zone:

    # zoneadm -z myzone install
    Preparing to install zone myzone.
    ERROR: Read-only file system: cannot create mount point /zones/myzone/root/usr/localERROR: cannot setup zone myzone inherited file systems
    ERROR: cannot setup zone myzone file systems inherited from the global zone
    ERROR: cannot create zone boot environment myzone
    zoneadm: zone 'myzone': '/usr/lib/lu/lucreatezone' failed with exit code 74.

    any idea ?

    DB:2.18:Zone Installation Error 37

    You must to create the /usr/local directory in the global zone.
    Best Regards

  • RELEVANCY SCORE 2.18

    DB:2.18:What Is The Package-Visible Class? fj


    I am reading JCVM2.2.1 Spec.
    I don't know what the package-visible class is?

    for example,
    Here is a sentence I could not understand.

    A public class cannot contain a public or protected field of type reference to a package-visible class.

    However, I know a general Access controls such as public, protected and private.

    Help me?

    What is the package-visible class in Java Card?

    DB:2.18:What Is The Package-Visible Class? fj

    There is something called package protected in Java. This means that an object may be accessible thru a package only. Sort of like public with limited visibility.

    Search the Java 2 Tutorial.

  • RELEVANCY SCORE 2.18

    DB:2.18:Object Reference Not Set To An Instance Of An Object jf


     
    Team System Test Edition - Object reference not set to an instance of an object error when trying to create new test
     
    Hi,I have the Microsoft Visual Studio Team System 2008 Test Edition installed on my machine - it is the trial version I downloaded from:
    http://www.microsoft.com/downloads/details.aspx?FamilyId=D95598D7-AA6E-4F24-82E3-81570C5384Cbdisplaylang=en
     
    The problem is when I try to open the Test New Test I get an Object reference not set to an instance of an object error. Also when I click on 'Create New Test List' I get the error: Exception has been thrown by the target of an invocation. So I cannot create any tests in the projects.
     
    Before I installed the Test Edition, I used to run on only the Development Edition and was able to see the Ordered and Unit tests. Now not even those are visible.
     
    I uninstalled and reinstalled all components of VS and it is still a problem. I also have the Microsoft Visual Studio 2008 Team Explorer Version 9.0.21022.8 Microsoft Visual Studio Team System 2008 Development Edition and .NET Framework v3.5I would appreciate any suggestions on this.

    DB:2.18:Object Reference Not Set To An Instance Of An Object jf

    I got the resolution for this problem on http://forums.microsoft.com/Forums/ShowPost.aspx?PostID=3540647SiteID=1Thanks.

  • RELEVANCY SCORE 2.18

    DB:2.18:Error Reading Trayicon1- Visible Cannot Create System Shell Notification Icon. 3f


    This error occurs randomly upon bootup (Win7 64bit). The program attempting to load is the TtsportsKB3Trayicon, for a Termaltake keyboard. I understand that it is trying to load prematurely, before the system tray has been created.

    My question is, how can I delay the startup of this program, or change the order in which the startup occurs? I would prefer to resolve the issue through a Windows setting or fix, rather than installing and giving a third-party program the ability to modify
    my boot process.

    I refuse to accept that there is no way to fix this through a Windows setting somewhere (registry?), because if it is impossible, then no third-party software would be able to fix it either.

    Thanks for reading, and for any workarounds.

  • RELEVANCY SCORE 2.18

    DB:2.18:Schedule Meter Reading Order Without Installations c8



    Hello Experts, Can we create a shedule Meter Reading Order within the ISU system for an installation where there is no device attached. The requirement is to create schedule meter reading orders even for sites where the meters are physically taken off the wall (therefore no device in ISU) and for those meter reading order created Meter Reader should go to such sites and flag if there is any malpractice going on other teams to look into.

    As per understanding we cannot create Meter Reading Orders where devices are not installed.

    Any suggestions on how to meet this requirement? Please note that we cannot create dummy meters at such sites becuase it will lead to other problems and Business areas. These meter-removed installations have to be in the schedule download file of meter reading orders

    Thanks,

    Manish

    DB:2.18:Schedule Meter Reading Order Without Installations c8


    Manish:

    As standard, read orders can only be created for devices/registers. You might be able to add records to the download file for data not entered by standard, but i think that this might be a significant enhancement.

    regards,

    bill.

  • RELEVANCY SCORE 2.18

    DB:2.18:Cannot Create Additional Ftp Users ka





    trying to add new ftp users , I always get the error message :

    Error: SysUser::update() failed: Unable to create system user: usermng: PAM password change failed: 24, Failed preliminary check by password service

    what does it means ?

    PLESK 10.0.1 / CENTOS

  • RELEVANCY SCORE 2.18

    DB:2.18:Cannot Backup Or Create A System Image Using Windows Backup And Restore Feature. 8c


    I cannot backup or create a system image, because windows said "The writer experienced a non-transient error."
    Also this is a partition on my mac. I deleted my mac partition, so the only partition I have left is my Windows partition.

    DB:2.18:Cannot Backup Or Create A System Image Using Windows Backup And Restore Feature. 8c

    Hi,

    Thank you updating the case status.

    Do let us know in future if you have any issues with Microsoft Windows.

  • RELEVANCY SCORE 2.18

    DB:2.18:Property Values - Vbscript sf


    Hi,
    I am new to custom Outlook forms using VBScript and have run into some problems. I appreciate any help given.

    1. When using ToggleButtons, I am not able to hide textboxes using
    label.Visible statement, neither am I able to change the colour of font using
    label.ForeColor statement
    Sub Item_Open()
    Set FormPage = Item.GetInspector.ModifiedFormPages(Message)

    Set ToggleButton1= FormPage.ToggleButton1
    ToggleButton1.Value = False

    Set ToggleButton2= FormPage.ToggleButton2
    ToggleButton2.Value = False

    Set ToggleButton3= FormPage.ToggleButton3
    ToggleButton3.Value = False

    Set TextBox1 = FormPage.TextBox1
    Set TextBox2 = FormPage.TextBox2
    Set TextBox3 = FormPage.TextBox3
    End Sub

    Sub Item_Send()
    If ToggleButton1.Value = True Then
    TextBox1.Text = UNSCHEDULED
    TextBox1.Value = UNSCHEDULED
    TextBox1.ForeColor = Red
    TextBox1.Visible = True
    TextBox2.Visible = False
    TextBox3.Visible = False
    End If

    If ToggleButton2.Value = True Then
    TextBox2.Text = SCHEDULED
    TextBox2.Value = SCHEDULED
    TextBox2.ForeColor = Orange
    TextBox1.Visible = False
    TextBox2.Visible = True
    TextBox3.Visible = False
    End If
    End Sub

    2. When using Datepicker Control and Time Control in the form, I get an error message when trying to open the form, and all other fields appear blank.
    The error message reads: To help prevent malicious code from running, one of more objects in this form were not loaded. For more information, contact your system administrator,
    I do not want to change any security settings. Is there another way around it?

    3. Is there any way to have the contents of the message show up on theReading Pane as a preview without actually having to open the mail separately.

    Message: This item contains active content that cannot be displated in the Reading Pane. Open the item to read its contents.

    Thanks in advance!

    DB:2.18:Property Values - Vbscript sf

    Hello,
    Message: This item contains active content that cannot be displated in the Reading Pane. Open the item to read its contents.
    See
    FIX: This item contains active content that cannot be displayed in the preview pane error message, and certain custom forms are not displayed correctly in the Preview pane in Outlook 2002 .
    You can selectan Outlook item in the explorer using the
    Selection property.

  • RELEVANCY SCORE 2.18

    DB:2.18:App-Fnd-01630: Cannot Open File 8j


    hello

    im trying to register a report as text format, it is giving me this error:

    ========
    Program exited with status 1

    Cause: The program terminated, returning status code 1.

    Action: Check your installation manual for the meaning of this code on this operating system.
    APP-FND-01630: Cannot open file D:\oracle\TEST\inst\apps\TEST_erptest\appltmp\OFAA74.tmp for reading

    Cause: USDINS encountered an error when attempting to open file D:\oracle\TEST\inst\apps\TEST_erptest\appltmp\OFAA74.tmp for reading.

    Action: Verify that the filename is correct and that the environment variables controlling that filename are correct.

    Action: If the file is opened in read mode, check that the file exists. Check that you have privileges to read the file in the file directory. Contact your system administrator to obtain read privileges.

    Action: If the file is opened in write or append mode, check that you have privileges to create and write files in the file directory. Contact your system administrator to obtain create and write privileges.
    Concurrent Manager encountered an error while running Oracle*Report for your concurrent request 862162.

    Review your concurrent request log and/or report output file for more detailed information.

    ==========

    the same report i working fine with the pdf format.

    Please any help on how to solve this issue, also how can i get the path for the txt file and how to change it??
    please urgent!!!.

    Mahdi Charara

    DB:2.18:App-Fnd-01630: Cannot Open File 8j

    hello

    im trying to register a report as text format, it is giving me this error:

    ========
    Program exited with status 1

    Cause: The program terminated, returning status code 1.

    Action: Check your installation manual for the meaning of this code on this operating system.
    APP-FND-01630: Cannot open file D:\oracle\TEST\inst\apps\TEST_erptest\appltmp\OFAA74.tmp for reading

    Cause: USDINS encountered an error when attempting to open file D:\oracle\TEST\inst\apps\TEST_erptest\appltmp\OFAA74.tmp for reading.

    Action: Verify that the filename is correct and that the environment variables controlling that filename are correct.

    Action: If the file is opened in read mode, check that the file exists. Check that you have privileges to read the file in the file directory. Contact your system administrator to obtain read privileges.

    Action: If the file is opened in write or append mode, check that you have privileges to create and write files in the file directory. Contact your system administrator to obtain create and write privileges.
    Concurrent Manager encountered an error while running Oracle*Report for your concurrent request 862162.

    Review your concurrent request log and/or report output file for more detailed information.

    ==========

    the same report i working fine with the pdf format.

    Please any help on how to solve this issue, also how can i get the path for the txt file and how to change it??
    please urgent!!!.

    Mahdi Charara

  • RELEVANCY SCORE 2.18

    DB:2.18:Added A Movie Clip To A Loaded .Swf And Now It Won't Load Get Error #1056 jd



    was all working fine until I added a simple shape movieclip (rectangle that I want to have visible and invisible) now just by adding this MC I get this error..

    ReferenceError: Error #1056: Cannot create property largeframe on aavariable.

    at flash.display::Sprite/constructChildren()

    at flash.display::Sprite()

    at flash.display::MovieClip()

    at aavariable()[/Users/aaron/Documents/bizMob/aavariable.as:156]

    Your help is much appreciated

    sub

    DB:2.18:Added A Movie Clip To A Loaded .Swf And Now It Won't Load Get Error #1056 jd


    Ok here is all of the code from my external fla, it works fine until I put largeframe.visible=true/false in the code, sown near the end in the hide words and show words functions

    Sorry about all the code...

    Cheers,

    sub

    hidedefwords();

    Letterbuttonsappear();

    //letter buttons

    import flash.events.MouseEvent;

    //letter buttons

    function A_wordsgo(event:MouseEvent):void

    {

    hidedefwords();

    showAwords();

    }

    A_button.addEventListener(MouseEvent.CLICK, A_wordsgo);

    function B_wordsgo(event:MouseEvent):void

    {

    hidedefwords();

    showBwords();

    }

    B_button.addEventListener(MouseEvent.CLICK, B_wordsgo);

    function P_wordsgo(event:MouseEvent):void

    {

    hidedefwords();

    showPwords();

    }

    P_button.addEventListener(MouseEvent.CLICK, P_wordsgo);

    function C_wordsgo(event:MouseEvent):void

    {

    hidedefwords();

    showCwords();

    }

    C_button.addEventListener(MouseEvent.CLICK, C_wordsgo);

    function D_wordsgo(event:MouseEvent):void

    {

    hidedefwords();

    showDwords();

    }

    D_button.addEventListener(MouseEvent.CLICK, D_wordsgo);

    function E_wordsgo(event:MouseEvent):void

    {

    hidedefwords();

    showEwords();

    }

    E_button.addEventListener(MouseEvent.CLICK, E_wordsgo);

    function F_wordsgo(event:MouseEvent):void

    {

    hidedefwords();

    showFwords();

    }

    F_button.addEventListener(MouseEvent.CLICK, F_wordsgo);

    function G_wordsgo(event:MouseEvent):void

    {

    hidedefwords();

    showGwords();

    }

    G_button.addEventListener(MouseEvent.CLICK, G_wordsgo);

    function H_wordsgo(event:MouseEvent):void

    {

    hidedefwords();

    }

    H_button.addEventListener(MouseEvent.CLICK, H_wordsgo);

    function I_wordsgo(event:MouseEvent):void

    {

    hidedefwords();

    showIwords();

    }

    I_button.addEventListener(MouseEvent.CLICK, I_wordsgo);

    function J_wordsgo(event:MouseEvent):void

    {

    hidedefwords();

    }

    J_button.addEventListener(MouseEvent.CLICK, J_wordsgo);

    function K_wordsgo(event:MouseEvent):void

    {

    hidedefwords();

    }

    K_button.addEventListener(MouseEvent.CLICK, K_wordsgo);

    function L_wordsgo(event:MouseEvent):void

    {

    hidedefwords();

    showLwords();

    }

    L_button.addEventListener(MouseEvent.CLICK, L_wordsgo);

    function M_wordsgo(event:MouseEvent):void

    {

    hidedefwords();

    showMwords();

    }

    M_button.addEventListener(MouseEvent.CLICK, M_wordsgo);

    function N_wordsgo(event:MouseEvent):void

    {

    hidedefwords();

    showNwords();

    }

    N_button.addEventListener(MouseEvent.CLICK, N_wordsgo);

    function O_wordsgo(event:MouseEvent):void

    {

    hidedefwords();

    showOwords();

    }

    O_button.addEventListener(MouseEvent.CLICK, O_wordsgo);

    function Q_wordsgo(event:MouseEvent):void

    {

    hidedefwords();

    showQwords();

    }

    Q_button.addEventListener(MouseEvent.CLICK, Q_wordsgo);

    function R_wordsgo(event:MouseEvent):void

    {

    hidedefwords();

    showRwords();

    }

    R_button.addEventListener(MouseEvent.CLICK, R_wordsgo);

    function S_wordsgo(event:MouseEvent):void

    {

    hidedefwords();

    showSwords();

    }

    S_button.addEventListener(MouseEvent.CLICK, S_wordsgo);

    function T_wordsgo(event:MouseEvent):void

    {

    hidedefwords();

    }

    T_button.addEventListener(MouseEvent.CLICK, T_wordsgo);

    function U_wordsgo(event:MouseEvent):void

    {

    hidedefwords();

    }

    U_button.addEventListener(MouseEvent.CLICK, U_wordsgo);

    function V_wordsgo(event:MouseEvent):void

    {

    hidedefwords();

    showVwords();

    }

    V_button.addEventListener(MouseEvent.CLICK, V_wordsgo);

    function W_wordsgo(event:MouseEvent):void

    {

    hidedefwords();

    showWwords();

    }

    W_button.addEventListener(MouseEvent.CLICK, W_wordsgo);

    function X_wordsgo(event:MouseEvent):void

    {

    hidedefwords();

    }

    X_button.addEventListener(MouseEvent.CLICK, X_wordsgo);

    function Y_wordsgo(event:MouseEvent):void

    {

    hidedefwords();

    }

    Y_button.addEventListener(MouseEvent.CLICK, Y_wordsgo);

    function Z_wordsgo(event:MouseEvent):void

    {

    hidedefwords();

    }

    Z_button.addEventListener(MouseEvent.CLICK, Z_wordsgo);

    //functions

    function showdefinitions(){

    hidedefwords();

    Letterbuttonsdisappear();

    wordbook.worddefinitions.play();

    wordbook.wordDEF.text=ans1;

    wordbook.Def_word_1.text=ans2;

    }

    function cleardefinition(){

    wordbook.wordDEF.text="";

    wordbook.Def_word_1.text="";

    }

    function defbackup(event:MouseEvent):void {

    wordbook.worddefinitions.play();

    Letterbuttonsappear();

    cleardefinition();

    }

    def_back.addEventListener(MouseEvent.CLICK, defbackup);

    // word buttons

    function abngo(event:MouseEvent):void

    {

    ans1=def1;

    ans2=w1;

    showdefinitions();

    }

    abn_def.addEventListener(MouseEvent.CLICK, abngo);

    acnbut.addEventListener(MouseEvent.CLICK, showacn);

    function showacn(event:MouseEvent):void {

    ans1=def2;

    ans2=w2;

    showdefinitions();

    }

    APBut.addEventListener(MouseEvent.CLICK, showAP);

    function showAP(event:MouseEvent):void {

    ans1=def3;

    ans2=w3;

    showdefinitions();

    }

    adv_but.addEventListener(MouseEvent.CLICK, showadv);

    function showadv(event:MouseEvent):void {

    ans1=def4;

    ans2=w4;

    showdefinitions();

    }

    benefit_def.addEventListener(MouseEvent.CLICK, showbenefit);

    function showbenefit(event:MouseEvent):void {

    ans1=def6;

    ans2=w6;

    showdefinitions();

    }

    businessM_def.addEventListener(MouseEvent.CLICK, showBM);

    function showBM(event:MouseEvent):void {

    ans1=def7;

    ans2=w7;

    showdefinitions();

    }

    businessN_def.addEventListener(MouseEvent.CLICK, showBN);

    function showBN(event:MouseEvent):void {

    ans1=def8;

    ans2=w8;

    showdefinitions();

    }

    businessR_def.addEventListener(MouseEvent.CLICK, showBR);

    function showBR(event:MouseEvent):void {

    ans1=def9;

    ans2=w9;

    showdefinitions();

    }

    cash_flow_def.addEventListener(MouseEvent.CLICK, showcashflow);

    function showcashflow(event:MouseEvent):void {

    ans1=def10;

    ans2=w10;

    showdefinitions();

    }

    characteristics_def.addEventListener(MouseEvent.CLICK, showcharacteristics);

    function showcharacteristics(event:MouseEvent):void {

    ans1=def11;

    ans2=w11;

    showdefinitions();

    }

    charges_def.addEventListener(MouseEvent.CLICK, showcharges);

    function showcharges(event:MouseEvent):void {

    ans1=def12;

    ans2=w12;

    showdefinitions();

    }

    company_def.addEventListener(MouseEvent.CLICK, showcompany);

    function showcompany(event:MouseEvent):void {

    ans1=def13;

    ans2=w13;

    showdefinitions();

    }

    competitor_def.addEventListener(MouseEvent.CLICK, showcompetitor);

    function showcompetitor(event:MouseEvent):void {

    ans1=def14;

    ans2=w14;

    showdefinitions();

    }

    constitution_def.addEventListener(MouseEvent.CLICK, showconstitution);

    function showconstitution(event:MouseEvent):void {

    ans1=def15;

    ans2=w15;

    showdefinitions();

    }

    ATSIcorpact_def.addEventListener(MouseEvent.CLICK, showATSIcorpact);

    function showATSIcorpact(event:MouseEvent):void {

    ans1=def16;

    ans2=w16;

    showdefinitions();

    }

    corpact_def.addEventListener(MouseEvent.CLICK, showcorpact);

    function showcorpact(event:MouseEvent):void {

    ans1=def17;

    ans2=w17;

    showdefinitions();

    }

    culknow_def.addEventListener(MouseEvent.CLICK, showculknow);

    function showculknow(event:MouseEvent):void {

    ans1=def18;

    ans2=w18;

    showdefinitions();

    }

    customer_def.addEventListener(MouseEvent.CLICK, showcustomer);

    function showcustomer(event:MouseEvent):void {

    ans1=def19;

    ans2=w19;

    showdefinitions();

    }

    debt_def.addEventListener(MouseEvent.CLICK, showdebt);

    function showdebt(event:MouseEvent):void {

    ans1=def20;

    ans2=w20;

    showdefinitions();

    }

    direct_comp_def.addEventListener(MouseEvent.CLICK, showdirect_comp);

    function showdirect_comp(event:MouseEvent):void {

    ans1=def21;

    ans2=w21;

    showdefinitions();

    }

    dividend_def.addEventListener(MouseEvent.CLICK, showdividend);

    function showdividend(event:MouseEvent):void {

    ans1=def22;

    ans2=w22;

    showdefinitions();

    }

    excel_def.addEventListener(MouseEvent.CLICK, showexcel);

    function showexcel(event:MouseEvent):void {

    ans1=def23;

    ans2=w23;

    showdefinitions();

    }

    fees_def.addEventListener(MouseEvent.CLICK, showfees);

    function showfees(event:MouseEvent):void {

    ans1=def24;

    ans2=w24;

    showdefinitions();

    }

    fin_man_def.addEventListener(MouseEvent.CLICK, showfin_man);

    function showfin_man(event:MouseEvent):void {

    ans1=def25;

    ans2=w25;

    showdefinitions();

    }

    franchise_def.addEventListener(MouseEvent.CLICK, showfranchise);

    function showfranchise(event:MouseEvent):void {

    ans1=def26;

    ans2=w26;

    showdefinitions();

    }

    gen_led_def.addEventListener(MouseEvent.CLICK, showgen_led);

    function showgen_led(event:MouseEvent):void {

    ans1=def27;

    ans2=w27;

    showdefinitions();

    }

    goal_def.addEventListener(MouseEvent.CLICK, showgoal);

    function showgoal(event:MouseEvent):void {

    ans1=def28;

    ans2=w28;

    showdefinitions();

    }

    gro_op_def.addEventListener(MouseEvent.CLICK, showgro_op);

    function showgro_op(event:MouseEvent):void {

    ans1=def29;

    ans2=w29;

    showdefinitions();

    }

    gst_def.addEventListener(MouseEvent.CLICK, showgst);

    function showgst(event:MouseEvent):void {

    ans1=def30;

    ans2=w30;

    showdefinitions();

    }

    icn_def.addEventListener(MouseEvent.CLICK, showicn);

    function showicn(event:MouseEvent):void {

    ans1=def31;

    ans2=w31;

    showdefinitions();

    }

    incorporate_def.addEventListener(MouseEvent.CLICK, showincorporate);

    function showincorporate(event:MouseEvent):void {

    ans1=def32;

    ans2=w32;

    showdefinitions();

    }

    in_com_def.addEventListener(MouseEvent.CLICK, showin_com);

    function showin_com(event:MouseEvent):void {

    ans1=def33;

    ans2=w33;

    showdefinitions();

    }

    labour_def.addEventListener(MouseEvent.CLICK, showlabour);

    function showlabour(event:MouseEvent):void {

    ans1=def34;

    ans2=w34;

    showdefinitions();

    }

    le_name_def.addEventListener(MouseEvent.CLICK, showle_name);

    function showle_name(event:MouseEvent):void {

    ans1=def35;

    ans2=w35;

    showdefinitions();

    }

    le_pro_def.addEventListener(MouseEvent.CLICK, showle_pro);

    function showle_pro(event:MouseEvent):void {

    ans1=def36;

    ans2=w36;

    showdefinitions();

    }

    le_str_def.addEventListener(MouseEvent.CLICK, showle_str);

    function showle_str(event:MouseEvent):void {

    ans1=def37;

    ans2=w37;

    showdefinitions();

    }

    liability_def.addEventListener(MouseEvent.CLICK, showliability);

    function showliability(event:MouseEvent):void {

    ans1=def38;

    ans2=w38;

    showdefinitions();

    }

    licence_def.addEventListener(MouseEvent.CLICK, showlicence);

    function showlicence(event:MouseEvent):void {

    ans1=def39;

    ans2=w39;

    showdefinitions();

    }

    lodge_def.addEventListener(MouseEvent.CLICK, showlodge);

    function showlodge(event:MouseEvent):void {

    ans1=def40;

    ans2=w40;

    showdefinitions();

    }

    manufacturing_def.addEventListener(MouseEvent.CLICK, showmanufacturing);

    function showmanufacturing(event:MouseEvent):void {

    ans1=def41;

    ans2=w41;

    showdefinitions();

    }

    mar_bud_def.addEventListener(MouseEvent.CLICK, showmar_bud);

    function showmar_bud(event:MouseEvent):void {

    ans1=def42;

    ans2=w42;

    showdefinitions();

    }

    min_cri_def.addEventListener(MouseEvent.CLICK, showmin_cri);

    function showmin_cri(event:MouseEvent):void {

    ans1=def43;

    ans2=w43;

    showdefinitions();

    }

    myob_def.addEventListener(MouseEvent.CLICK, showmyob);

    function showmyob(event:MouseEvent):void {

    ans1=def44;

    ans2=w44;

    showdefinitions();

    }

    networks_def.addEventListener(MouseEvent.CLICK, shownetworks);

    function shownetworks(event:MouseEvent):void {

    ans1=def45;

    ans2=w45;

    showdefinitions();

    }

    obligations_def.addEventListener(MouseEvent.CLICK, showobligations);

    function showobligations(event:MouseEvent):void {

    ans1=def46;

    ans2=w46;

    showdefinitions();

    }

    one_off_def.addEventListener(MouseEvent.CLICK, showone_off);

    function showone_off(event:MouseEvent):void {

    ans1=def47;

    ans2=w47;

    showdefinitions();

    }

    ope_bud_def.addEventListener(MouseEvent.CLICK, showope_bud);

    function showope_bud(event:MouseEvent):void {

    ans1=def48;

    ans2=w48;

    showdefinitions();

    }

    overheads_def.addEventListener(MouseEvent.CLICK, showoverheads);

    function showoverheads(event:MouseEvent):void {

    ans1=def49;

    ans2=w49;

    showdefinitions();

    }

    promotions_def.addEventListener(MouseEvent.CLICK, showpromotions);

    function showpromotions(event:MouseEvent):void {

    ans1=def5;

    ans2=w5;

    showdefinitions();

    // var data5="d5";

    //this.addEventListener(TextEvent.LINK,linkF); // this line can be used for all your textfields, if you have more than one.

    //wordDEF.htmlText=parseTextF("advertising",def5,data5);

    //function parseTextF(keyword:String,txt:String,dataS:String):String {

    // i think you'll need to consider 3 cases. 1. a keyword is at the start, 2. in the middle , 3. at the end of txt

    // for example: if 2

    // var a:Array = txt.split(keyword);

    // return a[0]+"a href='event:"+dataS+"'"+keyword+"/a"+a[1];

    // and you may have more than 1 keyword in txt

    //}

    //function linkF(e:TextEvent):void{

    //trace(e.text);

    //ans1=def4;

    //ans2=w4;

    //wordDEF.text=ans1;

    //Def_word_1.text=ans2;

    //}

    }

    partnership_def.addEventListener(MouseEvent.CLICK, showpartnership);

    function showpartnership(event:MouseEvent):void {

    ans1=def50;

    ans2=w50;

    showdefinitions();

    }

    permission_def.addEventListener(MouseEvent.CLICK, showpermission);

    function showpermission(event:MouseEvent):void {

    ans1=def51;

    ans2=w51;

    showdefinitions();

    }

    permit_def.addEventListener(MouseEvent.CLICK, showpermit);

    function showpermit(event:MouseEvent):void {

    ans1=def52;

    ans2=w52;

    showdefinitions();

    }

    per_***_def.addEventListener(MouseEvent.CLICK, showper_***);

    function showper_***(event:MouseEvent):void {

    ans1=def53;

    ans2=w53;

    showdefinitions();

    }

    per_pro_def.addEventListener(MouseEvent.CLICK, showper_pro);

    function showper_pro(event:MouseEvent):void {

    ans1=def54;

    ans2=w54;

    showdefinitions();

    }

    pho_ide_def.addEventListener(MouseEvent.CLICK, showpho_ide);

    function showpho_ide(event:MouseEvent):void {

    ans1=def55;

    ans2=w55;

    showdefinitions();

    }

    pos_add_def.addEventListener(MouseEvent.CLICK, showpos_add);

    function showpos_add(event:MouseEvent):void {

    ans1=def56;

    ans2=w56;

    showdefinitions();

    }

    pri_str_def.addEventListener(MouseEvent.CLICK, showpri_str);

    function showpri_str(event:MouseEvent):void {

    ans1=def57;

    ans2=w57;

    showdefinitions();

    }

    private_def.addEventListener(MouseEvent.CLICK, showprivate);

    function showprivate(event:MouseEvent):void {

    ans1=def58;

    ans2=w58;

    showdefinitions();

    }

    profitable_def.addEventListener(MouseEvent.CLICK, showprofitable);

    function showprofitable(event:MouseEvent):void {

    ans1=def59;

    ans2=w59;

    showdefinitions();

    }

    promote_def.addEventListener(MouseEvent.CLICK, showpromote);

    function showpromote(event:MouseEvent):void {

    ans1=def60;

    ans2=w60;

    showdefinitions();

    }

    pub_lia_def.addEventListener(MouseEvent.CLICK, showpub_lia);

    function showpub_lia(event:MouseEvent):void {

    ans1=def61;

    ans2=w61;

    showdefinitions();

    }

    quickbooks_def.addEventListener(MouseEvent.CLICK, showquickbook);

    function showquickbook(event:MouseEvent):void {

    ans1=def62;

    ans2=w62;

    showdefinitions();

    }

    registered_def.addEventListener(MouseEvent.CLICK, showregistered);

    function showregistered(event:MouseEvent):void {

    ans1=def63;

    ans2=w63;

    showdefinitions();

    }

    regulations_def.addEventListener(MouseEvent.CLICK, showregulations);

    function showregulations(event:MouseEvent):void {

    ans1=def64;

    ans2=w64;

    showdefinitions();

    }

    retail_def.addEventListener(MouseEvent.CLICK, showretail);

    function showretail(event:MouseEvent):void {

    ans1=def65;

    ans2=w65;

    showdefinitions();

    }

    service_def.addEventListener(MouseEvent.CLICK, showservice);

    function showservice(event:MouseEvent):void {

    ans1=def66;

    ans2=w66;

    showdefinitions();

    }

    shareholder_def.addEventListener(MouseEvent.CLICK, showshareholder);

    function showshareholder(event:MouseEvent):void {

    ans1=def67;

    ans2=w67;

    showdefinitions();

    }

    sol_tra_def.addEventListener(MouseEvent.CLICK, showsol_tra);

    function showsol_tra(event:MouseEvent):void {

    ans1=def68;

    ans2=w68;

    showdefinitions();

    }

    sta_up_def.addEventListener(MouseEvent.CLICK, showsta_up);

    function showsta_up(event:MouseEvent):void {

    ans1=def69;

    ans2=w69;

    showdefinitions();

    }

    strategy_def.addEventListener(MouseEvent.CLICK, showstrategy);

    function showstrategy(event:MouseEvent):void {

    ans1=def70;

    ans2=w70;

    showdefinitions();

    }

    system_def.addEventListener(MouseEvent.CLICK, showsystem);

    function showsystem(event:MouseEvent):void {

    ans1=def71;

    ans2=w71;

    showdefinitions();

    }

    vision_def.addEventListener(MouseEvent.CLICK, showvision);

    function showvision(event:MouseEvent):void {

    ans1=def72;

    ans2=w72;

    showdefinitions();

    }

    wholesale_def.addEventListener(MouseEvent.CLICK, showwholesale);

    function showwholesale(event:MouseEvent):void {

    ans1=def73;

    ans2=w73;

    showdefinitions();

    }

    function hidedefwords(){

    largeframe.visible=false;

    abn_def.visible=false;

    acnbut.visible=false;

    APBut.visible=false;

    adv_but.visible=false;

    benefit_def.visible=false;

    businessM_def.visible=false;

    businessN_def.visible=false;

    businessR_def.visible=false;

    cash_flow_def.visible=false;

    characteristics_def.visible=false;

    charges_def.visible=false;

    company_def.visible=false;

    competitor_def.visible=false;

    constitution_def.visible=false;

    ATSIcorpact_def.visible=false;

    corpact_def.visible=false;

    culknow_def.visible=false;

    customer_def.visible=false;

    debt_def.visible=false;

    direct_comp_def.visible=false;

    dividend_def.visible=false;

    excel_def.visible=false;

    fees_def.visible=false;

    fin_man_def.visible=false;

    franchise_def.visible=false;

    gen_led_def.visible=false;

    goal_def.visible=false;

    gro_op_def.visible=false;

    gst_def.visible=false;

    icn_def.visible=false;

    incorporate_def.visible=false;

    in_com_def.visible=false;

    labour_def.visible=false;

    le_name_def.visible=false;

    le_pro_def.visible=false;

    le_str_def.visible=false;

    liability_def.visible=false;

    licence_def.visible=false;

    lodge_def.visible=false;

    manufacturing_def.visible=false;

    mar_bud_def.visible=false;

    min_cri_def.visible=false;

    myob_def.visible=false;

    networks_def.visible=false;

    obligations_def.visible=false;

    one_off_def.visible=false;

    ope_bud_def.visible=false;

    overheads_def.visible=false;

    promotions_def.visible=false;

    partnership_def.visible=false;

    permission_def.visible=false;

    permit_def.visible=false;

    per_***_def.visible=false;

    per_pro_def.visible=false;

    pho_ide_def.visible=false;

    pos_add_def.visible=false;

    pri_str_def.visible=false;

    private_def.visible=false;

    profitable_def.visible=false;

    promote_def.visible=false;

    pub_lia_def.visible=false;

    quickbooks_def.visible=false;

    registered_def.visible=false;

    regulations_def.visible=false;

    retail_def.visible=false;

    service_def.visible=false;

    shareholder_def.visible=false;

    sol_tra_def.visible=false;

    sta_up_def.visible=false;

    strategy_def.visible=false;

    system_def.visible=false;

    vision_def.visible=false;

    wholesale_def.visible=false;

    }

    function showAwords(){

    largeframe.visible=true;

    abn_def.visible=true;

    acnbut.visible=true;

    APBut.visible=true;

    adv_but.visible=true;

    }

    function showBwords(){

    largeframe.visible=true;

    benefit_def.visible=true;

    businessM_def.visible=true;

    businessN_def.visible=true;

    businessR_def.visible=true;

    }

    function showCwords(){

    largeframe.visible=true;

    cash_flow_def.visible=true;

    characteristics_def.visible=true;

    charges_def.visible=true;

    company_def.visible=true;

    competitor_def.visible=true;

    constitution_def.visible=true;

    ATSIcorpact_def.visible=true;

    corpact_def.visible=true;

    culknow_def.visible=true;

    customer_def.visible=true;

    }

    function showDwords(){

    largeframe.visible=true;

    debt_def.visible=true;

    direct_comp_def.visible=true;

    dividend_def.visible=true;

    }

    function showEwords(){

    largeframe.visible=true;

    excel_def.visible=true;

    }

    function showFwords(){

    largeframe.visible=true;

    fees_def.visible=true;

    fin_man_def.visible=true;

    franchise_def.visible=true;

    }

    function showGwords(){

    largeframe.visible=true;

    gen_led_def.visible=true;

    goal_def.visible=true;

    gro_op_def.visible=true;

    gst_def.visible=true;

    }

    function showIwords(){

    largeframe.visible=true;

    icn_def.visible=true;

    incorporate_def.visible=true;

    in_com_def.visible=true;

    }

    function showLwords(){

    largeframe.visible=true;

    labour_def.visible=true;

    le_name_def.visible=true;

    le_pro_def.visible=true;

    le_str_def.visible=true;

    liability_def.visible=true;

    licence_def.visible=true;

    lodge_def.visible=true;

    }

    function showMwords(){

    largeframe.visible=true;

    manufacturing_def.visible=true;

    mar_bud_def.visible=true;

    min_cri_def.visible=true;

    myob_def.visible=true;

    }

    function showNwords(){

    largeframe.visible=true;

    networks_def.visible=true;

    }

    function showOwords(){

    largeframe.visible=true;

    obligations_def.visible=true;

    one_off_def.visible=true;

    ope_bud_def.visible=true;

    overheads_def.visible=true;

    }

    function showPwords(){

    largeframe.visible=true;

    promotions_def.visible=true;

    partnership_def.visible=true;

    permission_def.visible=true;

    permit_def.visible=true;

    per_***_def.visible=true;

    per_pro_def.visible=true;

    pho_ide_def.visible=true;

    pos_add_def.visible=true;

    pri_str_def.visible=true;

    private_def.visible=true;

    profitable_def.visible=true;

    promote_def.visible=true;

    pub_lia_def.visible=true;

    }

    function showQwords(){

    largeframe.visible=true;

    quickbooks_def.visible=true;

    }

    function showRwords(){

    largeframe.visible=true;

    registered_def.visible=true;

    regulations_def.visible=true;

    retail_def.visible=true;

    }

    function showSwords(){

    largeframe.visible=true;

    service_def.visible=true;

    shareholder_def.visible=true;

    sol_tra_def.visible=true;

    sta_up_def.visible=true;

    strategy_def.visible=true;

    system_def.visible=true;

    }

    function showVwords(){

    largeframe.visible=true;

    vision_def.visible=true;

    }

    function showWwords(){

    largeframe.visible=true;

    wholesale_def.visible=true;

    }

    function Letterbuttonsdisappear(){

    largeframe.visible=true;

    A_button.visible=false;

    B_button.visible=false;

    C_button.visible=false;

    D_button.visible=false;

    E_button.visible=false;

    F_button.visible=false;

    G_button.visible=false;

    H_button.visible=false;

    I_button.visible=false;

    J_button.visible=false;

    K_button.visible=false;

    L_button.visible=false;

    M_button.visible=false;

    N_button.visible=false;

    O_button.visible=false;

    P_button.visible=false;

    Q_button.visible=false;

    R_button.visible=false;

    S_button.visible=false;

    T_button.visible=false;

    U_button.visible=false;

    V_button.visible=false;

    W_button.visible=false;

    X_button.visible=false;

    Y_button.visible=false;

    Z_button.visible=false;

    def_back.visible=true;

    }

    function Letterbuttonsappear(){

    largeframe.visible=false;

    A_button.visible=true;

    B_button.visible=true;

    C_button.visible=true;

    D_button.visible=true;

    E_button.visible=true;

    F_button.visible=true;

    G_button.visible=true;

    H_button.visible=true;

    I_button.visible=true;

    J_button.visible=true;

    K_button.visible=true;

    L_button.visible=true;

    M_button.visible=true;

    N_button.visible=true;

    O_button.visible=true;

    P_button.visible=true;

    Q_button.visible=true;

    R_button.visible=true;

    S_button.visible=true;

    T_button.visible=true;

    U_button.visible=true;

    V_button.visible=true;

    W_button.visible=true;

    X_button.visible=true;

    Y_button.visible=true;

    Z_button.visible=true;

    def_back.visible=false;

    }

  • RELEVANCY SCORE 2.18

    DB:2.18:Raxmrg Module: Customer Merge p1


    Hi experts,

    10g database with ebs 10.2.0.4 on AIX.

    I use customer account merge option which run's a concurrent req internally, that gone in error. Log file showing like:

    ---------------------------------------------------------------------------
    Receivables: Version : 11.5.0

    Copyright (c) 1979, 1999, Oracle Corporation. All rights reserved.

    RAXMRG module: Customer Merge
    ---------------------------------------------------------------------------

    Current system time is 01-APR-2011 14:04:52

    ---------------------------------------------------------------------------

    +-----------------------------
    | Starting concurrent program execution...
    +-----------------------------

    Arguments
    ------------
    P_PROCESS_FLAG='PROCESSING'
    P_FROM_CUSTOMER='20989'
    P_TO_CUSTOMER='16328'
    P_PRIORITY='P3'
    P_NUMBER_OF_MERGES='1'
    ------------

    Current NLS_LANG and NLS_NUMERIC_CHARACTERS Environment Variables are :
    American_America.US7ASCII

    ' '

    ---------------------------------------------------------------------------
    Start of log messages from FND_FILE
    ---------------------------------------------------------------------------
    ---------------------------------------------------------------------------
    End of log messages from FND_FILE
    ---------------------------------------------------------------------------

    ---------------------------------------------------------------------------
    Executing request completion options...

    Finished executing request completion options.

    ---------------------------------------------------------------------------
    APP-FND-01630: Cannot open file /d05_proddbx/tmp/OF-Hug5T.t for reading

    Cause: USDINS encountered an error when attempting to open file /d05_proddbx/tmp/OF-Hug5T.t for reading.

    Action: Verify that the filename is correct and that the environment variables controlling that filename are correct.

    Action: If the file is opened in read mode, check that the file exists. Check that you have privileges to read the file in the file directory. Contact your system administrator to obtain read privileges.

    Action: If the file is opened in write or append mode, check that you have privileges to create and write files in the file directory. Contact your system administrator to obtain create and write privileges.
    Concurrent request completed
    Current system time is 01-APR-2011 14:06:09

    ---------------------------------------------------------------------------

    I could'nt find the reason/solution.

    Please suggest if anyone have any idea.

    Thanks in ADV

    DB:2.18:Raxmrg Module: Customer Merge p1

    Hi;

    What is your exact version?

    Customer Merge Program (RAXMRG) errors with APP-FND-01630 [ID 565632.1]
    APP-FND-1630 Error For All Concurrent Requests that access the database. [ID 554377.1]

    Regard
    Helios

  • RELEVANCY SCORE 2.18

    DB:2.18:Hdbschema Is Not Visible 71



    Hi All,

    I am following the development video HANA Native Development -- Exercise 2: Creating database objects via the repository and I got stuck with several questions at the step where it makes a new schema under the project folder.

    I made the schema as instructed, committed and activated it without error. But, it is not getting displayed under catalog in navigator preference tab. I refreshed the project several times and tried closing and opening the hana studio completely, but nothing helped me.

    My question-

    1) Is the schema actually created and is somehow not visible to me? reasoning lies- I could activate it and cannot reuse the same name when I try to create another schema. Also, I can create table under that schema that too without error.

    2) The hdbtable file which I created, is available under catalog Public synonyms. The question is WHY? Also, the table name has the complete path of the schema that i created and wonder where it is lying.

    3) I had added the system initially, and when I tried to create a hdbtable under that schema, i could see the table in that schema as well as under public synonyms. WHY again?

    I am really getting confused with all these and I wish if I could reach directly to the mentor Thomas Jung.

    Please help me guys.

    Thanks,

    Atul

    DB:2.18:Hdbschema Is Not Visible 71


    Excellent

    All my questions got answered.

  • RELEVANCY SCORE 2.18

    DB:2.18:Nsapi/ Wl-Proxy Problem m1


    When I try and attach a large file through the wl-proxy, I get a READ_ERROR_FROM_CLIENT:

    trying to POST /jive4/attach.jspa, Client-Auth reports: Cannot buffer client data
    -wl-proxy reports: IO error reading POST data at line 628 of proxy.cpp, system error: The operation completed successfully.
    -exception occurred: READ_ERROR_FROM_CLIENT [os error=0, line 629 of proxy.cpp]: reading client POST data failed.

    What do you guys think it is?

    DB:2.18:Nsapi/ Wl-Proxy Problem m1

    I am getting the same error. Does anyone have any info on this problem? The odd part is that the form I use to post the data is accessed without any error. Post permissions are wide open too.

  • RELEVANCY SCORE 2.18

    DB:2.18:Issue With Gyro Sensor Reading Vs Range cp



    Hi, I am wirting an simple app that can take gyro reading and put reading into a data file.

    It works, but i fell like the data i collected may be wrong. The thing is that I foud out my range should from-2000 to 2000, but my gyro readings are between -2 to 2. I dont really understand why. Did i do wrong or it is supposed to be.Below is part of my code. Thanks.

    __________________________________________________​_____________________________________

    SensorBpsEventHandler:ensorBpsEventHandler(){ m_isMeasurement = false; x = 0.0; y = 0.0; z = 0.0; bps_initialize(); cout "----------------------------------" endl; if(sensor_is_supported(SENSOR_TYPE_GYROSCOPE)) { int res = BPS_FAILURE; cout "SensorBpsEventHandler: SENSOR_TYPE_gyro is supported!" endl; subscribe(sensor_get_domain()); sensor_request_events(SENSOR_TYPE_GYROSCOPE); //sensor_set_skip_duplicates(SENSOR_TYPE_LIGHT, true);// unsigned int new_rate = 140000;// res = sensor_set_rate(SENSOR_TYPE_LIGHT, new_rate);// if(BPS_SUCCESS == res)// {// cout "SensorBpsEventHandler: SENSOR_TYPE_LIGHT: successfully set delay to " new_rate " microseconds" endl;// }// else// {// cout "SensorBpsEventHandler: SENSOR_TYPE_LIGHT: cannot set delay to " new_rate " microseconds" endl;// } sensor_info_t* p_sinfo = NULL; res = sensor_info(SENSOR_TYPE_GYROSCOPE, p_sinfo); if(BPS_SUCCESS == res NULL != p_sinfo) { float resolution = sensor_info_get_resolution(p_sinfo); float rmin = sensor_info_get_range_minimum(p_sinfo); float rmax = sensor_info_get_range_maximum(p_sinfo); unsigned int dmin = sensor_info_get_delay_minimum(p_sinfo); unsigned int dmax = sensor_info_get_delay_maximum(p_sinfo); unsigned int ddef = sensor_info_get_delay_default(p_sinfo); float power = sensor_info_get_power(p_sinfo); cout "resolution = " resolution endl; cout "range_minimum = " rmin endl; cout "range_maximum = " rmax endl; cout "delay_minimum = " dmin " microseconds" endl; cout "delay_maximum = " dmax " microseconds" endl; cout "delay_default = " ddef " microseconds" endl; cout "The power consumed by the sensor = " power endl; m_max = m_current= rmax; sensor_info_destroy(p_sinfo); } else { cout "SensorBpsEventHandler: cannot extract sensor_info for SENSOR_TYPE_ACC! return value = " res endl; } } else { cout "SensorBpsEventHandler: SENSOR_TYPE_ACC isn't supported!" endl; } cout "----------------------------------" endl;}SensorBpsEventHandler::~SensorBpsEventHandler(){ sensor_stop_events(SENSOR_TYPE_GYROSCOPE); bps_shutdown();}void SensorBpsEventHandler::event( bps_event_t *event ) {// cout "SensorBpsEventHandler::event" endl; FILE *fp; //the blank position of file pointer size_t size; fp=fopen("shared/documents/gyro.csv", "a");//open or create a csv file if (fp == NULL) //check if has file open error printf("I couldn't open for writing.\n"); else{ } if (bps_event_get_domain(event) == sensor_get_domain())//reading sensor { uint16_t code = bps_event_get_code(event); if (code == SENSOR_GYROSCOPE_READING) { // Keyboard is now visible. Handle event...// cout "SENSOR_LIGHT_READING event..." endl; sensor_event_get_xyz(event,x,y,z); uint64_t flags = sensor_event_get_flags(event); sensor_accuracy_t acc = sensor_event_get_accuracy(event); uint64_t ts = sensor_event_get_timestamp(event); if(m_isMeasurement)//there is always a measurement { //cout ts/1000000 "ms"setw(15); //printf("%lu ms", ts/1000000); cout"Printing"endl; fprintf(fp,"%.9f,%.9f ,%.9f ", x,y,z);//x y z reading in the same row fprintf(fp,"\n"); // next line } m_isMeasurement = true; } else { cout "Received event # " code endl; } } else { cout "Received unknown domain event" endl; } fclose(fp);}

    DB:2.18:Issue With Gyro Sensor Reading Vs Range cp


    Ya, just by shaking the phone in my hand I get around 2. Maybe if you bolt the phone to your car tire and accellerate hard on the highway you'll get higher values... my guess that max of 2000 is what the sensor will not give over, no matter what happens. It's a float value, so you can scale it to whatever you want.

    As a side note, I work with sensors on my app and I found it's very useful to go on blackberry World and download a bunch of "sensor" apps that display the sensors in nice line graphs so I get a feel for how they work.

  • RELEVANCY SCORE 2.18

    DB:2.18:Cannot Delete Team Project / Project Is Not Visible pp


    Hi,
    I've got a problem with a team project which I created yesterday.

    I cannot see the project on the tfs-website, so I tryed to delete it about the developer console:
    TFSDeleteProject /force /collection:https://myname.visualstudio.com/DefaultCollection ProjectName
    Here I get the following error:
    TF200040: You cannot delete a team project with your version of Team Explorer. Contact your system administrator to determine how to upgrade your Team Explorer client to the version compatible with Team Foundation Server.

    First I thought, the project was not created but if I want to create a new project with the same name, I got the message that the project still exists.
    Anyone an idea for this problem?
    Thanks,
    Frank

  • RELEVANCY SCORE 2.18

    DB:2.18:Live Upgrade Problem cx


    Hi All!

    I am trying to make Live Upgrade ABE but getting error:

    luconfig: ERROR: Cannot get system mounts.
    ERROR: Configuration of boot environment failed.

    Does anybody know what is this and how can I fix it? I'll be very grateful for any help.

    My configurartion:
    Oracle Solaris 10 8/11 x86

    I'm trying execute next command: "lucreate -n newenv -c oldenv -m /:/dev/dsk/c0t2d0s1:ufs -l /tmp/lucreate.log" and getting this output:

    Determining types of file systems supported
    Validating file system requests
    Preparing logical storage devices
    Preparing physical storage devices
    Configuring physical storage devices
    Configuring logical storage devices
    Checking GRUB menu...
    System has findroot enabled GRUB
    Analyzing system configuration.
    Updating boot environment description database on all BEs.

    luconfig: ERROR: Cannot get system mounts.
    ERROR: Configuration of boot environment failed.

    Error log file content:

    reading tag: unexpected newline reading parameter value name message tag message inside tag bootenv
    cannot read tag from datastream lupi_zones
    cannot read and parse tag provider lupi_zones datastream lupi_zones
    reading tag: invalid character / (0x2f) before start of tag
    cannot read tag from datastream lupi_zones
    cannot read and parse tag provider lupi_zones datastream lupi_zones
    reading tag: invalid character (0x3e) before start of tag
    cannot read tag from datastream lupi_zones
    cannot read and parse tag provider lupi_zones datastream lupi_zones
    reading tag: close tag bootenv not within any tag to close
    cannot read tag from datastream lupi_zones
    cannot read and parse tag provider lupi_zones datastream lupi_zones
    ERROR: Configuration of boot environment failed.

    hardware:
    I have two HDD:
    FIRST: it contains system root slice (c0t0d0s1) - 4G and swap (c0t0d0s0) - 1G
    SECOND: i'm trying to use for new ABE, it has c0t2d0s1 slice 7G and c0t2d0s0 for swap - 1G

    Thanks!

    I've fixed this issue - just installed packages SUNWpool and SUNWpoolr. (Just in case if it'll be intresting for somebody...)

    Edited by: user2915199 on Oct 9, 2012 6:43 AM

    DB:2.18:Live Upgrade Problem cx

    I've fixed this issue - just installed packages SUNWpool and SUNWpoolr. (Just in case if it'll be intresting for somebody...)

  • RELEVANCY SCORE 2.18

    DB:2.18:Kaleidoscope Effect Between Pictures p7



    Hi!

    I am aware of the build-in effect "kaleida" but I want to "merge" one image into another using a kaleidoscope effect. Meaning that both pictures will (at some point) be visible because I want to create a scene change.

    After reading some tutorials (and trying to adjust the effect in after effects) it seems to me that I cannot obtain that with kaleida. Am I correct?

    Is there any other way to do this?

    Thanks!

    DB:2.18:Kaleidoscope Effect Between Pictures p7


    Sounds perfectly doable, but you're gonna need additional "kaleida-fied" mattes, meaning you'd have to figuire out how to create a b/w gradient and then mirror it in sync with your two different footage kaleidoscopes. and how complicated that gets will depend on what pattern you use, of course.

    Mylenium

  • RELEVANCY SCORE 2.17

    DB:2.17:I Have Succesully Registered My Signing Keys For The Playbook, Now I Want To Sign My App And Deploy My App To The Device. cs



    Iam following

    http://developer.blackberry.com/playbook/html5/documentation/running_your_app_on_a_device.html

    Create a debug token

    But when I typed

    blackberry-debugtokenrequest -storepass KeystorePassword
    -devicepin device PIN debug_token_file_name.bar
    like

    blackberry-debugtokenrequest -storepass password-devicepin 123456 C:\TabletAppsOutput\MyApp.bar

    I got the following error

    Error: Keystore load: C:\Users\Shravan\AppData\Local\Research In Motion\author.p12 (The system cannot find the file specified)

    Note: I have already instaled BlackBerry Tablet OS code signing keys

    but author.p12 not visible at C:\Users\Shravan\AppData\Local\Research In Motion\author.p12

    DB:2.17:I Have Succesully Registered My Signing Keys For The Playbook, Now I Want To Sign My App And Deploy My App To The Device. cs


    It could be, check the permissions to that folder.




    Mark SohmBlackBerry Development AdvisorPlease refrain from posting new questions in solved threads.Problem solved? Click the Accept As Solution button.Found a bug? Report it using Issue Tracker

  • RELEVANCY SCORE 2.17

    DB:2.17:Cannot Create A System Repair Disc Error Code 0x80070057 kd


    I know there are numerous threads from people with this problem, but they all require a Windows Installation disc which I do not have as I downloaded Windows.

    DB:2.17:Cannot Create A System Repair Disc Error Code 0x80070057 kd


    The recovery partition would have been from your origonal win installation, what previous version of win was installed?
    If you upgraded to win7 with an upgrade win7 version you would normally expect to see an unamed System Reserved Partition of 100mb, which contains win7 boot info
    You can review this previous thread re System repair Disk problem
    http://answers.microsoft.com/en-us/windows/forum/windows_7-system/system-repair-disc-could-not-be-created-the/278cb626-45a6-491e-abbd-74b0c6ac73c8

    You should be aware that a system repair disk is not a replacement for the actual win7 installation media

    As I have a fairly similar issue to the author of the thread, I hope you dont mind me commenting here ...
    I have the 0x80070057 issue and have had for over a year... (i7 Dynabook, 8GB Ram, 1TB H/D Wibdows 7 x64 UPDATED to Ultimate)............ I am commenting because ...

  • RELEVANCY SCORE 2.17

    DB:2.17:Script Error 1z


    Hi, can anyone just cast an eye over this script to see why the pages aren't appearing as I cannot see why it shouldn't work.

    form1.DropDownList161::exit - (JavaScript, client)
    if (this.rawValue=="Transfer"){
    Page1.presence = "visible";
    Page2.presence = "visible";
    Page3.presence = "hidden";
    Page3.Signature.presence = "visible";
    }
    if (this.rawValue=="Closing"){
    Page1.presence = "visible";
    Page2.presence = "hidden";
    Page3.presence = "visible";
    Page3.Signature.presence = "visible";
    }

    Thanks

    Steve

    DB:2.17:Script Error 1z


    Send it to LiveCycle8@gmail.com ....include a description of the issue with the email.

    paul

  • RELEVANCY SCORE 2.17

    DB:2.17:Cannot Create Recovery Discs On Satellite L500 8c



    I have tried on a number of occasions to create the Recovery discs on my Satellite L500, model PSLJ3A-01V105

    which is only 4 months old. I was using Verbatim DVD +RW and on each occasion the first disc failed with the message that it could not read "D:\sources\boot.wim". This occurred on three occasions. After reading a post suggesting the use of a DVD-R disc I tried again and again the disc failed this time with a different error message. On each occasion when the disc was inspected a number of files had been created but the error message said that the transfer had failed. Any suggestions?

    DB:2.17:Cannot Create Recovery Discs On Satellite L500 8c


    they said it either the disc, partition or could be your OS. Since you've tried several disc you might want to run system recovery first then after that immediately create your recovery cd.




    =========================================================
    the only easy day was yesterday.....
    =========================================================

  • RELEVANCY SCORE 2.17

    DB:2.17:Cannot Manually Create A System Restore Point In Windows 8.1 Pro, Error Code 0x81000203 p9


    My Windows 8.1 Pro doesn´t create system restore points.
    When I manually try to create a system restore point, I get the error message "Unexpected Error" and the code 0x81000203.
    What is to do?

  • RELEVANCY SCORE 2.17

    DB:2.17:Program Error In Class Sapmssy1 Method When Filtering On Source System Id 7z



    Whenever I try to filter my Source System ID in the BEx Query Designer (BI 7.0), I get the error:

    Reading Characteristic Values

    Program error in class SAPMSSY1 method : UNCAUGHT_EXCEPTION.

    And I cannot filter my Source System ID.

    Does anybody know how to resolve this?

    DB:2.17:Program Error In Class Sapmssy1 Method When Filtering On Source System Id 7z


    Whenever I try to filter my Source System ID in the BEx Query Designer (BI 7.0), I get the error:

    Reading Characteristic Values

    Program error in class SAPMSSY1 method : UNCAUGHT_EXCEPTION.

    And I cannot filter my Source System ID.

    Does anybody know how to resolve this?

  • RELEVANCY SCORE 2.17

    DB:2.17:Re: How To Query Repository? 8f


    Use the FORTE_LOGGER_SETUP environment variable and create it as system (so it cam be visible to any forte installation)

    DB:2.17:Re: How To Query Repository? 8f

    Hi labeaux

    I came across this posting that you had replied to earlier. Do you still have any information on how to connect to repository? I want to query it to get information on various components in it.

    Thanks in advance for your help. If you want, you can email me at jjacobs_work@yahoo.com.

    Sincerely,

    - JJ

  • RELEVANCY SCORE 2.17

    DB:2.17:Ioexception Error, When File Reading 9f


    Error is:
    java.io.FileNotFoundException: input.txt (The system cannot find the file specified)

    I get the error when i try to run the Copy class from the following location: http://java.sun.com/docs/books/tutorial/essential/io/filestreams.html

    The text files both exist but it still does not work. Help please

    Savax

    DB:2.17:Ioexception Error, When File Reading 9f

    try and use forward slashes when possible, works better for me anyway

  • RELEVANCY SCORE 2.17

    DB:2.17:Cannot Connect To Mapped Network Drive 79



    I am trying to connect to a network drive over file manager and get the following error message:

    Reading directory list of V:\ failed

    The system cannot find the path specified (3)

    Does anyone know how to resolve this issue?







    Solved!
    Go to Solution.

    DB:2.17:Cannot Connect To Mapped Network Drive 79


    I login a virtual machine on the remote server with my server username, password and domain and I don't get my mapped drives to show at all, they used to and then they would disappear and a reset of the vm would sometimes fix it, now it's not happening at all, any ideas?

  • RELEVANCY SCORE 2.17

    DB:2.17:Sql Network Interface, Error 28 as


    When I initially downloaded SQL Server Express the System tables were visible using SQL Server Management Studio Express.  I was able to create a new database and define and populate a couple of small tables.  I then attempted to set up an ODBC SQL Natvie Client connection so that I could print the table contents using Crystal Reports.  That failed with the following error message:
    An error occurred while establishing a connection to the server.  When connecting to SQL Server 2005, this failure may be caused by the fact that under the default setting SQL Server does not allow remote connections.
     
    I subsequently uninstalled and reinstalled SQL Server Express.  Now, I get the following error message whenever I try to connect to the database using SQL Server Management Studio Express.  Additionally, the System tables are no longer visible.  However, I can access my database via the Server Explorer in VS2005.
     
    TITLE: Connect to Server------------------------------
    Cannot connect to STAN-DELL\SQLEXPRESS.
    ------------------------------ADDITIONAL INFORMATION:
    An error has occurred while establishing a connection to the server.  When connecting to SQL Server 2005, this failure may be caused by the fact that under the default settings SQL Server does not allow remote connections. (provider: SQL Network Interfaces, error: 28 - Server doesn't support requested protocol) (Microsoft SQL Server, Error: -1)
    For help, click: http://go.microsoft.com/fwlink?ProdName=Microsoft+SQL+ServerEvtSrc=MSSQLServerEvtID=-1LinkId=20476
     
     

    DB:2.17:Sql Network Interface, Error 28 as

    Would you please check-out
    http://blogs.msdn.com/b/sql_protocols/archive/2008/04/30/steps-to-troubleshoot-connectivity-issues.aspx
    Step 4FAQ

    ----
    Regards,
    Ahmed Ibrahim
    SQL Server Setup Team
    My Blog
    This posting is provided AS IS with no warranties, and confers no rights. Please remember to click
    Mark as Answer and Vote as Helpful
    on posts that help you.
    This can be beneficial to other community members reading the thread.

  • RELEVANCY SCORE 2.17

    DB:2.17:Read_Error_From_Client pk


    When I try and attach a large file through the wl-proxy, I get a READ_ERROR_FROM_CLIENT:

    trying to POST /jive4/attach.jspa, Client-Auth reports: Cannot buffer client data
    -wl-proxy reports: IO error reading POST data at line 628 of proxy.cpp, system error: The operation completed successfully.
    -exception occurred: READ_ERROR_FROM_CLIENT [os error=0, line 629 of proxy.cpp]: reading client POST data failed.

    What do you guys think it is?

    DB:2.17:Read_Error_From_Client pk

    When I try and attach a large file through the wl-proxy, I get a READ_ERROR_FROM_CLIENT:

    trying to POST /jive4/attach.jspa, Client-Auth reports: Cannot buffer client data
    -wl-proxy reports: IO error reading POST data at line 628 of proxy.cpp, system error: The operation completed successfully.
    -exception occurred: READ_ERROR_FROM_CLIENT [os error=0, line 629 of proxy.cpp]: reading client POST data failed.

    What do you guys think it is?

  • RELEVANCY SCORE 2.17

    DB:2.17:Incentive And Commission Management 81



    Hi,

    We are planning to implement Incentive and commission management. But I havent come across any best practice document or config steps for this functionality.

    I am trying to use help.sap.com but when I try to create my application and select pacakges for it I get following error

    Error in package dependencies

    Message no. CACSPACK012

    Diagnosis

    While reading the packages, the system detected errors in the standard packages and package dependencies.

    System Response

    Due to these inconsistencies, the process is being canceled to avoid further errors.

    Procedure for System Administration

    This error can only be corrected by SAP. Contact SAP support.

    Internal error description: Cannot resolve package dependencies for package CA.

    Also, there are not many proper threads on this topic. Lets keep sharing our experienes and steps here so that we have a common proper thread on this topic.

    Regards,

    Hamed

    DB:2.17:Incentive And Commission Management 81


    Adding to what Manas mentions, Commissions management is one space where it doesn't make sense to have a best practice. How you want to compensate an employee or partner is something every company wants to implement uniquely. i.e. the rules of company A do not match rules of company B. That is the USP of the compensation plan, unlike other areas where you want to standardize to the most effective way of doing business.

    Hence SAP cannot provide you with a best practice for this solution.

    Regards

    Rahul

  • RELEVANCY SCORE 2.17

    DB:2.17:App-Sqlap-97734: The System Cannot ....: &Amp;Message m9


    We customized PAAPINVW workflow (Project Supplier Invoice Account Generation), it is completing in normal.
    But when we create a Project Invoice and click on line distributions we are getting below error.

    All attributes are set, and are visible with values in workflow details in status monitor.

    APP-SQLAP-97734: The system cannot generate distributions for line 1 because: MESSAGE.
    If i hardcoded the segment assignments with constant for a particular values it is working fine.

    Please let me know any one faced the same.

    Thanks.

    DB:2.17:App-Sqlap-97734: The System Cannot ....: &Amp;Message m9

    We customized PAAPINVW workflow (Project Supplier Invoice Account Generation), it is completing in normal.
    But when we create a Project Invoice and click on line distributions we are getting below error.

    All attributes are set, and are visible with values in workflow details in status monitor.

    APP-SQLAP-97734: The system cannot generate distributions for line 1 because: MESSAGE.
    If i hardcoded the segment assignments with constant for a particular values it is working fine.

    Please let me know any one faced the same.

    Thanks.

  • RELEVANCY SCORE 2.17

    DB:2.17:Unable To Create Bcd Files When Creating Win Pe Image zz



    Hi,

    I am trying to do provisioning Win2k3 SE. I need Win PE image for the same, but getting errors regarding BCD Files.I have tried it by 2 ways.

    1. When I am trying to create Win PE Image through Provisioning Manager Console, I am getting following Error:

    Copying CreateWinPE2_0.Bat file from //192.168.1.222/D/BMC_BL/provisioning/winpe/CreateWinPE2_0.Bat to //192.168.1.222/D/ProgramFiles/Windows AIK/Tools/PETools/CreateWinPE2_0.Bat...Generating Driver.txt file...Copying Driver.txt file to //192.168.1.222/D/BMC_BL/provisioning/winpe/Driver.txt...Generating InvokeCreateWinPE2_0.Bat file...Copying InvokeCreateWinPE2_0.Bat file to //192.168.1.222/D/ProgramFiles/Windows AIK/Tools/PETools/InvokeCreateWinPE2_0.Bat...Starting batch script execution...Copying x86 specific Winpe Image to Temp folder D:\BMC_BL\provisioning\winpe\tmpMounting x86 Winpe Image to D:\BMC_BL\provisioning\winpe\tmp\mountCopying Bladelogic Tools and BMI from D:\BMC_BL\provisioning\winpe to D:\BMC_BL\provisioning\winpe\tmp\mount\windows\system32Copying Windows AIK PETools and BMI from D:\BMC_BL\provisioning\winpe to D:\BMC_BL\provisioning\winpe\tmp\mount\windows\system32Starting BCD Creation. GUID: Checking for driver files.Generating Driver Injection code...Reading Driver info into environment...All done. Checking for Custom Script... Preinstallation Environment Image Setup Tool for WindowsCopyright (C) Microsoft Corporation. All rights reserved.The system cannot find the path specified.The system cannot find the path specified.The system cannot find the path specified.The system cannot find the path specified.The system cannot find the path specified.The system cannot find the path specified.The system cannot find the path specified.The system cannot find the path specified.The system cannot find the path specified.The system cannot find the path specified.The system cannot find the path specified.The system cannot find the path specified.The system cannot find the path specified.The image directory specified is not a valid Windows PE image.PEIMG failed to complete the operation with status code 0x8007000d.Preinstallation Environment Image Setup Tool for WindowsCopyright (C) Microsoft Corporation. All rights reserved.The image directory specified is not a valid Windows PE image.PEIMG failed to complete the operation with status code 0x8007000d.Committing changes to modified x86 WinPE image.The system cannot find the file specified.--------------------------------------------------------------------------Summary of operation: Bladelogic x86 WinPE image created successfully.--------------------------------------------------------------------------TODO:Please copy D:\BMC_BL\provisioning\winpe\tmp\pxewin2k3_2 to tftproot\pxewin2k3_2 of TFTP server.Could Not Find D:\BMC_BL\provisioning\winpe\tmp\BCD.LOGBCD file(s) not created.Image creation failed.======================================================

    2. By running the script "CreateWinPE2_0.bat", I am getting following Error message:

    bcdedit.exe-Entry Point Not Found.

    The procedure entry point _except_handler4_common could not be located in the dynamic link library msvcrt.dll

    ==========================================================================================

    Can anyone help on this. Why I am getting this error and what could be the solution for this.

    Thanks in advance.

    DB:2.17:Unable To Create Bcd Files When Creating Win Pe Image zz


    This may be also if you didn't run the pesetenv.cmd command, or maybe the outdir is existing

  • RELEVANCY SCORE 2.17

    DB:2.17:Difference Between Urgent Correction And Correction kp



    Hello!

    I have problem to set up CharM functionality in Solution Manager 4.0 (SP13).

    The current problem I am facing is:

    - I can succesfully create and process a correction

    - but I cannot process a urgent correction due to error:

    no maintenance cycle is open for the current system and

    IBase component is not a production system in system landscape

    In tcode /TMWFLOW/MAINTINST it is also not possible to create an urgent correction due to error:

    No production system is specified for Solution Manager project XYZ

    Message no. /TMWFLOW/TASKLIST144

    I can see that no productive systems are there.

    How can productive system be set and visible there in order to create an urgent correction?

    Thanks regards!

    Thom

    DB:2.17:Difference Between Urgent Correction And Correction kp


    Hello!

    I have problem to set up CharM functionality in Solution Manager 4.0 (SP13).

    The current problem I am facing is:

    - I can succesfully create and process a correction

    - but I cannot process a urgent correction due to error:

    no maintenance cycle is open for the current system and

    IBase component is not a production system in system landscape

    In tcode /TMWFLOW/MAINTINST it is also not possible to create an urgent correction due to error:

    No production system is specified for Solution Manager project XYZ

    Message no. /TMWFLOW/TASKLIST144

    I can see that no productive systems are there.

    How can productive system be set and visible there in order to create an urgent correction?

    Thanks regards!

    Thom

  • RELEVANCY SCORE 2.17

    DB:2.17:Error Creating Media. Error Message Is Cannot Create A File When That File Already Exists mc


    I am trying to create a standalone media. Getting an error:error creating media. error message is cannot create a file when that file already exists.
    Reading the log i am getting an error800700b7 on a win file package. Wim file is about 7.4 g
    Could that be a problem that wim file is too big?

    Thank you.

    DB:2.17:Error Creating Media. Error Message Is Cannot Create A File When That File Already Exists mc

    Have a Look on this, maybe that solve your Problem
    http://www.myitforum.com/forums/m205128-print.aspx