• RELEVANCY SCORE 3.70

    DB:3.70:Directx Erroran Internal System Error Occured. Please Refer To Dxerror.Log And Directx.Log In Your Windows Folder To Determine The Problem. m1





    ''An internal system error occured.
    Please refer to DXError.log and Directx.log in your Windows folder to determine the problem.''

    DB:3.70:Directx Erroran Internal System Error Occured. Please Refer To Dxerror.Log And Directx.Log In Your Windows Folder To Determine The Problem. m1

    Hi Dave,

    I would suggest that you download and install the latest Platform Update for WindowsDirectX on Windows 7.

    Here is the link for the download:

    Platform Update for Windows 7

    I would also recommend that you run SFC Scan on the computer. System File Checker is a utility in Windows that allows users to scan for corruptions in Windows system files and restore corrupted files. This article describes how to run the System File Checker
    tool (SFC.exe) to scan your system files and to repair missing or corrupted system files in Windows 8.1, Windows 8, Windows 7 or Windows Vista. If a Windows Resource Protection (WRP) file is missing or is corrupted, Windows may not behave as expected. For
    example, some Windows functions may not work, or Windows may crash.

    The link provided below will give you more information on how to run the SFC scan on the computer.

    Use the System File Checker tool to repair missing or corrupted system files

    Also see:

    Diagnosing basic problems with DirectX
    http://windows.microsoft.com/en-ca/windows7/diagnosing-basic-problems-with-directx

    Do let us know the status of the issue.

  • RELEVANCY SCORE 3.70

    DB:3.70:Internal Error (-1102) Occured [Message 131-183] dx






    Hi Experts,

    when i connect SAP Client to Server then system give the Error Message

    "Re: Internal error (-1102) occured [message 131-183]"

    I am Using SAP 8.8 and SP00 and PL 10

    So Please Help Me.

    Dixit Patel

    Edited by: Dixit Patel on May 27, 2010 12:18 PM

    DB:3.70:Internal Error (-1102) Occured [Message 131-183] dx


    Control Panel\All Control Panel Items\Administrative Tools

    Component services--Computersmycomputers--

    Docom Configsap- propartesidentifier userinterface--ok- restart.

  • RELEVANCY SCORE 3.65

    DB:3.65:An Internal Error Occured xm






    Hi,

    I am getting some internal error while building,launching,executing rapc in eclipse for Blackberry development.

    Im not getting why it is coming all of the sudden.

    I tried creating new project and copying my files to new project but it didnt work...

    An internal error occurred during: "Deploying Default".java.lang.NullPointerException

    Please help.

    DB:3.65:An Internal Error Occured xm


    Try to reinstall Eclipse BB Plugin software.

    If it won't help make a new project in fresh reinstalled Eclipse BB Plugin.

  • RELEVANCY SCORE 3.63

    DB:3.63:Internal System Error 500 Has Occured 3s


    accessing the internet gives me this message internal system error has occured what is the solution to this?

    DB:3.63:Internal System Error 500 Has Occured 3s

    Hi Carmine di cesare,

    When do you get this error message?
    Cause
    The 500 Internal Server Error is a very general HTTP status code that means something has gone wrong on the web site's server but the server could not be more specific on what the exact problem is.
    Resolution
    The 500 Internal Server Error is a "server-side" error, meaning the problem is not with your PC or Internet connection but instead is a problem with the web site's server.

    1. Retry the web page by clicking the refresh/reload button from the address bar again. Even though the 500 Internal Server Error is reporting a general error on the web site's servers and not your computer, the server error may only be temporary.
    Trying the page again will often be successful.

    2. Please contact us (email preferred) whenever you encounter 500 errors on your CheckUpDown account. We then have to liaise with your ISP and the vendor of the Web server software so they can trace the exact reason for the error.

    Thanks and Regards:
    Shalini Surana - Microsoft Support.
    Visit ourMicrosoft Answers Feedback Forumand let us know what you think.

  • RELEVANCY SCORE 3.61

    DB:3.61:Page Cannot Be Displayed Internal Server Has Occured 8z



    states page cannot be displayed internal server error has occured

    DB:3.61:Page Cannot Be Displayed Internal Server Has Occured 8z

    Question owner


    website is accessible at work but not at home, message says page cannot be displayed internal server error has occurred

  • RELEVANCY SCORE 3.51

    DB:3.51:500 Internal Server Error. Help Please!! fz





    Thanks so much everyone.

    DB:3.51:500 Internal Server Error. Help Please!! fz




    password

    change fast your root an plesk password - else anyone could delete your data!!!

  • RELEVANCY SCORE 3.34

    DB:3.34:Internal Error Occured k8



    I've just tried updating my Adobe Reader to the latest version but when I try to run the program I get the following error:

    "An internal error occured"

    I've tried uninstalling using Adobe's Cleaner Tool from http://labs.adobe.com/downloads/acrobatcleaner.html and also tried downloading and installing again from http://get.adobe.com/reader/enterprise/. I've also tried opening the program byu itself and not via a .pdf and I still get the error.

    I even ran a registry script to disable Protected Mode. Still get the error.

    Win 7 x64.

    Please help!

    DB:3.34:Internal Error Occured k8


    I don't have any of those registry scripts. I've been trying to download adobe reader xi for Windows 7.

  • RELEVANCY SCORE 3.34

    DB:3.34:Error On Sequencing File Io Error cj


     
    I am etting the following error when sequencing office 2007.
     
     
    C:\Program Files\Microsoft Application Virtualization Sequencer\Logs\filter.1.log was not found
     
    OK
     
    An internal Error has occured while saving the package.  The SFT file could not be saved.  PLease contact your system administrator.
     
    OK

    DB:3.34:Error On Sequencing File Io Error cj

    Hi, in the posts above there were severtal issues mentioned (Crashing Sequencer, Application having to be terminated) - so I kindly ask you to to open a new thread (ask a new question) with the issue you have Falko

  • RELEVANCY SCORE 3.33

    DB:3.33:Iphone 4 Cannot Be Sync. An Internal Device Error Occured mz


    Itunes 10.2.1 Iphone 4.2.1
    As my subject says, cannot sync with itunes because of an internal error.
    Please advise. Thanks.

    DB:3.33:Iphone 4 Cannot Be Sync. An Internal Device Error Occured mz

    Itunes 10.2.1 Iphone 4.2.1
    As my subject says, cannot sync with itunes because of an internal error.
    Please advise. Thanks.

  • RELEVANCY SCORE 3.33

    DB:3.33:Internal Exception Occured 0x1337ec1 3d



    Hi,

    i have a problem installing spotify on windows 7 enterprise. After program installation, i get the following error (sreenshot attached):

    An internal exception occured (Address: 0x1337ec1).

    I've tried uninstalling the program (using either full program executable) and i get the same error. Also tried reinstalling/removing the application from safe mode with no luck. Compatibility settings didn't make a difference either.

    Can you please advise how to proceed?

    Regards










    Attachments:




    DB:3.33:Internal Exception Occured 0x1337ec1 3d


    Same issue here. I used to get the error 17, but now I get this. I've tried deleting everything (even in the registry), reloading, installing and moving the spotify folder, etc. It won't run.Also, I get this even after moving the spotify folder to be under program files (X86), so I don't think the issue is appsdata related.

  • RELEVANCY SCORE 3.30

    DB:3.30:An Internal Error Occured While Calling 'Processdpcommands' Api. (Error: Err_Wis_30270) 1p



    Hi Pals,

    A user is facing the issue while schedulling the report. Only that user is facing the issue and as an Admin I am able to schedule the report without any error.

    Below is the error message :

    An internal error occured while calling 'ProcessDPCommands' API. (Error: ERR_WIS_30270)

    Please let help me to fix this issue. Is it related to any permission ?

    BOXI 3.1

  • RELEVANCY SCORE 3.29

    DB:3.29:Hi I'M Rajkiran M 7z



    I come across with an error when trying to preview my Xcelsius Dashboard

    error: An internal error occured while calling 'answerPromptsEx' API. (Error: ERR_WIS_30270)

    Please can some one help me regarding this.

    Thanks,

    Regards,

    Rajkiran M

    DB:3.29:Hi I'M Rajkiran M 7z


    Hi! I have the error: error: An internal error occurred while calling 'initInstance ' API. (Error: ERR_WIS_30270) in Android mobile.

    Anybody know what is it?

  • RELEVANCY SCORE 3.29

    DB:3.29:An Internal Facetime Error Occurred 7f


    I have an "Internal Facetime Error Occured" on my macbook air.Need a help with the fix.

    DB:3.29:An Internal Facetime Error Occurred 7f

    I have an "Internal Facetime Error Occured" on my macbook air.Need a help with the fix.

  • RELEVANCY SCORE 3.28

    DB:3.28:Adobe Fireworks Cs6 Is Not Opening .Saying Internal Eror Occured Help Me Please sk



    Adobe Fireworks cs6 is not opening .Saying internal eror occured help me please :


    DB:3.28:Adobe Fireworks Cs6 Is Not Opening .Saying Internal Eror Occured Help Me Please sk


    For me the Fireworks stopped when it got to "Intializing Tab Windows", then a crashed and displayed "Could not complete your request. an error occurred" and would never load. Basically dead. I couldn't use it at all. My whole workfow came to a stand still.

    BACKGROUND

    Just before this happened, I was trying a new feature from within Dreamweaver. While inside Dreamweaver, I could double-click an image file and it opened in my Fireworks to be edited. I thought . . . Wow, this is really cool. I edited that image and closed it and continued on my work. Since then, that "Connection" between applications has become permanent. Fireworks "THINKS" it is still connected to Dreamweaver. Later Fireworks would NOT open/load at. I would always get the above error.

    PARTIAL SOLUTION

    BTW: I had to do this twice, because the first time, I missed a file somewhere.

    I had to completely uninstall all ADOBE applications. I mean everything! I had CS3 CS4 and Adobe Readers on my system.

    Since I'm on the mac, I went through the "Application Support" both user and system and the "Preferences" for both user and system and deleted everything that had either "adobe" or "macromedia" in it. There was also a file in the "Launch Agent Daemons".

    I emptied the trash and did a power off restart. Then I reinstalled CS6. Now Fireworks at least loads and I can use it again, but it still isn't the same.

    OBSERVATION

    Fireworks and Dreamweaver are still "Connected". It won't save an existing PNG file as itself, it displays an error, "That file is open in another application", which is NOT true. I have to use the "Save As" option, and use the Finder to rename that file. I also notice an extra file labeled ex:0000056 which looks like the file I tried to save.

    So at least I can use my Fireworks again although it is irritating. I don't know how to "CUT" the connection between applications. Uninstalling reinstalling did NOT reset this, the only option left would be a backup, wipe and fresh install of my entire laptop. I just don't have time to do that right now. Hope that helps someone else.

    Arlene

  • RELEVANCY SCORE 3.28

    DB:3.28:Drive Now Showing As Local Disk? ks


    HELP Please!

    One of my disks in the SC101 is now only showing in Windows as Local Disk and when you try to access it, it says internal error has occured

    Any ideas please?

    Thanks

    Phil

    DB:3.28:Drive Now Showing As Local Disk? ks

    Nope no luck with the new software for me. Lost drive still attaches as local drive. I've not been game to update the firmware as there doesn't appear to be anything in the bug fix list that addressed this issue - which appears to be a corrupt superblock.

    My only option now is sfsextract - which of course means buying hardware to have anywhere to put the recovered data which is what I bought the SC101 for in the first place ...

    Time to check out those NDAS solutions for my part.

  • RELEVANCY SCORE 3.24

    DB:3.24:How Do I Know What Program To Reinstall I Recieved The Following Message Fatal Error, But An Internal Error Occured Please Re-Install The Product To Fix The Problem Error-Code 1-310900 f1


    Original Title: error-code; 1/-3/10900__
    What should i do? How do i know what program to reinstall (I recieved the following message) Fatal error we are very sorry, but an internal error occured please re-install the product to fix the problem error-code; 1/-3/10900 see Doc#5305 Please help this
    beginner!!!!!!!!!

  • RELEVANCY SCORE 3.24

    DB:3.24:Internal Error Code 91


    When I turn on my computer it says "An internal error occured. Please contact to our support team". HELP!

    Also "Unexpected HTTP Response Status Code 12007

    DB:3.24:Internal Error Code 91

    Hi Patretired07

    · Do you remember any recent software or hardware changes made on your computer after which you are facing the issue?
    · We would even require the error code if any which will help us troubleshoot better
    · When do you receive this error message mentioned: Unexpected HTTP Response Status Code 12007?

    I would suggest you to try the below steps:

    1. Check if the issue persists in safe mode, to boot the computer in safe mode, restart the computer and press and hold F8 key (Press and hold f8 key before the windows logo). From the
    advanced boot option select ‘Safe mode’.
    Link you may refer to: Start you computer in safe mode:
    http://windows.microsoft.com/en-US/windows7/Start-your-computer-in-safe-mode

    2. If the issue does not persist in safe mode, then boot the computer in clean boot and check if any third party program is causing the problem. To help troubleshoot error messages and
    other issues, you can start Windows 7 by using a minimal set of drivers and startup programs. This kind of startup is known as a "clean boot." A clean boot helps eliminate software conflicts.

    Follow the Steps listed below in the link to perform
    clean boot: http://support.microsoft.com/kb/929135
    Might be some third party application or program is causing the issue.

    After you have finished troubleshooting, follow these steps to reset the computer to start as usual:
    i. Click Start, type msconfig.exe in the Start Search box, and then press ENTER.
    ii. If you are prompted for an administrator password or for confirmation, type your password, or click Continue.
    iii. On the General tab, click the Normal Startup option, and then click OK.
    iv. When you are prompted to restart the computer, click Restart.

    3. Update all the drivers installed on your computer:
    http://windows.microsoft.com/en-us/windows7/Update-a-driver-for-hardware-that-isnt-working-properly

    Thanks and Regards:
    Samhrutha G S - Microsoft Support.
    Visit our Microsoft Answers Feedback Forum and let us know what you think.

  • RELEVANCY SCORE 3.21

    DB:3.21:When I Play Games I Have An Error Directx Error 89


    an internal error occured tell but dxdiag box tells directx 11 version but every directx wanted programme and games tell directx not installed then i have download directx latest version installed but the error still an internal error occured why this
    happening how to solve this i reinstalled windows 7 also still problem please help me please a
    error log file that will paste here

    DB:3.21:When I Play Games I Have An Error Directx Error 89

    Hi SreeRajT,

    1) What is the “internal error” that you are getting? I would like the error code as well.

    Method –

    You need to try to download and install the Directx by referring to the article mentioned below –
    http://support.microsoft.com/kb/179113

    Hope this helps!!

  • RELEVANCY SCORE 3.21

    DB:3.21:Thread: An Internal Error Occured. Please Check The Tomcat Log File 1p


    I get this error when I try to configure a user source. I have updated to 10.0.2 and I still get this error. Is there something that I am missing?

    Thanks,

    Peter

    DB:3.21:Thread: An Internal Error Occured. Please Check The Tomcat Log File 1p

    I pointed it to yet another server - this time running NW65SP8 - and it worked ( I got a user source created ). I checked ldapBindRestrictions parameter and it\'s set to 0 on all three servers that I have tried. Failed for two but worked for one of those and I noticed Dereference aliases when resolving names for authentication is not enabled on the one I\'ve had success with, it is enabled on other two servers. Not sure if this matters or is just a coincidence.

  • RELEVANCY SCORE 3.21

    DB:3.21:System Outofmemory Exception While Using Rdlc In Windows Application 18


    hi Everyone , I am Using Reporting Service (.rdlc) in my Windows application , i am getting Error System OutOfMemory Exception Like an error occured during local report processing An Unexpected error occured in Report Processing Exception of type 'System OutOfMemory Exception'Was Thrown what to do Please anyone help me ... Advance Thanks Anilmarnal

    DB:3.21:System Outofmemory Exception While Using Rdlc In Windows Application 18

    Hi Anil.What is the source for your report..Does it a datset..?Explain your scenario a little more..?Ravikumar

  • RELEVANCY SCORE 3.21

    DB:3.21:Error 0xcff47f p8



    When i try to start or uninstall Spotify I always get an error: "An internal exception occured (Adress:0xcff47f) Please contact support@spotify.com)". Before I contact the support, i will check if somebody know this problem and maybe the sollution.

    Does anyone know this problem?

    DB:3.21:Error 0xcff47f p8


    I've done a number of full manual uninstalls of everything in user/AppData and cleaned registries, tried running in installer and apps it installs in compatibaility mode all to no avail.

    Following the suggestions here: http://community.spotify.com/t5/Desktop-Windows/Ca​n-t-reinstall-uninstall-Spotify-on-Windows-7-64-bi​...

    Any other thoughts?

  • RELEVANCY SCORE 3.19

    DB:3.19:"A General System Error Occured: Internal Error" While Adding Gsx To Vc 9j


    "A general system error occured: internal error" while adding GSX to VC. Add new host wizard completes successfully but connection to GSX host fails. Reconnect does not help either.

    VMware VirtualCenter Version 2.5.0 Build 64192 on Win2003 SP2

    GSX Server 1.0.6 on Win2003 SP2

    Both are on the same network.

    I have even re-installed on clean machines both VC and GSX - no result.

    Double-checked all DNS settings as recommended at http://communities.vmware.com/message/523893

    Same error. Any ideas how to resolve it?

    Regards, Anton.

    DB:3.19:"A General System Error Occured: Internal Error" While Adding Gsx To Vc 9j


    Well, maybe it is true in general, but my personal experience provided no evidence of successful converting using VM conveter. I have tried several guests (with workstation 4, 5 and 6 VM format) to convert - none worked in ESX due to virtual hardware problems. By the way MVWare Ovftool provided offline functionality similar to converter but worked for me a bit faster.

    The question is - how can I upgrade to ESXi from Server if my hardware has no SCSI and has old processors?

  • RELEVANCY SCORE 3.18

    DB:3.18:Internal Error: The Value Of Parameter Id Is Invalid.(Error Inf) sm



    Help please..

    Internal error occured: Internal Error: the value of parameter id is invalid.

    Here is my code.

    ="a
    href=\'http://servername/businessobjects/enterprise
    115/desktoplaunch/opendoc/openDocument.jsp?sDocType=
    widsDoc
    Name=ReportName
    sWindow=NewsInstance=ParamRefresh=YlsSEnter%20Subclass:="+URLEncode(FormatNumber([Subclass ID];"#####")) +
    "'Link/a"

    DB:3.18:Internal Error: The Value Of Parameter Id Is Invalid.(Error Inf) sm


    BTW, both my master and child reports are in my "Inbox", will that be an issue?

    - Nivas

  • RELEVANCY SCORE 3.18

    DB:3.18:Drive Not Accessable And Internal Error Occured.. 1c


    Is there a solution for this? I went into my explorer and when i clicked to open one of my two drives in the sc101 i got this error.

    Help Please

    Admin Dundee are you still there?

    :@)

    DB:3.18:Drive Not Accessable And Internal Error Occured.. 1c

    I have found that after the drive is unplugged for a period of time you have to re-power the drive and allow about two minutes for the drive to come up to speed, then re-boot your machine and after the machine boots all the way through, then wait an additional two minutes for the drive to attach to your net work and then look at the drive in My Computer and the name and total size should be there. It is probably best if you un-attach the drive before you power down and then power off the computer first, then power down the SC101. Then when re-booting power up the SC101 first waiting 2 minutes then power up the computer, then re-attach the drive.

    If you remember, some early USB devices required you to do this, other wise the operating system missed the drive registration upon bootup.

  • RELEVANCY SCORE 3.18

    DB:3.18:An Internal Error Occured. Please Contact Our Support Team Help 9f


    Every time I turn on my Windows 7 Dell Inspiron 1545, an error message says "An internal error occured. Please contact our support team." One thing I noticed, after this message started appearing, my internal microphone stopped working.
    The webcam microphone doesnt work and neither does the Windows Speach Recognition. Please help

    DB:3.18:An Internal Error Occured. Please Contact Our Support Team Help 9f

    Hi Tucker Williams,

    Glad to be of help.

    Regards
    Varun J: MICROSOFT SUPPORT

    If this post helps to resolve your issue, please click the "Mark as Answer" or "Helpful" button at the top of this message. By marking a post as Answered, or Helpful you help others find the answer faster.

  • RELEVANCY SCORE 3.18

    DB:3.18:Directx Problems 8m


    Hello,
    When I try to install the new version of directx, i get an error message
    DIRECTX SETUP
    An internal system error occured. Please refer to DXErrow.log and DirectX.log in your Windows folder to dertimine the problem.

    PLEASE HELP!

    DB:3.18:Directx Problems 8m

    Hi whiskers12,
    What is the version of Direct X you are trying to install?
    Dirext X 11 comes by default with Windows 7.
    You don’t have to install any version of Direct X as that is the latest version available.
    Regards,
    Manasa P – Microsoft Support.

  • RELEVANCY SCORE 3.17

    DB:3.17:Me 6.1 -Manufacturing Url Error 9a



    Hi Experts,

    We have deployed ME 6.1 and their SP04 components on a system .Below error occurred for /manufacturing URL.

    "An internal error occured , contact technical support"

    but the /manufacuring-admin URL is opening correctly.

    Please let me what could be the issue.

    will appreciate you guide and help

    Note : SAPMECORE

    SAPMECTC

    SAPMEINT

    SAPMEINTCTC

    Above is the components list

    Thanks in advance

    DB:3.17:Me 6.1 -Manufacturing Url Error 9a


    So, it was re-start indeed And the Guide appears to be right again.

    Please close this thread then.

  • RELEVANCY SCORE 3.17

    DB:3.17:An Internal Error Has Occured In The Microsoft Extensions When Downloading Opening Saving Files 8c


    I've been getting an error when i try to download/open/save files ' an internal error has occured in the microsoft extensions' ive searched online about it, nothing seems to help. This is the only issue i have with my pc. can anyone help me??? this started
    happening maybe a month ago.

    i download alot of things from otonomai.net and they have changed to a new server. Would this have anything to do with it? i havent isolated it down to just this website or not. I dont download much outside of this website.

    DB:3.17:An Internal Error Has Occured In The Microsoft Extensions When Downloading Opening Saving Files 8c

    Hi,

    1. Which web browser do you use to download files?

    I wouldn't exactly know if otonomai's changed server is cause of the issue. However, you could test the issue by putting your computer in a
    clean boot state to isolate any third party program causing the issue.

    Note: Follow step 7 to restart your computer as usual.

    Also see:
    http://answers.microsoft.com/en-us/windows/forum/windows_vista-windows_programs/cant-download-my-songs-from-rhapsody/4eeb02ea-c05d-4720-bcd1-27b5b11aa49a

  • RELEVANCY SCORE 3.17

    DB:3.17:Mqjms1016: An Internal Error Has Occurred 1c


    Hi,

    I am trying to send a message from my system to a remote system through IBM MQ.But i am facing a problem after the sending the message from my system. The message is not getting posted on the Queue and I am getting the exception as follows.

    PaymentMessageSender.sendToMq:: - Starting MLS MQ'
    2009-05-20 06:40:00,118 blow1b01.unix.co.uk [QuartzScheduler_Worker-11-1331660005] ERROR EVNT.com.bfom.framework.BfomLogHelper BFOM Some jms error occured while sending message in - MQJMS1016: an internal error has occurred. Please contact your system administrator. Detail: java.lang.NullPointerException'
    2009-05-20 06:40:00,119 blow1b01.unix.co.uk [QuartzScheduler_Worker-11-1331660005]

    I have gone through IBM sites to get more info on that error code(MQJMS1016). But did not find it useful enough.

    Can somebody help me ??

    DB:3.17:Mqjms1016: An Internal Error Has Occurred 1c

    Clarify the below:

    Are you sending it through code(JAVA)?
    Is the message a JMS message or a MQ Message?
    If you are sending to a remote m/c then ensure that you have installed mq client on your local m/c. Have you set the various environment variables before calling send?

  • RELEVANCY SCORE 3.16

    DB:3.16:Pi 7.11 Esb Issue cz



    Hi all,

    I have a got a problem with opening Enterprise Services Builder, I'm able to Open ESB of PI Development system and got a problem with PI Quality system. I don't think this is the problem with Java.

    I'm getting the below error after i entered User name and Password of ESB

    Could not Initialize class com.sap.aii.ibrep.gui.xiitem.InternalXiItemServiceForTypeObjects

    Internal problem occured(INTERNAL_PROBLEM)

    Please help me in resolving this issue.

    Thanks,

    Kishore

    DB:3.16:Pi 7.11 Esb Issue cz


    Hi,

    We solved the same issue by upgrading JDK to 1.6 and starting and resissued the certificate from NWA,.

    Restarted the Instance... and ESB able to launch...

    Thanks,

    Subhash.G

  • RELEVANCY SCORE 3.15

    DB:3.15:Very Urgent Hrrcf_Start_Int Service --Internal Error d9



    Hi all,

    I am having a problem in hrrcf_start_int service. If i test the service its showing an internal error occured. Please suggest me to overcome from this.

    Regards

    Vijay

    DB:3.15:Very Urgent Hrrcf_Start_Int Service --Internal Error d9


    Hi Vijay,

    I think HRRCF_START is not executable alone, because somehow called internally from other services.

    The default.htm seams to be SAP standard, if there is not other start page defined as "inital BSP" in the BSP application properties.

    So, if you start HRRCF_START_INT, it should normally work.

    When I open HRRCF_START_INT via http://SERVER:PORT/sap/bc/bsp/sap/hrrcf_start_int/, the system requests a user and password.

    Another idea is to check your customizing for SAP eRecruiting.

    Open SPRO and navigate to SAP E-Recruiting.

    Under Technical Settings - User Interface you can customize your start pages, which is necessary for HRRCF_START_*.

    In the SPRO you may also find some guideline for eRecruitment implementation. Or just have a look [service.sap.com|http://service.sap.com] and search for eRecruitment HRRCF_START or something like this. There may be some hints for all steps you have to do, before SAP eRecruiting runs properly.

    Regards

    Tobias

  • RELEVANCY SCORE 3.15

    DB:3.15:500 Internal Error fz



    Hi,

    I am new to XI.

    i got installed XI demo version system. after logging into system and i press sxmb_ifr then i am getting the error like " b 500 internal sever error .excetion sap j2ee engine/7 .an internal; error occured .Java.lang.Exception initialize error/b

    please suggest ..

    regards

    Surendra

    DB:3.15:500 Internal Error fz


    Hi ,

    Thanks for your answer...

    This error occures becoz problem in Date setting.

  • RELEVANCY SCORE 3.13

    DB:3.13:Internal Error (-1003) Occured 98



    Internal Error (-1003) occured in choose from list.

    Edited by: Renga nathan on Jun 14, 2008 1:01 PM

    DB:3.13:Internal Error (-1003) Occured 98


    Hi Renga

    Do you bound this CFL to a UDO?

    We have met a similar error when bounding the CFL to

    UDO,and the tablename of the UDT in the UDO was very long,

    internal error -1003 happenes.

    It could be solved by changing to a UDT with shorter tablename.

    Regards,

    Syn Qin

    SAP Business One Forums Team

  • RELEVANCY SCORE 3.10

    DB:3.10:System Error Has Occured z9


    Hi
    Can you tell me why I keep getting this error message???? I have contacted Taleo and have not gotten a response.........A system error has occurred.

    Please exit the application and open a new session. Please contact your internal company help desk if your company has one. Otherwise, for any problem with the Taleo application, please log an incident through Web Support. In your incident, please describe
    the problem in detail (circumstances and actions leading up to the error). If you do not have access to Web Support, please contact your Taleo system administrator.

    *** Email address is removed for privacy *** (20100605131027673)

    K

    DB:3.10:System Error Has Occured z9

    Hi
    Can you tell me why I keep getting this error message???? I have contacted Taleo and have not gotten a response.........A system error has occurred.

    Please exit the application and open a new session. Please contact your internal company help desk if your company has one. Otherwise, for any problem with the Taleo application, please log an incident through Web Support. In your incident, please describe
    the problem in detail (circumstances and actions leading up to the error). If you do not have access to Web Support, please contact your Taleo system administrator.

    *** Email address is removed for privacy *** (20100605131027673)

    K

  • RELEVANCY SCORE 3.09

    DB:3.09:Automatic Internal Order Creation Problem For Claim dd



    Hi

    I have activated the badi for claim creation but at time of automatic creation of internal order for the claim, system is giving an error 'Error occured during creation of settlement rule'

    I have provided the strategy and settlement profile to the order type CL01. But still error is there.

    Any help will be highly appreciated.

    Regards

    Raman

    DB:3.09:Automatic Internal Order Creation Problem For Claim dd


    No need to define strategy of settlement rule to claim. You assigned WBSE in claim and cost of claim will flow to WBSE. In WBSE settlement rule is required to maintained.

    Also maintain in OPSV categary for claim CL01 and flag the both check boxes to reflect cost of claim in WBSE.

    Sudhir

  • RELEVANCY SCORE 3.08

    DB:3.08:"General System Error Occured" On Server 2.0 Beta 2 31



    After restarting the host PC (Server 2003R2) i get the message "general system error occured: unknown error" immediately after starting virtual machine.

    Can someone help please.

  • RELEVANCY SCORE 3.06

    DB:3.06:Internal Error (80410a0b) Help:( xm


    Ok i'm trying to start my internet connection on my PSP and when I start a scan for a new connection it says

    Internal Error Has Occured.
    (80410A0B)

    Can any one help me please?

    DB:3.06:Internal Error (80410a0b) Help:( xm

    how do u upgrde your firmware

    Best way is through a Network Update, if you're connected wirelessly.

    If not, download the latest update from here. Have a careful read through the instructions before and during the update.

  • RELEVANCY SCORE 3.05

    DB:3.05:Problem On Importing Grpo On New Database x7



    Hi All,

    I'm having problem on importing my GRPO data on new database and this error I encountered.

    [OPDN.Series] ,'Internal Error (-2038) occured' Application-define or Object-define error oPurchaseDeliveryNotes.

    Please help, Thanks...

    DB:3.05:Problem On Importing Grpo On New Database x7


    Anton Matamis

    There should be no values in DocEntry Column.

    Jeyakanthan

  • RELEVANCY SCORE 3.05

    DB:3.05:Internal Problem cm


    hello, I bought facetime for my mac and it can not open, everytime shows: an internal facetime error occured , there is a problem with facetime you need to quit and reopen again, so, I can not use it...please help

    DB:3.05:Internal Problem cm

    hello, I bought facetime for my mac and it can not open, everytime shows: an internal facetime error occured , there is a problem with facetime you need to quit and reopen again, so, I can not use it...please help

  • RELEVANCY SCORE 3.05

    DB:3.05:Warehouse Management Issue xf



    hi

    in the return delivery(customer return) when I creating transfer order(LT03 with refference to return delivery number) system throwing error message as" internal error has occured(L03T 0154 H)"

    can you please help any one

    Regards

    VUN

    DB:3.05:Warehouse Management Issue xf


    Hi,

    Go to 'Picking' tab in delivery. Is warehouse number determined there? If not then the movement type was not determined. To correct that, you need to set up the Item category and schedule line item category properly. We got a similar issue and was able to resolve it by doing the same.

    Thanks

    Vinod.

  • RELEVANCY SCORE 3.04

    DB:3.04:Office Home And Student 2010 Stops Installation Because It Encountered An Error During Set Up df


    My microsoft office home and student 2010 stops installation because it encountered an error during set up. An internal error has occured. Please help me what to do.

    DB:3.04:Office Home And Student 2010 Stops Installation Because It Encountered An Error During Set Up df

    Do you have an error code or error number?

    If it's 2203, see this:
    http://support.microsoft.com/kb/2000547

  • RELEVANCY SCORE 3.04

    DB:3.04:Urgent Help Migrating Acess97 To Oracle 8i(Personal)!!! ap


    The message I am getting is as follows:

    A serious internal error has occured during migration process and the number is 440. I have created a simple Access database with only two tables and didn't get any error at all.

    Please help me about this problem.

    DB:3.04:Urgent Help Migrating Acess97 To Oracle 8i(Personal)!!! ap

    The message I am getting is as follows:

    A serious internal error has occured during migration process and the number is 440. I have created a simple Access database with only two tables and didn't get any error at all.

    Please help me about this problem.

  • RELEVANCY SCORE 3.03

    DB:3.03:Error Occured While Calling The 'Processdpcommands' Api.(Err:Wis30270) 91



    Hi All,

    When i am refreshing the webI report in WebI rich client application.

    It is popping up the error message :

    An internal error occured while calling the 'processDPCommands' API.(Error: WIS 30270)

    Please help me to fix the problem.

    Any help greatly appreciated...

    Thanks in advance

    Mahesh ch

    DB:3.03:Error Occured While Calling The 'Processdpcommands' Api.(Err:Wis30270) 91


    Hi Mahesh,

    thanks for the effort however that very KB article is for Excek connectivity and we don't know what the reporting DB is.

    Without the information that Henry asked it is like shooting in the dark

    Thanks!

    Simone

  • RELEVANCY SCORE 3.03

    DB:3.03:Internal Error Occured While Calling 'Processdpcommandsex' Api. 33



    Hi experts,

    We had upgarded our BI content version to 737 SP level 0009 few days back. After the content update there is error in opening webi report. It is showing "An internal error occured while calling 'processDPCommandsEx' API. (Error: ERR_WIS_30720) (WIS_30720)." Please help me to resolve this error.

    Regards,

    Rathish

    DB:3.03:Internal Error Occured While Calling 'Processdpcommandsex' Api. 33


    The issue is resolved with SAP NOTE 1890238.

    As per the note we restarted the WebI services and Adaptive processing server from the CMC and then we were able to execute WebI report.

    Regards,

    Rathish

  • RELEVANCY SCORE 3.03

    DB:3.03:An Unspecified Error Occured During System Restore 0x800700b7 kp


    Hi,
    Am facing some startup problem with my Dell Studio laptop, When Start it is showing the message
    "Windows is Preparing to Configure Don't Turn Off Your System" and this message am getting continuously with some auto restarts in middle.
    When i choose system restore option, finally am getting the following error
    "Anunspecified error occured during system restore 0x800700b7"
    Please help me if there is any solution, currently i dont have OS CD with me.

    DB:3.03:An Unspecified Error Occured During System Restore 0x800700b7 kp

    This is exactly what is happening to me.
    This morning there was a forced system reboot (I think due to Windows update).
    After that system does above. No restore points help.
    Anyone has a fix for above?
    Thank you,

  • RELEVANCY SCORE 3.03

    DB:3.03:Discoverer Error zx


    Hi i get the following error while connecting to discoverer.How can i solve this .please help

    A POPUP WINDOW APPEARS AND DISPLAYS THIS MESSAGE

    oracle BI DISCOVERER
    ============

    an internal error occured while trying to perform the current operation.this could happen due to network errors or memory problems.if this persists
    contact your discoverer administaror

    Regards
    Aram

    DB:3.03:Discoverer Error zx

    firstly you need to check your application.log file for more details about the error

  • RELEVANCY SCORE 3.03

    DB:3.03:Problems Updating Directx pj


    Hey, whenever i try to update my DirectX i get an error message that says "An internal system error has occured, please refer to ectect..." Anyway it reffers me to a log file which i cant seem to find.

    without this most recent update i cant play any of my games on steam and it's reallly giving me a headache. can anyone help me out

    using windows vista service pack 1

    DB:3.03:Problems Updating Directx pj

    Hi,
    How are you trying to update directx?
    This might happen due to conlfict with the display adapter drivers. Try reloading the display adapter drivers.
    Click on StartRight click on computerManageDevice managerExpand display adapterRight click on the option mentioned belowClick on uninstallNow go to your computer/display card manufacturer website, download the updated drivers and install them.
    Since directx is an integral part of Windows operating system try running SFC scan and see if there is any file corruption.

    To do this, follow these steps:
    Steps to perform SFC scan
    1. Click the Start button
    2. From the Start Menu, Click All programs followed by Accessories
    3. In the Accessories menu, Right Click on the Command Prompt option
    4. From the drop down menu that appears, Click on the 'Run as administrator' option
    5. If you have the User Account Control (UAC) enabled you will be asked for authorization prior to the command prompt opening. You may simply need to press the Continue button if you are the administrator or insert the administrator password etc.
    6. In the Command prompt window, type: sfc /scannow and then press Enter
    7. A message will appear stating that 'the system scan will begin'
    8. Be patient because the scan may take some time
    9. If any files need any replacement SFC will replace them. You may be asked to insert your Vista DVD for this process to continue
    10. If everything is okay you should, after the scan, see the following message "Windows resource protection did not find any integrity violations"
    11. After the scan has completed, Close the command prompt window restart the computer and check.
    Refer the link below for more information.
    http://support.microsoft.com/kb/936212

    Regards
    Sreekanth.

  • RELEVANCY SCORE 3.02

    DB:3.02:Internal Number Range x8



    Hi,

    I tried creating a sales order and an error message "please specify an internal number range" occured.

    Help please.

    Maureen

  • RELEVANCY SCORE 3.02

    DB:3.02:Error "Problem Occured Locking Ws Object" While Activating Proxy cf



    Hi All,

    I have move an Inbout proxy to a different Client(QA system) and in QA system that proxy shows incative.

    When i tried to activate that proxy/service in Sproxy, getting error "Problem occured locking WS object".

    Proxy was active in development system and was working fine without any error.

    Please provide some help, what need to be done to fix this issue

    Thanks

    Harshit

    DB:3.02:Error "Problem Occured Locking Ws Object" While Activating Proxy cf


    Hi Harshit,

    Try with the following steps in sequence:

    1. Re-genarate the proxy in Development - Create a New Transport Reuest.

    2. Transport the Proxy from PI Dev to PI OA

    3. Confirm the Proxy in PI QA and then, transport the re-generated Request from ECC Dev to ECC QA.

    Regards,

    Pranav.

  • RELEVANCY SCORE 3.02

    DB:3.02:Cannot Add Any Host To Vcenter 9s



    general system error occured failed to start vpxa cannot contact vcenter web client esxi host "how to fix please help" using all 5.5 versions

    DB:3.02:Cannot Add Any Host To Vcenter 9s


    Just one clarification needed:

    whether both ESXi host vCenter having same version i.e 5.5?

  • RELEVANCY SCORE 3.02

    DB:3.02:Please Help - Issue Adding Disk k9



    I have a VM that is running fine, but when I try to add a 2nd Hard Disk I get "General system error occured: Internal error".

    I initially was having this same error when even trying to power it up, but I unconfigured HA DRS and then reconfigured and it was fine.

    Any ideas on why I can't add a 2nd disk? I have plenty to add and can do this for any other VM with no issue.

    Thank you in advance for your assistance.

    DB:3.02:Please Help - Issue Adding Disk k9


    check the filename of the primary disk on that system and then I would also explore vmfs volume where your VM is stored to make sure there is not another disk file already present in the same directory.

    You could also say add existing disk file and see if it shows multiple disk files in that VM's directories. Maybe a failure to add previously created the disk file, but never added it.

  • RELEVANCY SCORE 3.02

    DB:3.02:Mssqlserverolapservice Crashing Frequently xc



    System: Sql-server 2005 (x64) SP1 , Windows 2003 Server (x64)
    SSAS seems to crash now and then and application log fills with :
    The description for Event ID ( 22 ) in Source ( MSSQLServerOLAPService ) cannot be found. The local computer may not have the necessary registry information or message DLL files to display messages from a remote computer. You may be able to use the /AUXSOURCE= flag to retrieve this description; see Help and Support for details. The following information is part of the event: Internal error: An unexpected exception occured. Internal error: An unexpected exception occured. Internal error: An unexpected exception occured. Internal error: An unexpected exception occured..
    and...
    The description for Event ID ( 22 ) in Source ( MSSQLServerOLAPService ) cannot be found. The local computer may not have the necessary registry information or message DLL files to display messages from a remote computer. You may be able to use the /AUXSOURCE= flag to retrieve this description; see Help and Support for details. The following information is part of the event: Internal error: An unexpected exception occured. Internal error: An unexpected exception occured. Internal error: An unexpected exception occured. Internal error: An unexpected exception occured. Internal error: An unexpected exception occured. Internal error: An unexpected exception occured. Internal error: An unexpected exception occured. Internal error: An unexpected exception occured. Internal error: An unexpected exception occured. Internal error: An unexpected exception occured. Internal error: An unexpected exception occured. Internal error: An unexpected exception occured. Internal error: An unexpected exception occured. Internal error: An unexpected exception occured. Internal error: An unexpected exception occured. Internal error: An unexpected exception occured. Internal error: An unexpected exception occured. Internal error: An unexpected exception occured. Internal error: An unexpected exception occured. Internal error: An unexpected exception occured. Internal error: An unexpected exception occured. Internal error: An unexpected exception occured..
    etc.
    System log at just before: (event id 7034)
    The SQL Server Analysis Services (MSSQLSERVER) service terminated unexpectedly. It has done this 2 time(s).
     
     

    DB:3.02:Mssqlserverolapservice Crashing Frequently xc


    Efi:
    What is DSV?
    Thanks a lot.

    Data Source View:
    http://technet.microsoft.com/en-us/library/ms174600.aspx

  • RELEVANCY SCORE 3.01

    DB:3.01:Error "Problem Occured Locking Ws Object" While Activating Proxy ms



    Hi All,

    I have move an Inbout proxy to a different Client(QA system) and in QA system that proxy shows incative.

    When i tried to activate that proxy/service in Sproxy, getting error "Problem occured locking WS object".

    Proxy was active in development system and was working fine without any error.

    Please provide some help, what need to be done to fix this issue

    Thanks

    Harshit

    DB:3.01:Error "Problem Occured Locking Ws Object" While Activating Proxy ms


    Hi All,

    I have move an Inbout proxy to a different Client(QA system) and in QA system that proxy shows incative.

    When i tried to activate that proxy/service in Sproxy, getting error "Problem occured locking WS object".

    Proxy was active in development system and was working fine without any error.

    Please provide some help, what need to be done to fix this issue

    Thanks

    Harshit

  • RELEVANCY SCORE 3.01

    DB:3.01:An Internal Error Occured While Installing The Service Pack. Error Code0x800703ee sz


    ORIGINAL TITLE:
    help updating windows to SP1. please help

    i keep trying to install the new updates but i keep getting error's 643 and 3EE how can i fix this?? i tried to download the SP1 file from another link and i got this message as well "an internal error occured while installing the service pack. error code:0x800703ee".
    any help would be great thank you

    DB:3.01:An Internal Error Occured While Installing The Service Pack. Error Code0x800703ee sz

    Note: Support for Vista Gold (no Service Packs) ended on Tuesday, 13 April
    2010 and support for Vista Service Pack 1 (SP1) ended on Tuesday, 12 July
    2011. Computers still running Vista Gold "will no longer receive software updates [i.e., updates released on after 22 April 2010 so now the computer's missing more than two years' of critical security updates! ] from Windows Update" until
    SP1 SP2 have been installed (which will require that several Prerequisite Updates for each Service Pack be installed first). See

    http://windowsteamblog.com/blogs/windowsvista/archive/2010/04/13/end-of-support-for-windows-vista-with-no-services-packs.aspx.
    Chances are you're seeing the effects of a longstanding hijackware infection, most likely compounded by a rootkit (or bootkit) infection! See...
    • Cleaning a Compromised System

    http://technet.microsoft.com/en-us/library/cc700813.aspx
    Then see the (my) ANSWER post in this thread and follow those instructions (to-the-letter and
    in order! ) to return your computer to a secure functional state:
    http://answers.microsoft.com/thread/c44429fb-3f7c-4646-8529-5a97bb3cd0eb
    Note: The computer should NOT be connected to the internet or any local networks (i.e., other computers) in its current state. All of your personal data (e.g., online banking credit-card passwords) should be considered at-risk, if not already compromised.
    Wish I'd had better news for you. Good luck!

  • RELEVANCY SCORE 3.01

    DB:3.01:I Have An Error That Says An Error Has Occured In The Program During Initialization 0x80040154 ak


    Please tell me exactly what to do. I have been given links that do not work at all. Also, with this error, I cannot restore my system and cannot uninstall Microsoft Security Essentials.

    Please help

    Thanks

    DB:3.01:I Have An Error That Says An Error Has Occured In The Program During Initialization 0x80040154 ak

    Hello

    Please check this article which dicsuss a similar issue.

    http://answers.microsoft.com/en-us/protect/forum/mse-protect_start/i-get-a-microsoft-security-client-error-starting/0daf28a5-406b-4b7f-ae08-7b33b96b6299?msgId=4ad1bb59-fe13-4296-981b-73600832f9f7

  • RELEVANCY SCORE 3.00

    DB:3.00:Internal Error(-223) Message Occured(131-183) 11



    Dear Expert,

    I am using SAP B1 9.0 Pl07 and MS SQL 2012 and Window Server 2012.Whenever I want to create new company in the database I am getting this error "Internal error(-223) Message Occured(131-183)".

    Please help to resolve the issue.

    Regards,

    PankajK

    IDM Services Ltd.

    DB:3.00:Internal Error(-223) Message Occured(131-183) 11


    Hi,

    Create from SQL server through B1 client.

    Thanks Regards,

    Nagarajan

  • RELEVANCY SCORE 3.00

    DB:3.00:Help Required : Error In Bsp (Hrrcf_Cand_Reg) For E-Recruiting pj



    Hi All,

    I needed help on BSP. I am getting an error ["Internal Error" - An internal error occured please try again later.] I have done a lot of debugging on this. This error occurs when i am using the BSP Application (hrrcf_cand_reg) which is used for registeration of an external candidate in E-Recruiting 3.0. I am also checking the error in Display Logs. It states the following bThe system detects a technical inconsistency/b.An attempt was made to start the E-Recruiting application with a user that is not assigned a candidate or an employee. But in this case the new person is getting added in my SAP Db as well. So i am wondering what the error could be? Please help and advice at the earliest.

    DB:3.00:Help Required : Error In Bsp (Hrrcf_Cand_Reg) For E-Recruiting pj


    HI Samir,

    I am getting the similar problem.Will you pl let me know how you have solved this issue.You may pl send the info rnandam@gmail.com

    Thanks

    Uday

  • RELEVANCY SCORE 3.00

    DB:3.00:Ts3694 Itunes System Restore Error -1 9z


    while trying to restore from recovery mode sudden 'unknown error occured (-1)' Since then, the iphone 4s is stucked in recovery mode and cannot return back. please help

    DB:3.00:Ts3694 Itunes System Restore Error -1 9z

    while trying to restore from recovery mode sudden 'unknown error occured (-1)' Since then, the iphone 4s is stucked in recovery mode and cannot return back. please help

  • RELEVANCY SCORE 3.00

    DB:3.00:Adobe Reader X (10.1.3) - An Internal Error Occured. d3



    Dear fellow Adobe Reader users,

    could one of you please help me making my Adobe Reader X run again?

    Whenever I try to open it, it gives me the message "An internal error occured." and closes.

    Things I already tried:
    Re-installing it (Normal, with CCleaner, with RevoUninstaller, Microsoft FixIt)Repairing it from the windows program menu.Tried the direct download (52MB)Disabling the antivirus software for the installation process.

    Information about my system:
    Windows 7 x64.Software version Adobe Reader X (10.1.3).My user belongs to the Administrator group.

    I would be glad if someone could help me out. If any further information is necessary, please feel free to ask for it.

    Best regards,

    Philipp

    DB:3.00:Adobe Reader X (10.1.3) - An Internal Error Occured. d3


    As already two days passed I guess I would reply again, to figure out, whether just nowbody knows a solution to this, or it just got buried.

    AKA Bump

  • RELEVANCY SCORE 3.00

    DB:3.00:A General System Error Occured: Internal Error kk



    I am getting the following error when I power on my VMs.

    "a general system error occured: Internal error".

    My system is installed with ESX 3.5 and VMs with Windows 2003 EE. This pops up when I click on the Poweron button of each VMs. Any idea on what could be the problem?

    Thanks!

    DB:3.00:A General System Error Occured: Internal Error kk

    is the 12 August licensing date BUG:

    http://kb.vmware.com/selfservice/microsites/search.do?language=en_UScmd=displayKCexternalId=1006716

    weird problem!

  • RELEVANCY SCORE 2.99

    DB:2.99:Net Start W32tm System Error 5 Has Occured. Access Is Denied z3


    Please help me solve this problem, I keep disconnecting from a pvp.net server and it's cramping my game style..
    Thank you !

    DB:2.99:Net Start W32tm System Error 5 Has Occured. Access Is Denied z3

    Hi,
    1. What exactly are you trying to do?
    2. Do you have any issue with time setting?
    Method 1:
    Some commands that you can run using Command Prompt might require elevated or administrative privileges. To run these commands, you can use the Run as administrator command:
    Click the Start button.
    In the Search box, type command prompt.
    In the list of results, right-click Command Prompt, and then click Run as administrator. If you are prompted for an administrator password or confirmation, type the password or provide confirmation.
    Method 2:
    If you are facing any issue with time and synchronize system clock with the time server, run the fixit tool and check.
    Fix broken desktop shortcuts and common system maintenance tasks

    http://support.microsoft.com/mats/system_maintenance_for_windows/en-us

  • RELEVANCY SCORE 2.99

    DB:2.99:Installing Ms Vista Rc1 On Esx 3.0 81



    I got the ISO install but Everytime I try to install VMTools I get this error,

    " A general system error occured: Internal error". Also I can find a NIC driver for my Dell 1850 "Intel Gigabit Ehternet Control 8254xxx" "e1000 driver". Has anyone encountered this. Help!!!

    Thanks in advance.

    DB:2.99:Installing Ms Vista Rc1 On Esx 3.0 81


    Thanks this worked great.

    Worked for me also. Now I'm trying to deploy Vista on VM via WDS...

  • RELEVANCY SCORE 2.99

    DB:2.99:Vcenter Server Client On Windows Server 2008 Problems. as



    Hi, I am Archana. My laptop has AMD turion 64*2 dual core mobile technology processor. I have installed Vcenter server client 4.1 on windows server 2008. Other system has vmware ESXi 4.0 installed which has Intel processor. Whenver I try to add the host to datacenter, its giving following error.

    A general system error has occured: Internal error: vmodl.fault.HostCommunication.

    And

    Authenticity of Host ssl certificate is not verified.

    Please help.

    DB:2.99:Vcenter Server Client On Windows Server 2008 Problems. as


    Hi, I am Archana. My laptop has AMD turion 64*2 dual core mobile technology processor. I have installed Vcenter server client 4.1 on windows server 2008. Other system has vmware ESXi 4.0 installed which has Intel processor. Whenver I try to add the host to datacenter, its giving following error.

    A general system error has occured: Internal error: vmodl.fault.HostCommunication.

    And

    Authenticity of Host ssl certificate is not verified.

    Please help.

  • RELEVANCY SCORE 2.99

    DB:2.99:Id Hu/Wm Managed Storage Location 7m



    Hi all,

    when doing a goods receipt into an HU-managed storage location which is also Warehouse-managed, I need to create a transfer order for putaway before I can post the stock into the Warehouse. During this step, the system comes up with an error message:"Internal error has occured (SU does not have any quants)". I suspect there is some configuration missing.

    I did change my HU-Number Range assignment before my post from SSCC to internal number range for my package. With my SSCC-No it works.

    Can anybody please help? What am I missing?

    Thank You.

    Regards

    Danny

    DB:2.99:Id Hu/Wm Managed Storage Location 7m


    Hi Krishna,

    you may want to check the following notes:

    1635368 - Error L3224 in transaction LT09

    607226 - Analysis report RLTREORG2

    Kind regards,

    Katalin

  • RELEVANCY SCORE 2.98

    DB:2.98:Abnormal Program Termination sk


    When i try to install oracle 10g enterprise edition, its throwing error.

    OS:windows 7 enterprise edition.

    Abnormal program termination.An internal error has occured. Please provide the following files to Oracle Support.

    "unknown"
    "unknown"
    "unknown"

    I tried using the setup.exe and oui.exe files

    please help.

    DB:2.98:Abnormal Program Termination sk

    Dear user13364377,

    Oracle Database 10g EE is not supported and certified on Windows 7 (any edition) and will not be supported or certified.

    You may want to select the 11gR2 instead. I think possibly that is why you have had that error.

    Hope That Helps.

    Ogan

  • RELEVANCY SCORE 2.98

    DB:2.98:Need Help Regarding Internal Server Error Occured 500 j8


    Hi,
    We have integrated HV with our web application but for last 3 days we are getting Error when we do import from Health Vault. Error is
    Internal Server Error Occured 500.
    But some times it runs without any error. Please do let us know how can solve this issue. and any idea about RetryOnInternal500Count Property? How can weuse this property.

    DB:2.98:Need Help Regarding Internal Server Error Occured 500 j8

    Thanks Madan,
    Issue is resolved from my side also. Thanks for updating me.
    Regards
    Keshav

  • RELEVANCY SCORE 2.98

    DB:2.98:Internal Error (-8020) Occured Addon Not Running xd



    Hello All,

    I am facing a serious problem in my system whenever i run the addons or even while running the code in sap system is throwing an error mesage "Internal error (-8020)

    occurred " and its not running the addons nor while running through code its not running.

    I have deleted the SM_OBS_DLL folder from temp directory still no use.

    Please suggest what to do.

    Thanks Regards,

    Amit

    DB:2.98:Internal Error (-8020) Occured Addon Not Running xd


    Hello Slater,

    Your Solution worked .

    I have reinstalled the client and after that all addons are running properly.

    Thanks Regards,

    Amit

  • RELEVANCY SCORE 2.98

    DB:2.98:Error While Building Flex 87


    hi ,
    I m getting an error while building flex application
    Error Description
    "An internal Build Error has occured" Right click for more
    information"
    In my flex application there are around 5000 line of code .
    i am binding 2000 Xml to the application

    this much line of code causing a error
    Please Help Me out
    ThanX

    DB:2.98:Error While Building Flex 87

    hi ,
    I m getting an error while building flex application
    Error Description
    "An internal Build Error has occured" Right click for more
    information"
    In my flex application there are around 5000 line of code .
    i am binding 2000 Xml to the application

    this much line of code causing a error
    Please Help Me out
    ThanX

  • RELEVANCY SCORE 2.97

    DB:2.97:Cannot Install Directx End-User Runtime Web Installer 3s


    Hi i built my new custom pc and i installed all the updates and it still says an internal system occured Please reffer to DXError.Log and DirectX.log in your windows folder to determine problem and this is a windows 7 64 bit Please Help!!!!!

    DB:2.97:Cannot Install Directx End-User Runtime Web Installer 3s

    I was getting the internal system error. Running it as administrator did the job. Thanks!

  • RELEVANCY SCORE 2.97

    DB:2.97:Error Message A Internal Systemproblem Occured, Please Look At Dxerror.Log And Directxlog To Find The Problem. 7f


    Original title: directX dos not work
    please help

    I have a directX problem
    i cant start games
    i tryed reinstaling
    but dossnt work

    first i get a message ALREDDY INSTALT
    after that he says is there a problem instal???
    i pres yes

    he says

    a internal systemproblem ocurt
    please look at DXError.log and DirectXlog to find the problem

    i cant find those files

    DB:2.97:Error Message A Internal Systemproblem Occured, Please Look At Dxerror.Log And Directxlog To Find The Problem. 7f

    Hi Thomas,

    Thank you for getting back.

    Since the issue persists, let’s try the following steps and check if it helps.
    You may try performing a clean boot and try to install the games.
    A clean boot helps to verify if any third party application services or startup item is causing this issue.

    You need to try the step 1 provided to install the games.
    How to perform a clean boot to troubleshoot a problem in Windows Vista, Windows 7, or Windows 8
    Note: Make sure you put the computer back to Normal Startup by following the Step 3 provided in the article once you are done with the troubleshooting.

    If it is happening only when you try to install the Steam games, you may get in touch with
    Steam support for further assistance.

    For any help related to Windows you may always post on the Microsoft Community Forum.

  • RELEVANCY SCORE 2.97

    DB:2.97:Internal Error 1d



    anytime i open the program it states that an internal error has occured.

    DB:2.97:Internal Error 1d


    Hi sparky127,

    Can you please let me know which Adobe application you are using?

    If you are experiencing this issue with Adobe Reader then please try uninstalling using Adobe's Cleaner Tool. The tool is available at the following link:-

    http://labs.adobe.com/downloads/acrobatcleaner.html

    then please re-install Adobe Reader using the full installer from the link mentioned below:

    http://get.adobe.com/reader/enterprise/

    In case you still experience the same issue, then please check if you can open Reader by itself (i.e. launch Adobe Reader and not open any PDF). If so, try if disabling Protected Mode works better. To disable Protected Mode, click on Edit -- Preferences -- Security (Enhanced).

  • RELEVANCY SCORE 2.97

    DB:2.97:Unable To Burn Disk A Internal Error Occured m7


    please help me solve my problem.

    DB:2.97:Unable To Burn Disk A Internal Error Occured m7

    Thank you. Will do!Michael Wasley wrote:To your list of brands we might add Taiyo Yuden which many people regard as the most reliable.I usually stick with Verbatim, but I have heard poor reports of their recent value "Life" series products.I'm partial to Maxell when it comes to dvds. My Macbook pro will take any cd I throw at it.

  • RELEVANCY SCORE 2.97

    DB:2.97:Dxwebsetup Installation Problem Error -An Internal System Error Occurred. Please Refer To Dxerror.Log And Directx.Log In Your Windows Folder To Determine Problem. a3



    Original title:dxwebsetup installation problem

    I keep on getting this message while installing dxwebsetup-
    An internal system error occured
    Please refer to DXerror.log and DirectX.log in your windows folder to determine problem.

    DB:2.97:Dxwebsetup Installation Problem Error -An Internal System Error Occurred. Please Refer To Dxerror.Log And Directx.Log In Your Windows Folder To Determine Problem. a3

    Tried this and I think I at least made progress. Instead of an internal error it just tells me that the file couldn't be downloaded and to check my network settings or to try again later. So I don't know.

  • RELEVANCY SCORE 2.97

    DB:2.97:Ht201263 I Tried All This&Nbsp; .. After Step 6 I Get The Pop Up : Unknown Error 1603 . Please Help f8


    I tried all this .. but it get stuck at" preparing iphone to restore" and after 5 min i get the popup :"unable to restore iphone. internal error occured (1603) .any suggestions?

    DB:2.97:Ht201263 I Tried All This&Nbsp; .. After Step 6 I Get The Pop Up : Unknown Error 1603 . Please Help f8

    Thanks amy_lou.I tried below steps as mentioned in link:1) stop and start apple mobile service .2)change administrator .not sure which one worked but got my phone restored succesful .

  • RELEVANCY SCORE 2.97

    DB:2.97:500 Internal Server Error-Sap Netweaver Application Server 7.00/Java, As 7. a7



    *500 Internal Server Error*

    *00 Failed to process request. Please contact your system administrator.*

    *rror! Hyperlink reference not valid.*

    *Error Summary*

    *While processing the current request, an exception occured which could not be handled by the application or the framework.*

    *If the information contained on this page doesn't help you to find and correct the cause of the problem, please contact your system administrator. To facilitate analysis of the problem, keep a copy of this error page. Hint: Most browsers allow to select all content, copy it and then paste it into an empty document (e.g. email or simple text file).*

    *Root Cause*

    *The initial exception that caused the request to fail, was:*

    *java.lang.NullPointerException*

    *at com.kpmg.oms.maincomp.OMSMainComp.populate_Global_Es_Header(OMSMainComp.java:1059)*

    *at com.kpmg.oms.maincomp.OMSMainComp.copyOutputToGlobal(OMSMainComp.java:1016)*

    *at com.kpmg.oms.maincomp.OMSMainComp.rereadAfterSave(OMSMainComp.java:6419)*

    *at com.kpmg.oms.maincomp.OMSMainComp.save(OMSMainComp.java:518)*

    *at com.kpmg.oms.maincomp.wdp.InternalOMSMainComp.save(InternalOMSMainComp.java:3271)*

    *... 31 more*

    DB:2.97:500 Internal Server Error-Sap Netweaver Application Server 7.00/Java, As 7. a7


    Thanks for the quick reply:

    Please note the complete error list:

    500 Internal Server Error

    SAP NetWeaver Application Server 7.00/Java AS 7.00

    Failed to process request. Please contact your system administrator.

    Error Summary

    While processing the current request, an exception occured which could not be handled by the application or the framework.

    If the information contained on this page doesn't help you to find and correct the cause of the problem, please contact your system administrator. To facilitate analysis of the problem, keep a copy of this error page. Hint: Most browsers allow to select all content, copy it and then paste it into an empty document (e.g. email or simple text file).

    Root Cause

    The initial exception that caused the request to fail, was:

    java.lang.NullPointerException

    at com.kpmg.oms.maincomp.OMSMainComp.populate_Global_Es_Header(OMSMainComp.java:1059)

    at com.kpmg.oms.maincomp.OMSMainComp.copyOutputToGlobal(OMSMainComp.java:1016)

    at com.kpmg.oms.maincomp.OMSMainComp.rereadAfterSave(OMSMainComp.java:6419)

    at com.kpmg.oms.maincomp.OMSMainComp.save(OMSMainComp.java:518)

    at com.kpmg.oms.maincomp.wdp.InternalOMSMainComp.save(InternalOMSMainComp.java:3271)

    ... 31 more

    Web Dynpro Runtime

    Vendor: SAP, build ID: 7.0018.20081114084639.0000 (release=NW04S_18_REL, buildtime=2008-11-22:17:53:00[UTC], changelist=52089, host=pwdfm114), build date: Fri Feb 20 14:12:56 EST 2009

    J2EE Engine

    7.00 PatchLevel 51441.450

    Java VM

    Java HotSpot(TM) 64-Bit Server VM, version:1.4.2_16-b05, vendor: Sun Microsystems Inc.

  • RELEVANCY SCORE 2.97

    DB:2.97:Error In Fixed Asset Transactions After Upgrade To R12 kz


    Hi Guys

    I am getting error in fixed asset trasaction after upgrading the system from 11.5.10 to 12.1.2.

    I am getting this error when I do trasactions like addtions, transfer, reclassification and all other asset trasactions.

    Following is the error I am getting. Please help me if anybody has any clue regarding this issue.

    " APP_OFA_48398: Program exited with errors

    ORA-20001: XLA-95103: An internal error occured. Please inform your system administrator or support rep:

    An internal error has occured in the program xla_events_pkg.cache_entity_info.

    ORA-28123: Driving context 'XLA, SECURITY_GROUP' contains i

    Error: functiona fa_xla_events_pvt.create_trx_event returned failure

    Error: functiona fa_cip_pvt_do_cap_rev returned failure

    Error: functiona fa_cip_pub.do_all_books returned failure

    Error: functiona fa_cip_pub.do_cap_rev returned failure

    Error: functiona fa_cip_pub.do_capitalisation returned failure"

    *** Block Transaction security Option in Sub ledger application from...

    Use security check box is unchecked and plicy function field is grayed out by default.

    Thanks
    Ajeesh

    DB:2.97:Error In Fixed Asset Transactions After Upgrade To R12 kz

    Hi Dirk

    I have run Validate Application Accounting Definition Validation Report for asset module and found out that all my Event classes are valid.

    I have already raised an SR. Not sure the reason for the above error.

    Thanks
    Ajeesh

  • RELEVANCY SCORE 2.97

    DB:2.97:Internal Error (-2010) Occured sz



    On updating in GRPO I m getting error "internal error (-2010) occur".

    DB:2.97:Internal Error (-2010) Occured sz


    Hi Manindra Kumar,

    Check the Following SAP Notes. I think it may helps you.

    1560694

    1450048

    1382876

    1331214

    1286534

    Regards

    Balaji

  • RELEVANCY SCORE 2.97

    DB:2.97:Ts3212 Error Occured During Installation jp


    - Everytime I try to download I get this message............."Error has occured during installation. Your system has not been modified." And I tried installing again but I get the same message......help please....

    DB:2.97:Ts3212 Error Occured During Installation jp

    - Everytime I try to download I get this message............."Error has occured during installation. Your system has not been modified." And I tried installing again but I get the same message......help please....

  • RELEVANCY SCORE 2.97

    DB:2.97:Wd 320 Gb Sata 93



    hello everybody...please help me to resolve my problem with my hardisk sata on my dell loptop..when i check to CHKDSK previous error occured and the message is ''hardisk manager I/O error Ox10090'' ...thanks







    Solved!
    Go to Solution.

    DB:2.97:Wd 320 Gb Sata 93


    please setup the Win Xp 32bit or Win7 32 bit

  • RELEVANCY SCORE 2.97

    DB:2.97:500 Internal System Error. m1



    Hi all,

    We have been upgraded our 4.6c ABAP system to ECC 6.0.Now we have configured ITS in this system.Integrated ITS 7.0.I have done all the activation in SICF.The webgui is working fine.

    I have created some services in sicf, but that services are not working.It is giving the following error.

    The URL https://xxxx.com:1003/sap/bc/gui/sap/its/servicename was not called due to an error.


    Note

    The following error text was processed in the system SID : System error

    The error occurred on the application server cisid_SID_10 and in the work process 0 .

    The termination type was: ABORT_MESSAGE_STATE

    The ABAP call stack was:

    SYSTEM-EXIT of program SAPLCATS_ITS

    I have checked this error in ST22.Then it is showing the CALL_FUNCTION_NOT_REMOTE not occured.

    I have configured SSL also for using HTTPS.

    Please help me out to solve this issue.

    Shemy.

    DB:2.97:500 Internal System Error. m1


    I have resolved the issue by using the note 790727.

  • RELEVANCY SCORE 2.97

    DB:2.97:Discoverer Error In Prod 8p


    Hi i get the following error while connecting to discoverer.How can i solve this .please help

    A POPUP WINDOW APPEARS AND DISPLAYS THIS MESSAGE

    oracle BI DISCOVERER
    ============

    an internal error occured while trying to perform the current operation.this could happen due to network errors or memory problems.if this persists
    contact your discoverer administaror

    Regards
    Aram

    DB:2.97:Discoverer Error In Prod 8p

    Aram,

    Please mention the application release and the discoverer version.

    Was this working before? Any changes have been done recently?

    Did you try to bounce the discoverer services and see if this help? If you still get the same error, please check the discoverer log file for details.

    Thanks,
    Hussein

  • RELEVANCY SCORE 2.97

    DB:2.97:Acrobat9: Exporting Selected Image. 7p



    Hi all,

    I need to export selected image.

    I have Written this code to export image.

    code :

    ASAtom ImageSelection = ASAtomFromString("Image");

    if(ImageSelection == AVDocGetSelectionType(avDoc))

    {

    void *data = AVDocGetSelection(avDoc);

    if(data != NULL)

    {

    PDXObject xObj = static_castPDXObject(AVDocGetSelection(avDoc));

    PDImageAttrsP attrsP;

    ASInt32 attrsLen;

    PDImageGetAttrs(xObject,attrsP, sizeof(PDImageAttr));

    }

    }

    but it gives error "An internal Error occured" ;

    please help.

  • RELEVANCY SCORE 2.97

    DB:2.97:An Unrecoverable Error Has Occured 1z



    For some reason,whenever i turn on my computer, i keep getting this box that says "An unrecoverable error has occured. The installation program cannot continue. Please contact your support seller/service provider. Press Enter to shutdown the system.
    Can someone please help me with this?

    DB:2.97:An Unrecoverable Error Has Occured 1z


    Follow these steps to attempt to fix your Startup problems.

    Restore Point:

    http://www.howtogeek.com/howto/windows-vista/using-windows-vista-system-restore/

    Do System Restore in Safe Mode, if unable to do it in Normal Mode.

    Try tapping F8 at startup, and from thelist of startup selections, select Safe Mode by using UP Arrow Key to go there thenhit Enter.

    Try a System Restore once there, to pick a Restore Pointbefore your problem..

    Click Start Programs Accessories System Tools System Restore pick a different time Next etc

    http://www.windowsvistauserguide.com/system_restore.htm

    Read the above for a verygood Graphicaldisplay of how to go back more than 5 days in System Restore Points by ticking the correct Box.

    ~~~~~~~~~~~~~~~~~~~~~~~~~~~~~~~~~~~~~~~~~~~~~~~~~~~~~~~~~~~~~~~

    If System Restore and/or Safe Mode does not work and you do not have a Microsoft Vista DVD, make a Bootable Repair Disk to do a Startup Repair:

    Download the ISO file at the supplied link, and make a Bootable Startup Repair Disk from it.

    Go into your Bios/Setup, or Boot Menu, at startup, and change the Boot Order to make the DVD/CD drive 1st in the Boot Order, then reboot with the disk in the Drive.

    At startup/power on you should see at the bottom of the screen either F2 or DELETE, to go into Bios/Setup, or F12 for the Boot Menu.

    When you have changed that, insert that Bootable Disk you have made in the Drive, and reboot.

    http://www.bleepingcomputer.com/tutorials/tutorial148.html

    Above link shows what the process looks like, and a how-to, as it loads to the Repair Options.

    Neosmart contains the contents of the Windows Vista DVD's "recovery center," as we've come to refer to it. It cannot be used to install or reinstall Windows Vista, and just serves as a Windows PE interface to recovering your PC. Technically, one could
    re-create this installation media with freely-downloadable media from Microsoft (namely the Microsoft WAIK kit, a multi-gigabyte download); but it's damn-decent of Microsoft to make this available to Windows' users who might not be capable of creating such
    a thing on their own.

    Read all info at the website about creating and using it:

    http://neosmart.net/blog/2008/windows-vista-recovery-disc-download/

    ISO Burner:http://www.snapfiles.com/get/active-isoburner.html

    It makes a very good Vista Startup Repair Disk.

    You can do a Startup Repair, System Restore, etc from it.

    It is NOT a reinstall disk.

    And the 32bit is what comes normally on a computer, unless 64bits requested.
    Cheers.

    Mick Murphy - Microsoft Partner

  • RELEVANCY SCORE 2.96

    DB:2.96:An Internal Error Occured? 17



    I cannot open Adobe Fireworks CS6, says An internal error occurred.

    DB:2.96:An Internal Error Occured? 17


    Well, you're in the Photoshop forum, and we don't deal with Fireworks here.

    Yo need to go the forums index page and find the right forum for your your application.

  • RELEVANCY SCORE 2.96

    DB:2.96:Internal Error Has Occured (Cybertan) jj



    This is the error I get, it's been happening for awhile, it just appears as soon as I load the program. I just restart the program over and over until it goes away.

    I upgraded to LR5 thinking it might fix things but it didn't.

    Please help!

  • RELEVANCY SCORE 2.95

    DB:2.95:I Am Experiencing "System Update Failed. An Error Occured Downloading Ios 6.1.3." I Am Using Wifi. Please Help Help Immediately Because I Can Not Download Any Type Of Files, Like Music, Games. Thank You. 7j


    I am experiencing "System Update Failed. An error occured downloading iOS 6.1.3." I am using wifi. Please help immediately because I can not download any type of files, like music, games. Thank you.

  • RELEVANCY SCORE 2.95

    DB:2.95:Internal Collection Error Has Occured While Analyzing Pintool In Virtual Machine 1j



    Hi,I'm trying to analyze a pintool using the latest Pin kit 37300 for VS 2010 on Windows XP SP3 (guest OS). The pintool is running inside a Parallels virtual machine on an Intel-based Mac (host OS).I start the pintool like I would to debug it:pin -pause_tool 10 -t obj-ia32\\mytool.dll -- lsThen I try to collect hotspots with VTune Amplifier XE by attaching to the process:C:\\Program Files\\Intelamplxe-cl --collect hotspots -knob accurate-cpu-time-detection=false -follow-child -mrte-mode=auto -target-duration-type=short -no-allow-multiple-runs -no-analyze-system -data-limit=100 -slow-frames-threshold=40 -fast-frames-threshold=100 -target-process=ls.exeError: Internal collection error has occured. Please contact the technical support.I am aware that hardware EBS is not supported in virtual machines, they are not needed to collect hotspots, right?Any help will be appreciated, thanks.

    DB:2.95:Internal Collection Error Has Occured While Analyzing Pintool In Virtual Machine 1j


    The problem is not running inside a VM, but in trying to analyze a Pin tool. The collector for the user-mode (non-EBS) analysis types is implemented using Pin.

    One solution is to use a physical machine and perform hardware-based sampling (like lightweight-hotspots) to analyze the Pin tool.

    Mark

  • RELEVANCY SCORE 2.95

    DB:2.95:Error While Processing Cube km


    Hi
    Am new to the SSAS and BI and learning things. am getting below errors while processing cube.
    Could you please help me out in fixing them..
    1. internal error - The operation terminated unsuccessfully
    2. Server - The operation has been cancelled
    3. Errors in Olap storage engine - an error occured while the 'MandatoryQuestion' attribute of the 'ABC' dimension from 'XYZ' databse was being processed.
    4. Internal error: the operation terminated unsuccessfully
    5. Internal error: the operation terminated unsuccessfully
    6. Errors in the olap storage engine: An error occured while dimension with ID of the 'Survey Q and R', name of 'AAA' being processed.
    7. Errors in the olap storage engine: An error occured while 'GGG' attribute of summary dimension of bbb datbase processed
    8. warning: a duplicate attributekey has been found when processing Table AAA, column BBB, Value : '' . Attribute is BBB
    Please help in fixing this.
    TIA.
    --BI

    DB:2.95:Error While Processing Cube km

    Hi
    After going through these errors i thought to fix warning first. After this error fix now my cube successfully got processed.
    so please never underestimate warnings :)
    Thanks,
    --BI

  • RELEVANCY SCORE 2.95

    DB:2.95:Rfc Error -Pls Help Me px



    Hi Experts

    I have done coding for connecting VB and SAP to create Sales Order.

    I am getting the error as

    An internal RFC-Error occured.

    Error-key : RFC_ERROR_SYSTEM_FAILURE

    Description : See RFC trace file or SAP system log for more details

    cpic-status : ??

    Internal State : ??

    and denotes the error line as

    Set boOrder = bapictrl.getSapobject("SalesOrder")

    What could be the reason, and how to correct.

    Pls help me.

    Thanks in advance.

    Regards

    Rajaram

    DB:2.95:Rfc Error -Pls Help Me px


    Hi Experts

    I have done coding for connecting VB and SAP to create Sales Order.

    I am getting the error as

    An internal RFC-Error occured.

    Error-key : RFC_ERROR_SYSTEM_FAILURE

    Description : See RFC trace file or SAP system log for more details

    cpic-status : ??

    Internal State : ??

    and denotes the error line as

    Set boOrder = bapictrl.getSapobject("SalesOrder")

    What could be the reason, and how to correct.

    Pls help me.

    Thanks in advance.

    Regards

    Rajaram

  • RELEVANCY SCORE 2.95

    DB:2.95:Internal Error ( 100000004 ) Occured [131-184] While Creating Goods Issue sd



    Hello Experts,

    I am using SAP B1 8.81 PL04.

    I am facing error "internal error ( 100000004 ) occured [131-184]" while creating Goods Issue using SDK.

    Some time "internal error ( -112 ) occured [131-183]" also came and i really do not understand why this is happening. Because these error does not come on development server but when i deploy add-on on client side these error starts coming while making Goods Issue.

    Please help to resolve this issue....

    Thank you...

    DB:2.95:Internal Error ( 100000004 ) Occured [131-184] While Creating Goods Issue sd


    Hi,

    Try to run the SAP Client as admin. Most of the Internal Error came from network problem.

    Regards,

  • RELEVANCY SCORE 2.95

    DB:2.95:Error (-1102) Occured cc


    hello , i got error at clients side at the time of log in. internal error occured(-1102)can anyone give me solutions please............

    DB:2.95:Error (-1102) Occured cc

    HI Julie, THANKS FOR REPLYING ,BUT I HAVE INSTALLED NATIVE CLIENTREGARDS,MAHESH

  • RELEVANCY SCORE 2.94

    DB:2.94:Wcs Error Common-1 After Login Completed pm



    Hi Expert,

    I found WCS Sytem Error Page was displayed after login completed for while. How can i fix about this? Thanks

    WCS System Error Page

    Error(s): You must correct following error(s) before proceeding: Error:COMMON-1: Some unexpected internal error has occured. If the problem presist please report to the Tech Support. Error:Detail: Cannot open connection

    DB:2.94:Wcs Error Common-1 After Login Completed pm


    Ahmad:

    If you're still on WCS 7.0.172.0, that's almost to be expected.  There were several catastrophic database bugs in 7.0.172.0 that showed themselves in these kinds of symptoms (CSCto88700, CSCtr97576, CSCtr33182, etc.)  The very best thing you can do is take a backup, uninstall 7.0.172.0, install 7.0.240.0 fresh, then restore the backup into 7.0.240.0.  If the database has become corrupted, you can open a case with TAC, provide a copy of the backup and see if the database can be repaired or recovered.  7.0.172.0 was **REALLY** **THAT** **BAD**!!!!!

  • RELEVANCY SCORE 2.94

    DB:2.94:Reg.Vat Configuration zp



    Dear All

    I configured VAT in our IDES system,when I assign it to PO the following error occured.

    "Tax code X1 does not exist for jurisdiction code TAMILNADU1"

    Please help

    Thanks

    Rajakumar

    DB:2.94:Reg.Vat Configuration zp


    Hi,

    If you are using TAXINJ, then go to FTXP and maintain the tax rate as 4% for VAT condiiton for Tax code X1 and jurisdiction code TAMILNADU1

    If you are using TAXINN, then go to FV11 and maintain the condiiton record for VAT condiiton and value as 4%

  • RELEVANCY SCORE 2.94

    DB:2.94:An Internal Error Occured While Installing The Service Pack Code0x800738b3 j3


    I am having trouble with installing Service Pack 1 for Windows Vista Ultimate 32 bit. When I try to install it, I get a : An internal error occured while installing the service pack with an error code of 0x800736B3.. anyone help me!!

    DB:2.94:An Internal Error Occured While Installing The Service Pack Code0x800738b3 j3

    Support for Vista Gold (no Service Packs) ended on Tuesday, 13 April 2010 so you're missing at least 15 months' worthof critical security updates (and probably more)!
    Chances are you're seeing the effects of a longstandinghijackware infection, most likely compounded by a W32/Alureon-variant rootkit infection. See...
    • Cleaning a Compromised System

    http://technet.microsoft.com/en-us/library/cc700813.aspx
    Then see the (my) ANSWER post in this thread and follow those instructions (to-the-letter and
    in order! ) to return your computer to a secure functional state:
    http://answers.microsoft.com/thread/c44429fb-3f7c-4646-8529-5a97bb3cd0eb
    Note:Your computer should not be connected to the internet or any local networks (i.e., other computers) in its current state. All of your personal data (e.g., online banking credit-card passwords) should be considered at-risk, if not already
    compromised.
    Wish I'd had better news for you. Good luck!
    PS: Support for Vista Service Pack 1 (SP1) ended on Tuesday, 12 July 2011 so you'll need to get that installed, too, ASAP!

  • RELEVANCY SCORE 2.94

    DB:2.94:Internal Error Occured With Time Split...Please Help a9



    Hi All,

    During delta data load to the cube I am getting error 'Internal Error Occured with time split' in processing and data is coming till PSA and got error in PSA.There is no field found that is time dependent and I am unable to fix it in PSA by editing data too.

    Please help me out.

    Thanks in advance.

    DB:2.94:Internal Error Occured With Time Split...Please Help a9


    Did you look at the OSS Note 582196 "Error with time split (time distribution); RSAU509" ?

    Which version do you have on your system?

    Anyway I don't think your problem is on PSA, but on your update rules...

  • RELEVANCY SCORE 2.94

    DB:2.94:Gr224 Report Painter: Internal Error When Converting A Report 1z



    Hi

    Using FAGL_RMIGR transaction I've trasferred report 8A3-0010 in a

    custom library ZXX. The migration happened without error messages. I've

    tryed then to run report FL3-0010 by GRR3 transaction but error message

    GR224 appears

    Report Painter: Internal error when converting a report

    Message no. GR224

    Diagnosis

    During the internal compilation of a Report Painter report to a

    Report Writer report, sets are generated. This caused an error in the

    subprogramm GENERATE_ROW_MULTI. The return code was 7.

    System Response

    The report could not be generated and/or saved.

    Procedure

    Please call the SAP Hotline and send them this longtext as well as

    detailed information describing the circumstances in which this

    error

    occured.

    Please could you help me?

    Thanks in advance

    Giovanna Scamardella

    DB:2.94:Gr224 Report Painter: Internal Error When Converting A Report 1z


    HI,

    SAPNET notes search with GR 224 brings some old (but maybe helpful) notes: 37611, 193392,137231, pls. check.

    Best regards, Christian

  • RELEVANCY SCORE 2.94

    DB:2.94:Index Specified Does Not Reference... Error When Building An Image Using Evaluation Software c3


    When try to build an image in target designer, I got following error message
    An internal error occured while building the run time image
    code=0x800a004c
    Description=Index specific does not reference an existing item in the collection.
    Please help!
     

    DB:2.94:Index Specified Does Not Reference... Error When Building An Image Using Evaluation Software c3

    I had the same problem, 100's of errors and Code = 0x800a004c.
    I looked like Target Designer wasn't connected to the database.
    This was with a new project, my solution was to open an old project that worked and delete the components and start from there.

    I hope this helps someone?

  • RELEVANCY SCORE 2.94

    DB:2.94:Error 0x80040705 Occured While Installing Windows Essentials.What To Do fz


    error 0x80040705 occured while installing windows essentials.what to do?please help me.

  • RELEVANCY SCORE 2.94

    DB:2.94:It Says Internal Problem 13


    i had purchased facetime from app store for mac but whenever i open "it says an internal facetime error occured, quit facetime and open again".Please help me out

    DB:2.94:It Says Internal Problem 13

    i had purchased facetime from app store for mac but whenever i open "it says an internal facetime error occured, quit facetime and open again".Please help me out

  • RELEVANCY SCORE 2.94

    DB:2.94:Unable To Start Vspeher Client And Login To Vcenter kk


    Hello,

    I am trialing vCenter server - everything was going well until I changed the IP address on the vCenter server - I am now unable to login.

    When I attempt to login I get the following error message "A general system error occured: internal error"

    Can anyone help with this error??

    Matthew

    DB:2.94:Unable To Start Vspeher Client And Login To Vcenter kk


    Have you restart the vCenter Server service?

    It's seems that your vCenter is not in a AD domain.

    Maybe you have register all the plugin with the IP address. In this case you have to modify several *.xml files to fix the address.

    Or simple reinstall the vCenter Server (or upgrade to U1) choosing the existing DSN for the DB connection.

    Andre

  • RELEVANCY SCORE 2.94

    DB:2.94:Internal Error During Geocoding dp



    Hi ,

    i am getting an error saying "An internal error occured during geocoding or in a related geocoding program." , whenever any adress is maintained in the system.

    Message # : GEOCODING004

    Internal error in IGS1, DE.RFC: Connection error Destination : IGS_RFC_DEST1

    Please suggest any way out.

    Regards,

    DB:2.94:Internal Error During Geocoding dp


    Hi Amol ..

    RFC destination IGS_RFC_DEST1, pointing to a IGS system in not working on your system.

    You need to install IGS along with eServer (geocoding engine) from PTV AG to set up the destination properly. Refer to notes 454042 and 934412.

    However, if you do not require geocoding functionality, you can simply deactivate it by executing the report GEOCODING_SET_GEOFLAG .

    - Vimal

  • RELEVANCY SCORE 2.94

    DB:2.94:I Have A Ipod Touch And I Am Trying To Update It But It Keeps There Is A Problem Dowloading The Software For The Ipod An Internal Error Has Occured What Do I Do? kx


    I have an ipod touch 4th generation I want to update it but when I do it says there is a problem downloading the softward for the ipod an internal server error occured can someone help me please?