• RELEVANCY SCORE 4.07

    DB:4.07:Install Write Failed [Solved] 8j






    im getting a write failed when the system goes to write the util-linux package
    error: could not extract usr/share/locale/it/LC_MESSAGES/util-linux.mo (Write failed)

    DB:4.07:Install Write Failed [Solved] 8j


    well, i never fully figured that one out, it must have been partition problems however, since i decided to run a linux system repair disk so i could make sure i was formatting the partitions correctly, furthermore since its a dual boot i need to introduce an extended partition where my /home and /swap ended up on. After reinstallation, te error didnt return.

  • RELEVANCY SCORE 3.71

    DB:3.71:[Solved] Problem While Installing Jdk From Aur 8f






    Hello

    Im trying to install jdk for AUR but I get this error:
    jdk1.7.0_09/db/bin/NetworkServerControl: Write failed
    jdk1.7.0_09/db/bin/setEmbeddedCP: Write failed
    jdk1.7.0_09/db/bin/ij.bat: Write failed
    jdk1.7.0_09/db/bin/dblook.bat: Write failed
    jdk1.7.0_09/db/bin/setNetworkClientCP.bat: Write failed
    jdk1.7.0_09/db/bin/sysinfo: Write failed
    jdk1.7.0_09/db/bin/setEmbeddedCP.bat: Write failed
    jdk1.7.0_09/db/bin/stopNetworkServer.bat: Write failed
    jdk1.7.0_09/db/bin/startNetworkServer.bat: Write failed
    jdk1.7.0_09/db/bin/stopNetworkServer: Write failed
    jdk1.7.0_09/db/bin/sysinfo.bat: Write failed
    jdk1.7.0_09/db/bin/ij: Write failed
    jdk1.7.0_09/db/bin/NetworkServerControl.bat: Write failed
    jdk1.7.0_09/release: Write failed
    jdk1.7.0_09/COPYRIGHT: Write failed
    jdk1.7.0_09/include/classfile_constants.h: Write failed
    jdk1.7.0_09/include/linux/jawt_md.h: Write failed
    jdk1.7.0_09/include/linux/jni_md.h: Write failed
    jdk1.7.0_09/include/jdwpTransport.h: Write failed
    jdk1.7.0_09/include/jvmti.h: Write failed
    jdk1.7.0_09/include/jvmticmlr.h: Write failed
    jdk1.7.0_09/include/jni.h: Write failed
    jdk1.7.0_09/include/jawt.h: Write failed
    bsdtar: Error exit delayed from previous errors.
    == ERRORE: Impossibile estrarre jdk-7u9-linux-i586.tar.gz
    Loperazione sta per essere interrotta...
    == ERRORE: Makepkg non è riuscito a compilare jdk.

    DB:3.71:[Solved] Problem While Installing Jdk From Aur 8f


    I solved in this way: https://bbs.archlinux.org/viewtopic.php … 9#p1058749

  • RELEVANCY SCORE 3.28

    DB:3.28:Windows Delayed Write Failed - When I Was Trying To Update My Pc Using The Windows Update, All The Downloaded Update, Cannot Install. Please Help.. ff





    windows delayed write failed - when i was trying to update my pc using the windows update, all the downloaded update, cannot install. please help..

    DB:3.28:Windows Delayed Write Failed - When I Was Trying To Update My Pc Using The Windows Update, All The Downloaded Update, Cannot Install. Please Help.. ff

    Please answereach of the following [admittedly tedious]diagnostic questions in a correspondingly-numbered list in your very next reply (no need to quote this post):
    1. What is the full name of your installed anti-virus application or security suite and
    when (approx. date) does your current subscription expire? What anti-spyware applications (other than Defender) are installed? What third-party firewall (if any)?
    2. Has a(nother) Norton application or a McAfee application EVER been installed on the computer?
    3. Did a Norton free-trial or a McAfee free-trial [PICK ONE] come preinstalled on the computer when you bought it? (Doesn't matter if you never used or Activated it.)
    4. Open Add/Remove Programs make sure the Show Updates box at the top is checked (and leave it checked); then select the
    Name option in the Sort by box on the right. Now scroll down tell me if ALL of the following
    otherupdates are listed?
    (a) KB2676562, KB2659262, KB2686509, KB2695962, KB2604092 KB2604111;

    (b) KB2675157, KB2653956 KB2621440;
    (c) KB2661637, KB2598479, KB2631813 KB2585542;
    (d) KB2633171, KB2393802 and especially KB971029
    Most will be displayed as Security Update for Windows XP followed by the KB number in parentheses.
    If IE8 is installed,two (2)will be displayed as Security Update for Windows Internet Explorer 8 followed by the KB number in parentheses.
    5. Did you just install WinXP SP3 by any chance?
    6. What Java version is currently installed? TEST HERE =
    http://java.com/en/download/installed.jsp
    7. Is Firefox, Chrome or any other alternate browser installed?
    8. Are you in the habit of using "Registry cleaners" (e.g., Registry Mechanic; System Mechanic; RegCure; RegClean Pro; Advanced SystemCare; Registry Booster; McAfee QuickClean; AVG PC TuneUp; Norton Registry Cleaner; PCTools Optimiser; SpeedUpMyPC; Advanced
    System Optimizer; TuneUp Utilities; WinMaximizer; WinSweeper; CCleaner)?
    9. Have you ever had occasion to do a
    Repair Install or a clean install of WinXP for any reason?

  • RELEVANCY SCORE 3.02

    DB:3.02:Problem Using Spartan 3e Starter Kit 7a



    Hi,

    I am using spartan 3e starter kit and ise 10.2 software. I am not able to load .bit file into the fpga as iMPACT shows an error :

    write cmdbuffer failed 20000015.write cmdbuffer failed 20000015.Loopback test failed. Sent character = 00, Received character = 00.Cable connection failed.

    Please help.

    Regards,

    Ashish







    Solved!
    Go to Solution.

    DB:3.02:Problem Using Spartan 3e Starter Kit 7a


    ashishnarnoli.91,

    Please see Answer Record #31931 on xilinx.com: http://www.xilinx.com/support/answers/31931.htmfor information on this error message and the current workaround.

  • RELEVANCY SCORE 2.99

    DB:2.99:F60 Windows Install Failed! Help m7


    F60 Windows install failed! HELP

    DB:2.99:F60 Windows Install Failed! Help m7

    If you run Parted Magic and secure erase the disk that would not be an issue.

  • RELEVANCY SCORE 2.93

    DB:2.93:[Solved] Systemd Fancontrol Fails To Start At Boot 19



    Hi,

    Ive just switched to systemd from initscript and I cant resolve an issue: fancontrol fails to run at boot time, but it works properly when manually started.

    Logs:
    UNIT LOAD ACTIVE SUB JOB DESCRIPTION
    colord.service loaded failed failed Manage, Install and Generate Color Profiles
    fancontrol.service loaded failed failed Fan control daemon

    DB:2.93:[Solved] Systemd Fancontrol Fails To Start At Boot 19


    I think you are right. Apparently it seems I mixed up sensord with sensors. Thanks.

  • RELEVANCY SCORE 2.93

    DB:2.93:Failed Install? mf


    DB:2.93:Failed Install? mf

    Not really. Being the fragile construct it is, activation reacts quite badly on any attempt to coerce it. Deployment and licensing are two different things, though. Under normal circumstances, you can uninstall apps without deactivating and would still be able to re-install with a proper (old) activation. In any case, if it doesn't work, a call to Adobe support and going through the full procedure of having the activations released manually is the only option.

    Mylenium

  • RELEVANCY SCORE 2.90

    DB:2.90:Worms Armageddon Failed To Install (?) fm



    Just purchased Worms armageddon. After i installed it (unusulay fast since apparently the whole install was only 6 kb) I´t dosen´t show up in my games list and after a reinstall ist´s the same thing...







    Solved!
    Go to solution

    DB:2.90:Worms Armageddon Failed To Install (?) fm


    If only full games were 6kb!

    What you downloaded was the unlock key. Download the trial/demo too. The unlock key will unlock the trial to the full game.




  • RELEVANCY SCORE 2.90

    DB:2.90:[Solved] Tolua++ Missing From Aur 99



    While trying to install conky-lua from AUR, it failed saying:
    Dependency `tolua++ of `conky-lua does not exist.

  • RELEVANCY SCORE 2.87

    DB:2.87:Kernel Is Not Bootable After Installing [Solved] pc



    When I install Arch from 0.7.1 CD I get the following errors after reboot:
    RAMDISK: incomplete write (-28 != 17) 16777216
    crc error

    DB:2.87:Kernel Is Not Bootable After Installing [Solved] pc


    I really found the problem.I set FSB to 166MHz and memory timings to By SPD instead of Auto and it works.When FSB is 200MHz BIOS says that CPU is Sempron 1800MHz,when FSB is 166MHz BIOS says that CPU is Sempron 2200+ (CPU clock is on 1200MHz).It seems that my CPU was a bit overclocked. But Debian 3.1 and Arch 0.7.1 CD worked! And first time when I was installing Arch from FTP it worked fine too (until lilo/initrd changes). Strange...

  • RELEVANCY SCORE 2.86

    DB:2.86:[Solved] Gummiboot --Path=$Esp Install Seems To Fail. az


    [root@archiso ~]# gummiboot --path=$esp install
    Failed to check file system type of : No such file or directory

    DB:2.86:[Solved] Gummiboot --Path=$Esp Install Seems To Fail. az

    wiki wrote:
    replacing $esp with the location of your EFI System Partiton, usually /boot:

  • RELEVANCY SCORE 2.85

    DB:2.85:Failed To Commit Transaction(Conflicting Files)[Solved] 11



    Hello,

    Im trying to install arch, but right at the second step I ran into a problem. When I issued the command
    pacstrap /mnt base base-devel

    DB:2.85:Failed To Commit Transaction(Conflicting Files)[Solved] 11


    I thought the partition I used to install arch was empty, but in fact, it was not. I reformatted the partition and now, everthing is all right.

    Sorry for the bother.

  • RELEVANCY SCORE 2.83

    DB:2.83:[Solved] Vmware Workstation 6.5.1 Help To Install 77



    i try to install vmwarebut in the wiki is an older version

    i install vmware with VMware-Player-2.5.1-126130.x86_64.bundle but when i want start /etc/rc.d/vmware , its failed :
    [pynux@Core2Duo ~]$ sudo /etc/rc.d/vmware start
    Mot de passe :

    Starting VMware services:
    Virtual machine monitor failed
    Virtual machine communication interface failed
    Blocking file system failed
    Virtual ethernet failed
    [pynux@Core2Duo ~]$

    DB:2.83:[Solved] Vmware Workstation 6.5.1 Help To Install 77

    pynux wrote:
    thank you it was really simple just move old binary
    sudo mv /usr/lib/vmware/modules/binary /usr/lib/vmware/modules/binary.old

  • RELEVANCY SCORE 2.83

    DB:2.83:Vmware Workstation 7.1.4 Failed To Install On Win7 X86 j8



    VMWare workstation 7.1.4 failed to install on Windows 7 x86 SP1 with error - "Failed to write to the requested registry valueValue: FOILError: 5"

    I also tried 7.1.3 with same error.

    20110424210639:INFO wWinMain:Checking exceptions [36]20110424210639:INFO wWinMain:Handle error20110424210639:INFO HandleError: Handling error: [36] lang [1033]20110424210639:ERROR** HandleError: Encountered fatal error id: 3620110424210639:ERROR** HandleError: Message: [Failed to write to the requested registry valueValue: FOILError: 5]20110424210639:ERROR** DisplayErrorMain: Displaying error message20110424210639:ERROR** DisplayError Error [Failed to write to the requested registry valueValue: FOILError: 5]

    Screenshot and logs attached.

    Thanks!

    Michael

  • RELEVANCY SCORE 2.83

    DB:2.83:Creative Cloud Desktop Failed To Install d3



    Creative Cloud desktop failed to install

  • RELEVANCY SCORE 2.80

    DB:2.80:Install Failed Error Code 1603 -- Solved 3s



    On Windows 7, upgrading to 7.1.0.105. The upgrade deleted the old version, but the install failed with error code 1603. Tried lots of things suggested here and on the net.

    What worked was simply rebooting -- because there was a service: Skype Updater, that had to be deleted for the install to work, and rebooting is the only way to delete it. After the reboot, ran the install and it worked!

    DB:2.80:Install Failed Error Code 1603 -- Solved 3s


    On Windows 7, upgrading to 7.1.0.105. The upgrade deleted the old version, but the install failed with error code 1603. Tried lots of things suggested here and on the net.

    What worked was simply rebooting -- because there was a service: Skype Updater, that had to be deleted for the install to work, and rebooting is the only way to delete it. After the reboot, ran the install and it worked!

  • RELEVANCY SCORE 2.80

    DB:2.80:Can't Install Os On Lenove G460 s7


    I can't install win xp on my g460. it always failed when the installation process starts to install windows.Is there anybody can give me information or solutio related to this things?Thanks







    Solved!
    Go to Solution.

    DB:2.80:Can't Install Os On Lenove G460 s7

    thank u for moderator,it's worki have G460 with OS windows Xp now.

  • RELEVANCY SCORE 2.79

    DB:2.79:Rimalbumartdaemon[15263]: Failed To Write Artwork To Folder j3



    Hi Peeps

    was wondering if anyone has come across the message above?

    Its polluting my logs and I want to know why

    Its a clean install of the latest version and i've yet to sync my bb to it

    i've repaired permissions, still no joy

    any help is appreciated

    thanks

    DB:2.79:Rimalbumartdaemon[15263]: Failed To Write Artwork To Folder j3


    Hi Peeps

    was wondering if anyone has come across the message above?

    Its polluting my logs and I want to know why

    Its a clean install of the latest version and i've yet to sync my bb to it

    i've repaired permissions, still no joy

    any help is appreciated

    thanks

  • RELEVANCY SCORE 2.79

    DB:2.79:Thread: Inventory Failed fz


    Hi,

    any ideas

    Scanner(Error) : 063: Transfer .STR file from the Workstation to the

    Inventory server failed.

    CIFS is disables and we are running Zfd 4.0.1 serverpatch2.

    I also made a wks_group and gave it file/read/create/write to the scandir

    folder.

    Urbain,

    PS: Shaun apparently not solved after upgrade...

    DB:2.79:Thread: Inventory Failed fz

    Urbain,

    Normally the cifs name should be servername_win...

    SLP ois ok now... The inventory looks to be working now. (after the changes

    I made).

    phew!

    BTW: Is there somewhere a good description of the relations between the

    tables/views in ZfD 4 and I do not mean the official doc\'s...

    how do you mean?

    -' + '-

    Shaun Pond

    Novell Support Connection SysOp

  • RELEVANCY SCORE 2.79

    DB:2.79:[Solved] [Gnome 3.8] Gnome Shell Segfaults ak



    Having an issue here with gnome-shell
    [ 2961.880512] traps: gnome-shell[2764] general protection ip:7fb6a45087d0 sp:7fffccda9438 error:0 in libglib-2.0.so.0.3600.1[7fb6a44d0000+fc000]
    [ 2963.270402] systemd-journald[180]: Failed to write entry, ignoring: Argument list too long
    [ 3077.748064] gnome-shell[4230]: segfault at 1 ip 00007fb593d087d0 sp 00007fff9c84c4b8 error 4 in libglib-2.0.so.0.3600.1[7fb593cd0000+fc000]
    [ 3079.148914] systemd-journald[180]: Failed to write entry, ignoring: Argument list too long
    [31220.748188] gnome-shell[4316]: segfault at 1 ip 00007f693fe707d0 sp 00007fffd95b02b8 error 4 in libglib-2.0.so.0.3600.1[7f693fe38000+fc000]
    [31222.124573] systemd-journald[180]: Failed to write entry, ignoring: Argument list too long
    [39447.062449] systemd-journald[180]: Failed to write entry, ignoring: Argument list too long
    [39755.970576] traps: gnome-shell[5083] general protection ip:7fddbe8d87d0 sp:7fffa7ebf1c8 error:0 in libglib-2.0.so.0.3600.1[7fddbe8a0000+fc000]
    [39757.250143] systemd-journald[180]: Failed to write entry, ignoring: Argument list too long
    [40816.727580] gnome-shell[6675]: segfault at 1 ip 00007f02f0f707d0 sp 00007fffadd54b48 error 4 in libglib-2.0.so.0.3600.1[7f02f0f38000+fc000]
    [40818.033701] systemd-journald[180]: Failed to write entry, ignoring: Argument list too long

    DB:2.79:[Solved] [Gnome 3.8] Gnome Shell Segfaults ak


    For me it happens at least 2 times per day, on 2 different machines..

  • RELEVANCY SCORE 2.78

    DB:2.78:Skype Won't Upgrade To 4 On Ubuntu 12.04 3a



    Downloadingskype-ubuntu_4.0.0.7-1_i386.deb from the website, Software Centre opens offering the option to upgrade Skype, prompts for password and update fails.

    Package operation failed:

    5% ... (Reading database ... 85% (Reading database ... 90% (Reading database ... 95% (Reading database ... 100% (Reading database ... 221522 files and directories currently installed.)Unpacking skype (from .../skype-ubuntu_4.0.0.7-1_i386.deb) ...dpkg: error processing /home/tim/Downloads/skype-ubuntu_4.0.0.7-1_i386.deb (--install):trying to overwrite '/etc/dbus-1/system.d/skype.conf', which is also in package skype-bin 2.2.0.35-0precise3dpkg-deb (subprocess): data: internal gzip write error: Broken pipedpkg-deb (subprocess): failed in write on buffer copy for failed to write to pipe in copy: Broken pipedpkg-deb: error: subprocess decompress returned error exit status 2

    Any more info required please ask.







    Solved!
    Go to Solution.

    DB:2.78:Skype Won't Upgrade To 4 On Ubuntu 12.04 3a


    hmm, that is unlikely. Reason being that the repositories are kinda updated per release. So you might have luck if the 4.0 version is pushed to the official repos. Even then it might only show up for Ubuntu Quantal.

    With regards to a PPA, na since Skype is closed source there's unlikely to be a PPA for it. At least officially and legally.

  • RELEVANCY SCORE 2.78

    DB:2.78:Strange Pacman Warning - Should I Be Concerned? [Solved] j9



    While updating today I got a warning that said warning: warning given when extracting .INSTALL (Write failed) several times. It claimed to upgrade everything though, and the log confirms this. Just wondering if anyone else had this warning and what it might entail. Hoping its nothing to be concerned about.

    Last edited by toru (2011-11-05 18:28:41)

  • RELEVANCY SCORE 2.78

    DB:2.78:Write Same Failed On Vmware 10 z1



    Hello,

    I was trying to install Arch Linux on a VMWare 10 virtual machine but when I mounted the root partition (ext4) it printed: Write SAME failed.

    How can I solve this problem?

    ThanksDennis

    DB:2.78:Write Same Failed On Vmware 10 z1


    Have you tried https://bbs.archlinux.org/viewtopic.php … 5#p1281395 ?

  • RELEVANCY SCORE 2.76

    DB:2.76:Failed To Update dc


    My phone not update over wifi. Here is problem. It could download 100% error in install. There message appears "could not install".






    Solved!
    Go to Solution.

    DB:2.76:Failed To Update dc


    Again that's probably your SIM card or something else, it will be helpful if you take a screenshot and post it here, but you could just repair your phone with PCC and check again





    "I'd rather be hated for who I am, than loved for who I am not." Kurt Cobain (1967-1994)

  • RELEVANCY SCORE 2.74

    DB:2.74:Drive Going Off Line With Delayed Write Error Solved On 700 Board Back On 720 Upgrade Board m8


    Is anyone else experiencing a drive going off line and generating a failed delayed write error.

    DB:2.74:Drive Going Off Line With Delayed Write Error Solved On 700 Board Back On 720 Upgrade Board m8

    My thoughts would be that it's the drive, but I just don't really like Maxtor.  Did the hard drive come with the computer?

  • RELEVANCY SCORE 2.74

    DB:2.74:Modern Warfare 2 k9


    latest game update failed to install, now the game fails to even start. please help






    Solved!
    Go to solution

    DB:2.74:Modern Warfare 2 k9


    delete EVERTHING to do with cod on the ps3 then try again

  • RELEVANCY SCORE 2.74

    DB:2.74:Installations Failed 8s



    Instation Failed. Error opening Installation log file. Verify that the specified log file exists and that you can write to it.

    DB:2.74:Installations Failed 8s


    Sorry those steps had not been easy to follow. If you would like, our phone support group has the ability to remote access your PC (with your present at all times) and work first had on the install issue.

    Please call our technical support at 800-474-6836. If you live outside the US/Canada Region, please click HERE to get the support number for your region.

  • RELEVANCY SCORE 2.74

    DB:2.74:Install Failed On New Laptop za



    hello, we purchased a new sony vaio today and during the install we lost power, now when we boot it says the install has an error and an ok button.

    is there any way to restart the initial vaio setup? is there a partition or something i can boot from to fix this?

    greets matth







    Solved!
    Go to Solution.

    DB:2.74:Install Failed On New Laptop za


    @ mohitsaini

    Have you Registered your Vaio in India? Any International Warranty will be invalid unless your Vaio is Registered.

    Go to the Support Page for your model and make sure all the software is up to date and Register: -

    http://www.sony-asia.com/support/product/vpceh18fg

    I suggest you back up your data and make a set of Recovery Discs - just in case. You will find how to make Recovery Discs in the Tutorials for Vaio Care. You can also run Vaio Care One Click Care and other helpful diagnosis tools.

    The Troubleshooting Guide will tell you how to reinstall Windows 7 if necessary.

    If this does not fix your problems, check if you have an International Warranty and the telephone number for Europe.

    Just a word of advice - you would be far better starting a new question than hijacking someone elses discussion. You will get more answers and be able to find replies more simply.

  • RELEVANCY SCORE 2.73

    DB:2.73:Dell R620: Eeprom Write Failure While Upgrading Intel(R) Gigabit 4p I350-T Rndc From 14.X To 15.0.28 In Rhel6.2 am


    Im observing NICfirmware update failures on6 of our Dell PowerEdge R620 servers. Please suggest remedy methods/workarounds.

    Error on14.5.8

    The version of this Update Package is newer than the currently installed version.

    Software application name: Intel(R) Gigabit 4P I350-t rNDC

    Package version: 15.0.28

    Installed version: 14.5.8

    Executing update...

    WARNING: DO NOT STOP THIS PROCESS OR INSTALL OTHER DELL PRODUCTS WHILE UPDATE IS IN PROGRESS.

    THESE ACTIONS MAY CAUSE YOUR SYSTEM TO BECOME UNSTABLE!

    ..........UpdateDevice Error: 6 [EEPROM write failure]

    UpdateDevice Error: 6 [EEPROM write failure]

    UpdateDevice Error: 6 [EEPROM write failure]

    UpdateDevice Error: 6 [EEPROM write failure]

    .

    Update Failed [EEPROM write failure].

    Intel(R) Gigabit 4P I350-t rNDC

    Update Failed [EEPROM write failure].

    Update Failed [EEPROM write failure].

    Intel(R) Gigabit 4P I350-t rNDC

    Update Failed [EEPROM write failure].

    Update Failed [EEPROM write failure].

    Intel(R) Gigabit 4P I350-t rNDC

    Update Failed [EEPROM write failure].

    Update Failed [EEPROM write failure].

    Intel(R) Gigabit 4P I350-t rNDC

    Update Failed [EEPROM write failure].

    Update Failed [EEPROM write failure].

    Error on14.0.12

    The version of this Update Package is newer than the currently installed version.

    Software application name: Intel(R) Gigabit 4P I350-t rNDC

    Package version: 15.0.28

    Installed version: 14.0.12

    Executing update...

    WARNING: DO NOT STOP THIS PROCESS OR INSTALL OTHER DELL PRODUCTS WHILE UPDATE IS IN PROGRESS.

    THESE ACTIONS MAY CAUSE YOUR SYSTEM TO BECOME UNSTABLE!

    ..........UpdateDevice Error: 6 [EEPROM write failure]

    UpdateDevice Error: 6 [EEPROM write failure]

    UpdateDevice Error: 6 [EEPROM write failure]

    UpdateDevice Error: 6 [EEPROM write failure]

    The package we are using is Network_Firmware_HKK1W_LN_15.0.28_A00.BIN

    DB:2.73:Dell R620: Eeprom Write Failure While Upgrading Intel(R) Gigabit 4p I350-T Rndc From 14.X To 15.0.28 In Rhel6.2 am


    Hi,

    Try the following steps and see if it allows the update to complete.

    1. Shut down the system
    2. Remove AC power and wait 15 seconds
    3. Reinsert the power cable and power on the system
    4. Boot to Windows or Linux and downgrade the firmware to version 14.5.9. (Do this even if the DUP says that the installed version on the card is 1.0, 13.x or 14.x) DO NOT USE iDRAC, CMC, OM Essentials, Lifecycle Controller, or WSMAN to do this.

    http://www.dell.com/support/home/ht/en/htbsdt1/Drivers/DriversDetails?driverId=G58TVfileId=3402751839osCode=RH60productCode=poweredge-r620categoryId=NI

    5. Shut down the system
    6. Remove AC power and wait 15 seconds
    7. Reinsert the power cable and power on the system
    8. Boot to Either Windows or Linux and upgrade the firmware to version 15.0.28. DO NOT USE iDRAC, CMC,OM Essentials, Lifecycle Controller, or WSMAN. At the end of the update, the DUP will display an error that says Update Failed [EEPROM size adjusted please reboot and run the update again.] Reboot the system after acknowledging the error.
    9. Run the 15.0.28 update again from within either Windows or Linux. The update should be successful this time.
    10. Shut down the system
    11. Remove AC power and wait 15 seconds
    12. Reinsert the power cable and power on the system.

  • RELEVANCY SCORE 2.73

    DB:2.73:Bind9-2-4 Install Fail 9m


    hello

    My name is wada from Japan.

    Now I am building Web and DNS Server.

    I installed Solaris9 for x86 PC.
    Then I tried to build DNS server(bind9-2-4).
    There is no pakage for bind9-2-4.
    I downloaded bind9-2-4's source code.

    But I could not build it up.
    make command is failed.
    (./configure command is completed.)

    make command's error is below.

    /usr/include/ia32/sys/reg.h error:parse error before "upad128_t"

    My Solaris's pakage's version is bellow.
    gcc:3.3.2
    libgcc:3.3
    libiconv:1.8
    make:3.8.0

    I can't write English well.(Sorry I recognize.)
    Please anybody give me a suggetion to solved this problem!

    DB:2.73:Bind9-2-4 Install Fail 9m

    Wada,

    I'm sure you can setup Solaris 10 to be a DNS server, without going into build and make etc.

    Quite likely this is also valid for Solaris 9.

    For further information, please check the S9 Administration documentation for a doc like:

    816-4556 System Administration Guide Naming and Directory Services (DNS, NIS, and LDAP).pdf

    (PS this doc (816-4556 ) is for S10)

    Good luck,

    Eric.

  • RELEVANCY SCORE 2.73

    DB:2.73:Sh: Post_Install: Command Not Found 93



    Im having errors when install random packages...

    sh: post_install: command not foundattention: alertness produced during the removal. INSTALL (Write failed)error: command failed to execute

    DB:2.73:Sh: Post_Install: Command Not Found 93


    Could you run pacman -Syyu? The reason why Im asking is because poppler-glib and others dont even have post_upgrade():

    package_poppler-glib() { pkgdesc=Poppler glib bindings depends=(poppler=${pkgver} glib2)

    cd ${srcdir}/${pkgbase}-${pkgver}/poppler make DESTDIR=${pkgdir} install-libLTLIBRARIES cd ${srcdir}/${pkgbase}-${pkgver}/glib make DESTDIR=${pkgdir} install install -m755 -d ${pkgdir}/usr/lib/pkgconfig install -m644 ../poppler-glib.pc ${pkgdir}/usr/lib/pkgconfig/ rm -f ${pkgdir}/usr/lib/libpoppler.* rm -f ${pkgdir}/usr/bin/poppler-glib-demo}

    Also, do you have texinfo (which is required by gsls install script)? We also need the output of pacman with --debug flag.

  • RELEVANCY SCORE 2.73

    DB:2.73:[Solved] Strange Output In Dmesg 7s



    Anyone tell me how can I turn off this damn thing:
    [24344.810757] sd 6:0:0:0: [sdc] Test WP failed, assume Write Enabled
    [24344.812773] sd 6:0:0:0: [sdc] Asking for cache data failed
    [24344.812779] sd 6:0:0:0: [sdc] Assuming drive cache: write through

    DB:2.73:[Solved] Strange Output In Dmesg 7s


    Anyone tell me how can I turn off this damn thing:
    [24344.810757] sd 6:0:0:0: [sdc] Test WP failed, assume Write Enabled
    [24344.812773] sd 6:0:0:0: [sdc] Asking for cache data failed
    [24344.812779] sd 6:0:0:0: [sdc] Assuming drive cache: write through

  • RELEVANCY SCORE 2.73

    DB:2.73:Content Server Install Question 97



    I am installing Content Server 5.3 SP5 on AIX 6.1.

    Oracle client was installed prior to beginning the CS install.

    Created a account called "dmadmin' which was to be my installation account. "dmadmin" does NOT have root access on that server, but has read, write, execute access on /var/tmp and $DOCUMENTUM and its subdirectories

    1. When it came to the point of running "dm_root_task", it failed to run because it could not sudo into a root account. Once Content Server install was completed, I ran the "dm_root_task" manually with a root account - Problem solved.

    2. Next during docbroker and docbase creation, the installer (still logged in as dmadmin) could not access tnsnmaes.ora - fixed this by chmod 775 on this file.

    3. At a later step dmadmin could not access headstart.ebs. - again got past this step by chmod 775 on this file. The error I got at this step was

    [DM_LOCATION_E_FILE_EXISTENCE]error: "File System file specified in DM_LOCATION (check_signature) does not exist. Operating System failed to validate existence of the file (/tardis/documentum/dba/dm_check_password). Operating System error was (File permission prevents read access)"

    All this makes me wonder if dmadmin should also have root access prior to beginning installation? No where in the install guide is this mentioned though..

    Any insight into this is much appreciated. We are still in DEV and any preinstall tips will help us with the higher env installs.

    Thanks!

    DB:2.73:Content Server Install Question 97


    Yes, we need to upgrade to %.3 SP6 prior to 6.5.

    But at this point, we are still installing CS 5.3 SP5. The issue I have written about is frm installation of 5.3 SP5.

  • RELEVANCY SCORE 2.72

    DB:2.72:Windowsupdateclient; Id 20 Microsoft.Windowscommunicationsapps And Microsoft.Reader 19



    Installation Failure: Windows failed to install the following update with error 0x80073CF1: microsoft.windowscommunicationsapps.

    Installation Failure: Windows failed to install the following update with error 0x80073CF1: Microsoft.Reader.
    rep.
    It seems to have solved by
    WindowsUpdateDiagnostic.

    Windows 8.1 Pro 32-Bit Media Center ASUS P5G41T-M LE Ram 4GB

    DB:2.72:Windowsupdateclient; Id 20 Microsoft.Windowscommunicationsapps And Microsoft.Reader 19

    Hi alpha45,
    Glad to hear that you have resovled it by yourself.
    have a nice day!Alex Zhao
    TechNet Community Support

  • RELEVANCY SCORE 2.72

    DB:2.72:Can Burn Cd But Not Dvd kd


    I Cant burn DVD anymore all of asudden but can burn CD. tried with nero, ultra image, imgburn etc.they giving me write error.this is log from imgburmW 13:13:49 Retry Failed - Reason: Write ErrorE 13:13:56 Failed to Write Sectors 0 - 31 - Reason: Write Errorrunning XP on y730any idea?







    Solved!
    Go to Solution.

    DB:2.72:Can Burn Cd But Not Dvd kd

    its working again after reload.oh well!

  • RELEVANCY SCORE 2.71

    DB:2.71:[Solved]Cant Install Octave, Files Unavailable ks



    Hi all,Ive tried googling and searching in the forum but I couldnt find anything that solved my problem...Im trying to install octave but some files are not available
    error: failed retrieving file blas-20070405-2-x86_64.pkg.tar.gz from mir1.archlinux.fr : File unavailable (e.g., file not found, no access)
    error: failed retrieving file lapack-3.2.1-1-x86_64.pkg.tar.gz from mir1.archlinux.fr : File unavailable (e.g., file not found, no access)
    warning: failed to retrieve some files from extra
    error: failed to commit transaction (File unavailable (e.g., file not found, no access))

    DB:2.71:[Solved]Cant Install Octave, Files Unavailable ks


    Hi all,Ive tried googling and searching in the forum but I couldnt find anything that solved my problem...Im trying to install octave but some files are not available
    error: failed retrieving file blas-20070405-2-x86_64.pkg.tar.gz from mir1.archlinux.fr : File unavailable (e.g., file not found, no access)
    error: failed retrieving file lapack-3.2.1-1-x86_64.pkg.tar.gz from mir1.archlinux.fr : File unavailable (e.g., file not found, no access)
    warning: failed to retrieve some files from extra
    error: failed to commit transaction (File unavailable (e.g., file not found, no access))

  • RELEVANCY SCORE 2.70

    DB:2.70:(Solved) Boot Trouble With Graphical Mode xj



    Hi. After I have managed to install the whole system on /dev/sda5 (/) and /dev/sda6 (/home) I cannot access graphical mode. I have installed gnome and gdm.
    Decompressing linux...parsing elf...done
    booting the kernel.
    boobt: Superblock last mount time in the future.

    (by less than a day, probably due to the hardware clock being incorrect1y set ) Fixed.
    boot:Superblock last write time in the future
    (by less than a day, probably due to hardware clock being incorrect1y) FIXED

    boot: clean 136515/2334720 files, 1045204/9323716 blocks
    [ 4.742923] microcode: failed to load file amd-ucode/microcode_amd.bin
    systemd[-fsck[280]: /dev/sda6:clean, 15/3170304 files , 25021/12668348 blocks

  • RELEVANCY SCORE 2.69

    DB:2.69:[Solved] Pacman Ran Out Of Space, Blew Up My System During -Syu! Help! m3



    I didnt have enough space on my root partition so doing pacman -Syu completely broke my system. Between classes and all my homework im still trying to restore my system. Im logging everything here to help others who might encounter the same problem.

    If you have any advice or experience with this, please post it!

    What happened:I attempted to do a system update and received many errors during the install that looked like these:
    Error syncing configuration data: Failed to write some configuration data to disk
    error: command failed to execute correctly
    (148/324) upgrading gedit [######################] 100%

    (gconftool-2:10150): GConf-WARNING **: Failed to write /etc/gconf/gconf.xml.defaults/%gconf-tree.xml: Error writing file /etc/gconf/gconf.xml.defaults/%gconf-tree.xml.new: No space left on device

    Error syncing configuration data: Failed to write some configuration data to disk
    (149/324) upgrading vte [######################] 100%
    error: could not create temp directory
    (150/324) upgrading gucharmap [######################] 100%
    error: could not create temp directory
    error: could not create temp directory
    (151/324) upgrading gedit-plugins [######################] 100%
    error: could not create temp directory
    error: could not create temp directory
    ^C52/324) upgrading gimp [###############-------] 71%
    Interrupt signal received
    (152/324) upgrading gimp [######################] 100%
    gtk-update-icon-cache: **
    Gtk:ERROR:updateiconcache.c:1102:write_bucket: assertion failed: (*offset == ftell (cache))
    /tmp/alpm_z9MBQe/.INSTALL: line 1: 10156 Aborted gtk-update-icon-cache -q -t -f usr/share/icons/hicolor
    error: command failed to execute correctly

    DB:2.69:[Solved] Pacman Ran Out Of Space, Blew Up My System During -Syu! Help! m3

    trusktr wrote:
    I wanted to note that as of pacman 4 the CheckSpace option in /etc/pacman.conf is enabled by default, which could help prevent a nasty scenario like this one.

  • RELEVANCY SCORE 2.69

    DB:2.69:Media Card cj


    Went to install my 2GB media card, and keep getting Format failed. Any hideas would be appreciated.






    Solved!
    Go to Solution.

    DB:2.69:Media Card cj

    From logical point of view - if card works on another device and does not work with yours - the problem is connected to yours device.



    ----------------if your issue solved set "Solution" mark at the relevant post

  • RELEVANCY SCORE 2.69

    DB:2.69:Failed To Install 7k


    hifailed to install ?

  • RELEVANCY SCORE 2.68

    DB:2.68:Help Me How To Change The Year Of Birth x3



    I was wrong to write the year of birth in prifile in tagged, I've tried to fix but always failed, please help me how to change it, my correct birth year is 1979.







    Solved!
    Go to Solution.

    DB:2.68:Help Me How To Change The Year Of Birth x3


    for whatever reason it put the wrong year of birth on my profile. i tried to change it but it keeps saying it's invalid. the year should be 1994 not 1996. when i put 1994 to change it it gives me the following message....... Sorry but you need to correct the following birthdate: invalid birthday. my birthday is june 10 1994. whats invalid about that?

  • RELEVANCY SCORE 2.68

    DB:2.68:Vaio Care Troubleshooter Version 1.0 Failed To Install 81



    Attempted to install twice. Failed twice. Any suggestions? Thanks!







    Solved!
    Go to Solution.

    DB:2.68:Vaio Care Troubleshooter Version 1.0 Failed To Install 81


    Hi all,

    Sorry and please do understand that Sony is aware of it and working on a solution as we speak. Please check this recent postfor resolution. Or can check www.esupport.sony.com for updates with your model.

    Nick-

  • RELEVANCY SCORE 2.68

    DB:2.68:Pacman Update Fails (Cannot Write To File...) [Solved] zc



    Hi,

    I followed the Wiki and installed Arch i686 into a Virtual Machine (VMServer 2.0). As suggested I executed pacman -Syy and rm /usr/lib/klibc/include/asm. Everything seemed to work fine until I tried to do a system upgrade:

    #pacman --sync --refresh --sysupgrade:: Synchronizing package databases...core is up to dateextra is up to datecommunity is up to date:: Starting full system upgrade...

    :: pacman has detected a newer version of itself.:: Do you want to cancel the current operation:: and install the new pacman version now? [Y/n]resolving dependencies...looking for inter-conflicts...

    Targets: libarchive-2.5.5-1 pacman-3.2.1-1

    Total Download Size: 0.81 MBTotal Installed Size: 2.46 MB

    Proceed with installation? [Y/n]:: Retrieving packages from core... libarchive-2.5.5-1-i686 348.5K 217.7K/s 00:00:02 [###...###] 100%error: cannot write to file /var/cache/pacman/pkg/pacman-3.2.1-1-i686.pkg.tar.gz.partwarning: failed to retrieve some files from coreerror: failed to commit transaction (unexpected error)Errors occurred, no packages were upgraded.#

    Sorry, Im new to archlinux and more or less new to Linux at all. So, the only idea I had so far was to look at the available disk space:/dev/sda3 87M available, mounted on /none 252M available, mounted on /dev/shm/dev/sda1 28M available, mounted on /boot/dev/sda4 264M available, mounted on /home

    Any ideas what I missed? TIA!

    Frank

    Last edited by Frank2 (2008-11-12 18:49:13)

    DB:2.68:Pacman Update Fails (Cannot Write To File...) [Solved] zc


    I guess if you have a good internet connection that you should always clear the local cache:
    sudo pacman -Scc

  • RELEVANCY SCORE 2.68

    DB:2.68:Forced Fsck[Solved] sc


    fsck failed. Please repair manually and reboot. Please note that the root file system is currently mounted read-only.
    To remount it read-write:

    # mount -n -o remount,rw /

    CONTROL-D will exit from this shell and REBOOT the system.

    DB:2.68:Forced Fsck[Solved] sc


    Thanks for the response.

    Turns out my old IDE HD thats been collecting dust finally bit it. Sticking a sata in this machine and reinstalling solved it.

  • RELEVANCY SCORE 2.68

    DB:2.68:[Solved] Sbcl-Git Pkgbuild 1k



    Im trying to write a sbcl-git PKGBUILD so people can circumvent some sbcl bugs and install stumpwm-git, heres my attempt thus far which fails miserably.

    Edit: solved, big thanks to acieroid who provided the pkgbuild:

    http://aur.archlinux.org/packages.php?ID=45922

    Last edited by drot (2011-01-30 20:39:05)

    DB:2.68:[Solved] Sbcl-Git Pkgbuild 1k


    Im trying to write a sbcl-git PKGBUILD so people can circumvent some sbcl bugs and install stumpwm-git, heres my attempt thus far which fails miserably.

    Edit: solved, big thanks to acieroid who provided the pkgbuild:

    http://aur.archlinux.org/packages.php?ID=45922

    Last edited by drot (2011-01-30 20:39:05)

  • RELEVANCY SCORE 2.68

    DB:2.68:[Solved?] Lightdm Has Stopped Starting! 37


    systemd-journald[119]:Failed to write entry, ignoring: Argument list too long

    DB:2.68:[Solved?] Lightdm Has Stopped Starting! 37

    systemd-journald[119]:Failed to write entry, ignoring: Argument list too long

  • RELEVANCY SCORE 2.68

    DB:2.68:Device Space Problem js



    tar: ./README_de: Cannot write: No space left on devicetar: ./copyright_de.txt: Cannot write: No space left on devicetar: ./copyright_en.txt: Cannot write: No space left on devicetar: ./readme.tar: Cannot write: No space left on devicetar: ./extras.tar: Cannot write: No space left on device61396+1 records in563425+1 records out576947609 bytes (577 MB) copied, 15.1137 s, 38.2 MB/star: Error exit delayed from previous errors== ERROR: Build Failed. Aborting...Error: Makepkg was unable to build worldofpadman package.

    this happen when i try to install world of padman from aur, how to solve?

    DB:2.68:Device Space Problem js


    thanx... solved too. switched from yaourt to aur-get to build the RT Kernel.

  • RELEVANCY SCORE 2.68

    DB:2.68:[Solved]Installing Tp_Smapi Command Failed To Execute Correctly cf



    Hello,

    I get following error while installing tp_smapi.
    /tmp/alpm_4nLdTf/.INSTALL: line 3: 5655 Aborted depmod -v $( $extramodules/version) /dev/null
    error: command failed to execute correctly

  • RELEVANCY SCORE 2.68

    DB:2.68:Sld Locked In Display Only Mode Nw2004s Install- Socket Write Error d3



    Hi sdn folks,

    I have installed the developer workplace on my pc with a local sld and a maxdb database. I installed from the NW2004S dvds. The install running sapinst all went OK. The problem I have is I cant seem to get into / change settings in the sld. When I try to connect to the SLD using the correct port and the Administrator account - I get taken to the SLD screen - but all options are greyed out - it seems to be display mode only... If I go into visual administrator and run a connection test to the SLD data supplier I get the following error:

    Operation failed! Failed to collect SLD data. Software caused connection abort: socket write error.

    I'm not sure if the problem is that my administrator account does not have enough / the correct access or something else is going on. Has anyone seen / solved this error before with NW2004S?

    Any assistance is greatly appreciated.

    many thanks,

    Julian

    DB:2.68:Sld Locked In Display Only Mode Nw2004s Install- Socket Write Error d3


    A bit more info on the exact J2EE 640 WAS version:

    Kernel version: 7.00 (SP4)

    MaxDB kernel 7.6 00 Build 009

    Permanent Licence to expire in 31/12/9999

  • RELEVANCY SCORE 2.68

    DB:2.68:[Solved] Install-Info Problem mp



    when I upgrade my system, I saw some errors:
    error: command failed to execute correctly

    DB:2.68:[Solved] Install-Info Problem mp


    I think it similar with https://bbs.archlinux.org/viewtopic.php?pid=673587, but the solution doesnt work for me. and it doesnt about a specific package, because when i install the same packages on another arch machine, there is no error

    anyway, here it is:

    package: gnupg2-2.0.17-1-i686.pkg.tar.xz

    install script:
    infodir=/usr/share/info
    filelist=(gnupg.info gnupg.info-1 gnupg.info-2)

    post_install() {
    for file in ${filelist[@]}; do
    install-info $infodir/$file $infodir/dir 2 /dev/null
    done
    }

    post_upgrade() {
    post_install $1
    }

  • RELEVANCY SCORE 2.68

    DB:2.68:[Solved] Systemctl: Failed To Get D-Bus Connection dd



    Fresh install on a brand new laptop using the latest install medium (2012.09.07).

    Whenever I try to use the systemctl command I get the following error message:

    Failed to get D-Bus connection: No connection to service manager.

  • RELEVANCY SCORE 2.68

    DB:2.68:[Solved] Failed To Update Multilib 3j



    Im running the x86_64 version of Arch and Im wanting to install Wine so I added
    [multilib]
    Include = /etc/pacman.d/mirrorlist

    DB:2.68:[Solved] Failed To Update Multilib 3j

    wonder wrote:
    the error is in pacman.conf. paste it.

    looking more closely, you have a typo. error: config file /etc/pacman.d/mirrolist could not be read.

  • RELEVANCY SCORE 2.67

    DB:2.67:Clean Install Vmware View 3.1 j7



    I have installed VMware View 3.1 in my test lab and have done a clean install, the setup is build up with a connection broker and an vCenter/Composer machine. After rolling out the first linked clone with the installed composer i found the following messages in the event viewer of View:

    (Request883)

    Request failed: com.vmware.vdi.ob.tunnelservice.cx: Failed whilst returning

    body: java.io.IOException: Broken pipe

    (Request872)

    Request failed: com.vmware.vdi.ob.tunnelservice.cx: Failed whilst returning

    body: java.io.IOException: Broken pipe

    (Request750)

    Request failed: com.vmware.vdi.ob.tunnelservice.cx: Failed whilst returning

    body: java.io.IOException: Broken pipe

    (Request437)

    Request failed: com.vmware.vdi.ob.tunnelservice.cx: Failed whilst returning

    body: java.net.SocketException: Connection reset by peer: socket write error

    (Request416)

    Request failed: com.vmware.vdi.ob.tunnelservice.cx: Failed whilst returning

    body: java.io.IOException: Broken pipe

    (Request400)

    Request failed: com.vmware.vdi.ob.tunnelservice.cx: Failed whilst returning

    body: java.io.IOException: Broken pipe

    (Request241)

    Request failed: com.vmware.vdi.ob.tunnelservice.cx: Failed whilst returning

    body: java.io.IOException: Broken pipe

    The deployment of the VM went well but i would like to resolve these messages.

    Arjan

    DB:2.67:Clean Install Vmware View 3.1 j7


    Did you tried a SR from VMware Support?

  • RELEVANCY SCORE 2.67

    DB:2.67:[Solved] Systemd-Journald Errors k1



    I set up a MythTV box the other day based on Arch (basically Arch+Openbox+Mythtv) and I get strange errors on shut down. It goes by extremely fast, but what Im able to catch is:
    systemd-journald failed to write entry 25 items

    DB:2.67:[Solved] Systemd-Journald Errors k1

    WonderWoofy wrote:
    I dont know, that is why I posed the possibility of sending an upstream report as a question...

    Have you tried XBMC? I use that and it is pretty great (of course I have no other point of comparison). It also appears to have infrared remote control support (lirc) and also has android remote control application that works quite well (and some nice unofficial ones as well).

  • RELEVANCY SCORE 2.67

    DB:2.67:Vmware Player Install Fails On Windows 2000 Pro - Registry Write Failed mx



    I'm trying to install VMware Player (VMware-player-1.0.0-16981.exe) on Windows 2000 Pro (SP5).

    The install starts and proceeds normally, but stops and presents a dialog box:

    "Setup failed to write data to the registry. Click OK to exit." and rolls back the install when I dismiss the dialog. No further information is provided, and repeating/rebooting gives the same result.

    I'm accepting all the default values on the install, and am logged in as administrator. Any ideas?

    DB:2.67:Vmware Player Install Fails On Windows 2000 Pro - Registry Write Failed mx


    Got it working after changing the registry permissions -- thanks.

    But, in fact, I couldn't get the permissions to be EXACTLY as in the example, so I won't include the permissions I did use below-- I am not at all an expert at the registry. I hesitated a long time before messing with it, and am still a little apprehensive about having broken something down the line (though no sign of that), so I wouldn't recommend anyone else similarly clueless try this. Still, it seems to work without having broken anything else...

  • RELEVANCY SCORE 2.67

    DB:2.67:[Solved] Grub-Install Failed. Installation Is Impossible ja



    The Beginners Guide isnt giving much instruction on how to correct the problem that I am experiencing with grub-install.

    PIII 1GHz laptop, 60GB HD, 1GB DDR, Intel Video Graphic and RTL8188CUS usb wireless

    It was flawless until the very end when I attempted to run grub-install...
    grub-install /dev/sda

    DB:2.67:[Solved] Grub-Install Failed. Installation Is Impossible ja


    Nope. I am talking about the official guide, which recently added umount just a few minutes ago after the Exit section.

  • RELEVANCY SCORE 2.67

    DB:2.67:Kernel Netbook Cant Install fx



    Hello Im installing kernel netbook I used yaourt but it wont install i get this error.Could some one help me thank u.

    linux-3.2/usr/initramfs_data.S: Write failedlinux-3.2/virt/kvm/Kconfig: Write failedlinux-3.2/virt/kvm/assigned-dev.c: Write failedlinux-3.2/virt/kvm/async_pf.c: Write failedlinux-3.2/virt/kvm/async_pf.h: Write failedlinux-3.2/virt/kvm/coalesced_mmio.c: Write failedlinux-3.2/virt/kvm/coalesced_mmio.h: Write failedlinux-3.2/virt/kvm/eventfd.c: Write failedlinux-3.2/virt/kvm/ioapic.c: Write failedlinux-3.2/virt/kvm/ioapic.h: Write failedlinux-3.2/virt/kvm/iodev.h: Write failedlinux-3.2/virt/kvm/iommu.c: Write failedlinux-3.2/virt/kvm/irq_comm.c: Write failedlinux-3.2/virt/kvm/kvm_main.c: Write failedbsdtar: Error exit delayed from previous errors.== ERROR: Failed to extract linux-3.2.tar.bz2 Aborting...== ERROR: Makepkg was unable to build kernel-netbook.== Restart building kernel-netbook ? [y/N]== ---------------------------------------== == WARNING: Following packages have not been installed: kernel-netbook

    DB:2.67:Kernel Netbook Cant Install fx


    Good to hear its working now.

    Dont forget to mark your thread as [SOLVED].

  • RELEVANCY SCORE 2.67

    DB:2.67:[Solved]Logitechmediaserver Makepkg Issues dp



    I use Arch setup on a 4 GB USB Flash drive as the OS to manage a 4 HDD 3 TB RAID 10 setup as a NAS. Whew... lots to spit out there.

    At any rate for her birthday the significant other got a Squeezebox alarm clock. Its a pretty nice unit even though I really wish it would play nicely with all of the Airplay devices we have setup for music throughout the house.

    To support the new device Im trying to install logitechmediaserver from the AUR but Im getting errors when I run makepkg.

    I dont have any other users on the system so Im running makepkg --asroot from a build directory in roots home directory. I know not supposed to use root.. Im lazy

    Everytime makepkg gets to the unzip part I start getting a bunch of Cant create files or Write failed errors and makepkg fails with Failed to extract.

    I dont believe this is an issue with makepkg or the package but Im wondering if maybe Im hitting some permissions issues or space issues.

    My root partition according to df is full. Does makepkg write files to the root directory? Do I need to slim down my install? Its currently at 2.6 GB.

    Just confused whats going on and need a nudge in the right direction.

    Thanks!

    Last edited by bronco21016 (2012-12-20 03:46:56)

    DB:2.67:[Solved]Logitechmediaserver Makepkg Issues dp

    tomk wrote:
    General tip - if you want to tell us about error messages, post the complete exact verbatim output, not your summary.

  • RELEVANCY SCORE 2.67

    DB:2.67:Install Acomba On My Net N900 Central - 2tb Failed 73



    Hello,

    Install of Acomba on My Net N900 Central - 2TB failed due to a problem of acces rights for the WD share (user and password configuration).

    There is no problem with the share himself, I can write, read and delete on the share.

    Is this normal?

    Thanks,

    V

    DB:2.67:Install Acomba On My Net N900 Central - 2tb Failed 73


    Hello and welcome,

    Have you tried creating a new share? Also check theAcomba manual to see if the option to install to a network folder is supported.




    Click the Kudos star on the left to say thank you for helpful posts. And be sure to come back to click the 'Accept as Solution' button for the post that solved your issue. This may help someone else.

  • RELEVANCY SCORE 2.66

    DB:2.66:Pptp Fails (Mppe Required But Keys Are Not Available. Possible Plugin Problem) xd



    Edgerouter Pro on 1.4.1

    Trying to setup PPTP to a known working radius server. Plain install with our basic config. When I connect I get the following error.

    Apr 2 13:38:30 edgerouter pppd[19204]: pppd 2.4.4 started by root, uid 0
    Apr 2 13:38:30 edgerouter pppd[19204]: Connect: ppp0 -- /dev/pts/1
    Apr 2 13:38:30 edgerouter zebra[538]: interface ppp0 index 20 POINTOPOINT,NOARP,MULTICAST added.
    Apr 2 13:38:30 edgerouter pppd[19204]: MPPE required, but keys are not available. Possible plugin problem?
    Apr 2 13:38:30 edgerouter pppd[19204]: Connection terminated: no multilink.
    Apr 2 13:38:30 edgerouter zebra[538]: interface ppp0 index 20 deleted.
    Apr 2 13:38:30 edgerouter pptpd[19203]: GRE: read(fd=6,buffer=4215fc,len=8196) from PTY failed: status = -1 error = Input/output error, usually caused by unexpected termination of pppd, check option syntax and pppd logs
    Apr 2 13:38:30 edgerouter pptpd[19203]: CTRL: PTY read or GRE write failed (pty,gre)=(6,7)
    Apr 2 13:38:30 edgerouter pptpd[19203]: CTRL: Couldn't write packet to client.
    Apr 2 13:38:30 edgerouter pptpd[19203]: CTRL: Couldn't write packet to client.
    Apr 2 13:38:30 edgerouter kernel: net_ratelimit: 42 callbacks suppressed







    Solved!
    Go to Solution.

    DB:2.66:Pptp Fails (Mppe Required But Keys Are Not Available. Possible Plugin Problem) xd

    I ended up removing the radius support from /etc/pptpd.conf and using /etc/ppp/chap-secrets for authentication until I can work out the issues with our OSX based radius server. Obviously this is not ideal because the passwords are all stored in plain text but at least I can turn encryption back on our iPhones.

  • RELEVANCY SCORE 2.66

    DB:2.66:Failed To Write /Etc/Fstab: File System Is Read-Only [Solved] xa



    Hello,

    I just finished installing arch with Archboot on my SSD. Used GPT Table and EXT4 selected base package and let the installer do his thing.After everything was finished I logged into root with my new installation and wanted to remove the ssd option from /etc/fstab becauseit cant handle it on boot but Ive seen other people use this option. When I try to save changes it fails because everythinig is read-only.What happend?

    Regards,

    blackout23

    EDIT: First I used the net install which installed linux 3.4.2. After having this problem I formatted everything and usedthe CD snapshot which installed linux 3.2 something but ended up with the same problem. Though it had somethingto do with the latest news about manual intervention but it should not have been a problem with the older snapshot.

    Last edited by blackout23 (2012-06-15 13:43:18)

    DB:2.66:Failed To Write /Etc/Fstab: File System Is Read-Only [Solved] xa


    Yes fixed it with your suggestions even tough it took awefully long. I remember having to create entropy maybe 6 month ago for the same reason but last time it actually said Collecting Entropy.. in the terminal when I did it. Also it was easier because I had a full working desktop back then with daemons and everything running so it did it almost by itself, but after a fresh install the is basically nothing that will create entropy for you as it seems.

  • RELEVANCY SCORE 2.66

    DB:2.66:Cannot Write To File s3


    Receive the following error message when I try to run a setup file.
    Extracting to C:\USERS\B\APPDATA\LOCAL\TEMP\install\
    Use Path: yes Overlay Files: yes
    Extracting setup.exe
    *** Unable to set the file's timestamp(10/12/2011 7:14 PM).
    Could not set file attributes (2).
    Error: unable to write to C:\USERS\B\APPDATA\LOCAL\TEMP\install\setup.exe.
    Severe Error: Write operation failed.

    DB:2.66:Cannot Write To File s3

    Hi,

    I suggest you right click the setup file and select Run as administrator
    to check the result.

    In addition, you can also check whether you have write access to this directory.

    More reference:
    What are permissions?

    Hope this helps

    Vincent Wang
    TechNet Community Support

  • RELEVANCY SCORE 2.66

    DB:2.66: Can't Install Windows 7 On My Satellite L305d sm


    I have Toshiba Satellite L305D and I am trying to install windows 7.

    The computer starts the installation and after it restart itself once and trying to enter to the windows he failed and write missing driver: \windows\system32\drivers\lsi_fc.sys .

    I try to install all the version of windows and everyway impossible and I can’t install it.

    I can install WXP without any problem.

  • RELEVANCY SCORE 2.66

    DB:2.66:Fonts Installation Problem (Solved) jd



    whenever i install fonts pacman -S xorg-fonts75dpi i get this error:

    /usr/share/fonts/encodings/large: failed to write cache/usr/share/fonts/util: failed to write cache

    Google-ing solved the problem:

    http://www.mail-archive.com/debian-bugs … 66900.html

    it was reported as a bug: http://bugs.archlinux.org/task/6024

    i am Arch newbie, so i dont know how to file the solution for a bug. if you know then please do it.

    DB:2.66:Fonts Installation Problem (Solved) jd


    Thank you so much for posting this. I was having the same problem, your resolution fixed me right up.

  • RELEVANCY SCORE 2.66

    DB:2.66:[Solved] Problem With Post_Upgrade And .Install km



    Pacman upgrade today wont update any packages, downloads each package but has the same warning and error message with each package, not actually installing it, but updating its database record that it is installed.

    warning: warning given when extracting .INSTALL (Write failed)upgrading package xxxxx [##########] 100%sh: post_upgrade: command not founderror: command failed to execute correctly

    After the packages are already downloaded, manually installing them with pacman -U works.

    Now Im getting no space left on device /tmp. But everything is all on one partition, cleaning out /tmp may correct it, there is an entry in /etc/fstab for tmpfs. Do I really need the tmpfs entry?

    Last edited by nomorewindows (2012-02-20 22:23:05)

    DB:2.66:[Solved] Problem With Post_Upgrade And .Install km


    If you consider the issue fixed, please remember to mark the thread as solved.

  • RELEVANCY SCORE 2.65

    DB:2.65:Pc Suite 7 Won't Install kz


    Hi,
    I have tried to install PC suite 7 from disc download but, I keep getting failed message.
    The message states " Instillation operation failed. The instillation is forbidden by system policy. Contact your system administrator". I am on a home computer with windows XP home. I have administrator rights on this PC. Any help would be greatly appreciated.






    Solved!
    Go to Solution.

    DB:2.65:Pc Suite 7 Won't Install kz

    Brought new PC!
    Got fed up waiting for a solution.
    I can now install software but, sync won't work!

  • RELEVANCY SCORE 2.64

    DB:2.64:Install Failed 88


    When Upgrading to OS X Mavericks the install app throw a error. (I don't write it down because I did not think it was serious).I allowed the install app to send it to apple.But now my mac book is just sitting their doing nothing. Should I reboot? Leave it on? What do I do?

    DB:2.64:Install Failed 88

    When Upgrading to OS X Mavericks the install app throw a error. (I don't write it down because I did not think it was serious).I allowed the install app to send it to apple.But now my mac book is just sitting their doing nothing. Should I reboot? Leave it on? What do I do?

  • RELEVANCY SCORE 2.64

    DB:2.64:8830 Failed Install 73


    Tried to update 8830 software per Verizon Store Tech suggestion....after mucho time, Failed install message with no options offered. Phone now dead in the water with little box symbol on white screen...phone PIN no longer recognized when plugged into computer USB. HELP!






    Solved!
    Go to Solution.

    DB:2.64:8830 Failed Install 73

    Resolved by Verizon Store replacing phone with new "refurbished" model...we'll see what happens next time!

  • RELEVANCY SCORE 2.64

    DB:2.64:Unable To Generate The Cores - Unprecedented Error a9



    I am using ISE 14.6 in Windows 7, 64-bit machine. I am trying to create a memory IP core. But I am getting this irritating error:

    ERROR:sim - Cannot write to xst.scrERROR:sim - Failed to output eJava for com.xilinx.ip.dist_mem_gen_v7_2.xst_vhd_scrStarted : "Launching ISE Text Editor to edit corrn_storage.v".ERROR:sim - Failed to deliver EJava file(s)ERROR:sim - Failed executing Tcl generator.ERROR:sim - Failed to generate 'corrn_val_RAM'. Failed executing Tcl generator.

    I saw a similar problem elsewhere:

    http://forums.xilinx.com/t5/Design-Tools-Others/Un​able-to-Generate-the-Cores-unprecedented-error/m-p​/256014#M3355

    I tried all those methods, but the error was still persisting. I thought that it may be a problem with 14.6, so I tried installing 14.7. But I found that it is impossible to install ISE 14.7 (about this in another post). So I reinstalled 14.6. After reinstalling, the error disappeared today morning, but it has resurfaced again when I am trying to create another core.

    Can someone please help me with this.

    regards,

    rajesh







    Solved!
    Go to Solution.

    DB:2.64:Unable To Generate The Cores - Unprecedented Error a9


    It was the problem with anti-virus. I disabled "access protection". Then core generation started working normally.

  • RELEVANCY SCORE 2.64

    DB:2.64:Disable Touchpad On E540 And Driver Error sj


    Hey,I want to disable my touchpad, because whenever I write, I click somewhere on the screen.The problem is, there is just no "Ultra Nav" tab in my control panel. It wont even show me any special pointing device in the Devices section, except a PS/2 Mouse. I installed the drivers from the Lenovo Support site, for my Windows 7, but whenever I tried to install the Ultra Nav driver, the window at the end shows that the installation failed on 2 of 3 drivers called "Synaptics (SmbDrv) System" and "Synaptics (SynTP) Mouse". The 3. that seems to be installed correctly is "Synaptics (SynTP) HID Class".So how could this issue be solved?I would like to use the Touchpad to click but the trackpoint to navigate.Thanks!

    DB:2.64:Disable Touchpad On E540 And Driver Error sj

    I had this exact same problem, and it seems to be fixed after I installed .NET framework 4.5.There's nothing in the system requirement about this driver needing .NET framework, but after installing .NET all 3 parts of the driver installed correctly. Hope this helps.

  • RELEVANCY SCORE 2.64

    DB:2.64:Creative Cloud Desktop Failed To Install 9c



    Creative Cloud Desktop failed to install

    DB:2.64:Creative Cloud Desktop Failed To Install 9c


    I went thru my computer file by file and wiped out every line dealling with just the Adobe manager including the CS_PS3 manager and then signed on as administrator to Internet Explorer and it fianlly went to completion after a total of a dozen installation where it got 2/3 the way thru until I got the failed to install message

  • RELEVANCY SCORE 2.64

    DB:2.64:Install-Vmhostpatch Fails z3



    I'm attempting to install a patch that I downloaded and I'm getting different error messages:

    Install-VMHostPatch -VMHost $Host -LocalPath C:\Users\xx\Downloads\ESXi500-201206001.zip
    Error1: WARNING: Failed to download VIB.
    '...\Downloads\ESXi500-201206001\metadata.zip' on host
    '$Host' failed because one or more of the required files cannot be uploaded.
    Upload of file '...\Downloads\ESXi500-201206001\vib20\esx-base\
    VMware_bootbank_esx-base_5.0.0-1.16.721882.vib' failed.
    Error message: Unable to write data to the transport connection:
    An existing connection was forcibly closed by the remote host.
    At line:1 char:1
    + Install-VMHostPatch -VMHost $host -LocalPath

    Error2: WARNING: Failed to download metadata.

    DB:2.64:Install-Vmhostpatch Fails z3


    I don't have vCenter Update Manager installed.

  • RELEVANCY SCORE 2.64

    DB:2.64:Write Back Or Write Through Caching? f7



    What is the difference between write back and write through caching?







    Solved!
    Go to Solution.

    DB:2.64:Write Back Or Write Through Caching? f7


    This is very useful thanks!

    SSD guy, from what I read the performance difference between the two is dependent on your workload.

  • RELEVANCY SCORE 2.64

    DB:2.64:Update 8.1.1 Failed To Install k8


    How do I get this to install ?All the other updates were installed on the same day with out a problem.I have tried some fixes posted on the MS site and none have worked so far.Anyone else have this problem ?I have a z710 with OEM win 8.1 installed.







    Solved!
    Go to Solution.

    DB:2.64:Update 8.1.1 Failed To Install k8

    COMPUTIAC wrote:I finally have the update to install.I used this from the MS site, I must have tried to use it 10 or more times before and it did not work.But for some reason this time it did;http://www.microsoft.com/en-us/download/details.as​px?id=42335Thank's for your help.So you think its magic?

  • RELEVANCY SCORE 2.64

    DB:2.64:Installation Failed After Hard Reset m1


    i have a nokia 700
    i have done a hared reset recently after that i cant install somethings from ovi
    after it is downloaded it says installation failed
    thank you






    Solved!
    Go to Solution.

    DB:2.64:Installation Failed After Hard Reset m1


    A Nokia Care point would carry out a three key depressed power on reset to erase user data from both C:\ and E:\ and then completely re-install device firmware, which is much more profound than option to re-install existing device software within Nokia Suite.

    You don't mention whether your 700 is still covered by Nokia warranty.





    Happy to have helped forum in a small way with a Support Ratio = 37.0

  • RELEVANCY SCORE 2.64

    DB:2.64:Error When Installing Vs 2012 Update 3 - The Pipe Is Being Closed. 9c


    Hi,
    I'm trying to install VS2012 Update 3 on a brand new fresh Windows 8. I've installed Visual Studio 2012 Premium with no problems, but when I apply Update 3 it fails with:

    Setup Engine
    The pipe is being closed.
    KB2770057
    The pipe is being closed.
    Windows App Certification Kit x64 Patch
    User cancelled installation.
    I've tried uninstalling, rebooting etc., but with the same result.
    Can anyone give me a clue to what is wrong?
    Some of the log file is attached below:

    [0C68:017C][2013-07-04T13:33:04]: Prompt for source of package: WinACK_native_x64_en, payload: WinACK_native_x64_en, path: C:\Users\caj\AppData\Local\Microsoft\Windows\Temporary Internet Files\Content.IE5\020TT3LT\packages\WinACK\Windows App Certification Kit Native Components-x64_en-us.msp
    [0C68:017C][2013-07-04T13:33:04]: MUX: Next Source: Web, Attempted: 1, Limit:3
    [0C68:017C][2013-07-04T13:33:04]: MUX: Source retrieved: Web
    [0C68:017C][2013-07-04T13:33:04]: MUX: Package:WinACK_native_x64_en, PayloadId:WinACK_native_x64_en Url: http://go.microsoft.com/fwlink/?LinkId=302996clcid=0x409, Attempting count: 1
    [0C68:017C][2013-07-04T13:33:04]: MUX: Existing last unconfirmed source: Web
    [0C68:017C][2013-07-04T13:33:04]: Acquiring package: WinACK_native_x64_en, payload: WinACK_native_x64_en, download from: http://go.microsoft.com/fwlink/?LinkId=302996clcid=0x409
    [0414:0C5C][2013-07-04T13:33:05]: Error 0x800b0003: Failed to get signer chain from authenticode certificate.
    [0C68:017C][2013-07-04T13:33:06]: MUX: Source confirmed
    [0C68:0FE0][2013-07-04T13:33:06]: MUX: Installation size in bytes for package: msp_kb2770057 MaxAppDrive: 0 MaxSysDrive: 130510848 AppDrive: 0 SysDrive: 130510848
    [0C68:017C][2013-07-04T13:33:06]: Prompt for source of package: WinACK_x64_x86_en, payload: WinACK_x64_x86_en, path: C:\Users\caj\AppData\Local\Microsoft\Windows\Temporary Internet Files\Content.IE5\020TT3LT\packages\WinACK\Windows App Certification Kit x64-x86_en-us.msp
    [0C68:0FE0][2013-07-04T13:33:06]: MUX: Return Code:0x0 Msi Messages:0 Result Detail:InstallFiles Restart:None
    [0C68:0FE0][2013-07-04T13:33:06]: MUX: Reset execution Result
    [0C68:0FE0][2013-07-04T13:33:06]: MUX: Reset Result
    [0C68:017C][2013-07-04T13:33:06]: MUX: Next Source: Web, Attempted: 1, Limit:3
    [0C68:017C][2013-07-04T13:33:06]: MUX: Source retrieved: Web
    [0C68:0FE0][2013-07-04T13:33:06]: Applied execute package: msp_kb2770057, result: 0x0, restart: None
    [0C68:017C][2013-07-04T13:33:06]: MUX: Package:WinACK_x64_x86_en, PayloadId:WinACK_x64_x86_en Url: http://go.microsoft.com/fwlink/?LinkId=302998clcid=0x409, Attempting count: 1
    [0C68:017C][2013-07-04T13:33:06]: MUX: Existing last unconfirmed source: Web
    [0C68:017C][2013-07-04T13:33:06]: Acquiring package: WinACK_x64_x86_en, payload: WinACK_x64_x86_en, download from: http://go.microsoft.com/fwlink/?LinkId=302998clcid=0x409
    [0C68:0FE0][2013-07-04T13:33:06]: Error 0x800700e8: Failed to write message type to pipe.
    [0C68:0FE0][2013-07-04T13:33:06]: Error 0x800700e8: Failed to write send message to pipe.
    [0C68:0FE0][2013-07-04T13:33:06]: Error 0x800700e8: Failed to send BURN_ELEVATION_MESSAGE_TYPE_EXECUTE_MSP_PACKAGE message to per-machine process.
    [0C68:0FE0][2013-07-04T13:33:06]: Error 0x800700e8: Failed to configure per-machine MSP package.
    [0C68:0FE0][2013-07-04T13:33:06]: MUX: Installation size in bytes for package: msp_kb2770057 MaxAppDrive: 0 MaxSysDrive: 0 AppDrive: 0 SysDrive: 0
    [0C68:0FE0][2013-07-04T13:33:06]: MUX: Return Code:0x800700E8 Msi Messages:0 Result Detail:0 Restart:None
    [0C68:0FE0][2013-07-04T13:33:06]: MUX: Set Result: Return Code=-2147024664 (0x800700E8), Error Message=, Result Detail=, Vital=False, Package Action=Install, Package Id=msp_kb2770057
    [0C68:0FE0][2013-07-04T13:33:06]: Applied non-vital package: msp_kb2770057, encountered error: 0x800700e8. Continuing...
    [0C68:0FE0][2013-07-04T13:33:06]: Error 0x800700e8: Failed to write message type to pipe.
    [0C68:0FE0][2013-07-04T13:33:06]: Error 0x800700e8: Failed to write send message to pipe.
    [0C68:0FE0][2013-07-04T13:33:06]: Error 0x800700e8: Failed to send BURN_ELEVATION_MESSAGE_TYPE_EXECUTE_DEPENDENCY message to per-machine process.
    [0C68:0FE0][2013-07-04T13:33:06]: Error 0x800700e8: Failed to register the dependency on per-machine package.
    [0C68:0FE0][2013-07-04T13:33:06]: Error 0x800700e8: Failed to execute dependency action.
    [0C68:0FE0][2013-07-04T13:33:06]: Error 0x800700e8: Failed to write message type to pipe.
    [0C68:0FE0][2013-07-04T13:33:06]: Error 0x800700e8: Failed to write send message to pipe.
    [0C68:0FE0][2013-07-04T13:33:06]: Error 0x800700e8: Failed to send BURN_ELEVATION_MESSAGE_TYPE_EXECUTE_DEPENDENCY message to per-machine process.
    [0C68:0FE0][2013-07-04T13:33:06]: Error 0x800700e8: Failed to register the dependency on per-machine package.
    [0C68:0FE0][2013-07-04T13:33:06]: Error 0x800700e8: Failed to write message type to pipe.
    [0C68:0FE0][2013-07-04T13:33:06]: Error 0x800700e8: Failed to write send message to pipe.
    [0C68:0FE0][2013-07-04T13:33:06]: Error 0x800700e8: Failed to send BURN_ELEVATION_MESSAGE_TYPE_EXECUTE_DEPENDENCY message to per-machine process.
    [0C68:0FE0][2013-07-04T13:33:06]: Error 0x800700e8: Failed to register the dependency on per-machine package.
    [0C68:017C][2013-07-04T13:33:07]: Error 0x80070642: UX aborted on download progress.
    [0C68:017C][2013-07-04T13:33:07]: Error 0x80070642: UX aborted on cache progress.
    [0C68:017C][2013-07-04T13:33:07]: Error 0x80070642: Failed while reading from internet and writing to: C:\Users\XXXX\AppData\Local\Temp\{29828f33-4679-462a-8c98-1c3507678922}\WinACK_x64_x86_en
    [0C68:017C][2013-07-04T13:33:07]: Error 0x80070642: Failed to download URL: http://go.microsoft.com/fwlink/?LinkId=302998clcid=0x409
    [0C68:017C][2013-07-04T13:33:07]: Error 0x80070642: Failed attempt to download URL: 'http://go.microsoft.com/fwlink/?LinkId=302998clcid=0x409' to: 'C:\Users\XXXX\AppData\Local\Temp\{29828f33-4679-462a-8c98-1c3507678922}\WinACK_x64_x86_en'
    [0C68:017C][2013-07-04T13:33:07]: MUX: Set Result: Return Code=-2147023294 (0x80070642), Error Message=, Result Detail=, Vital=False, Package Action=Download_WinInet, Package Id=WinACK_x64_x86_en
    [0C68:017C][2013-07-04T13:33:07]: Error 0x80070642: Failed to acquire payload from: 'http://go.microsoft.com/fwlink/?LinkId=302998clcid=0x409' to working path: 'C:\Users\XXX\AppData\Local\Temp\{29828f33-4679-462a-8c98-1c3507678922}\WinACK_x64_x86_en'
    [0C68:017C][2013-07-04T13:33:07]: Failed to acquire payload: WinACK_x64_x86_en to working path: C:\Users\XXXX\AppData\Local\Temp\{29828f33-4679-462a-8c98-1c3507678922}\WinACK_x64_x86_en, error: 0x80070642.
    [0C68:017C][2013-07-04T13:33:07]: Error 0x800700e8: Failed to write message type to pipe.
    [0C68:017C][2013-07-04T13:33:07]: Error 0x800700e8: Failed to write send message to pipe.
    [0C68:017C][2013-07-04T13:33:07]: Error 0x800700e8: Failed to send BURN_ELEVATION_MESSAGE_TYPE_CLEAN_PACKAGE message to per-machine process.
    [0C68:017C][2013-07-04T13:33:07]: Error 0x800700e8: Failed to write message type to pipe.
    [0C68:017C][2013-07-04T13:33:07]: Error 0x800700e8: Failed to write send message to pipe.
    [0C68:017C][2013-07-04T13:33:07]: Error 0x800700e8: Failed to send BURN_ELEVATION_MESSAGE_TYPE_CLEAN_PACKAGE message to per-machine process.
    [0C68:017C][2013-07-04T13:33:07]: Error 0x800700e8: Failed to write message type to pipe.
    [0C68:017C][2013-07-04T13:33:07]: Error 0x800700e8: Failed to write send message to pipe.
    [0C68:017C][2013-07-04T13:33:07]: Error 0x800700e8: Failed to send BURN_ELEVATION_MESSAGE_TYPE_CLEAN_PACKAGE message to per-machine process.
    [0C68:017C][2013-07-04T13:33:07]: Error 0x800700e8: Failed to write message type to pipe.
    [0C68:017C][2013-07-04T13:33:07]: Error 0x800700e8: Failed to write send message to pipe.
    [0C68:017C][2013-07-04T13:33:07]: Error 0x800700e8: Failed to send BURN_ELEVATION_MESSAGE_TYPE_CLEAN_PACKAGE message to per-machine process.
    [0C68:017C][2013-07-04T13:33:07]: Error 0x800700e8: Failed to write message type to pipe.
    [0C68:017C][2013-07-04T13:33:07]: Error 0x800700e8: Failed to write send message to pipe.
    [0C68:017C][2013-07-04T13:33:07]: Error 0x800700e8: Failed to send BURN_ELEVATION_MESSAGE_TYPE_CLEAN_PACKAGE message to per-machine process.
    [0C68:017C][2013-07-04T13:33:07]: Error 0x800700e8: Failed to write message type to pipe.
    [0C68:017C][2013-07-04T13:33:07]: Error 0x800700e8: Failed to write send message to pipe.
    [0C68:017C][2013-07-04T13:33:07]: Error 0x800700e8: Failed to send BURN_ELEVATION_MESSAGE_TYPE_CLEAN_PACKAGE message to per-machine process.
    [0C68:017C][2013-07-04T13:33:07]: Error 0x800700e8: Failed to write message type to pipe.
    [0C68:017C][2013-07-04T13:33:07]: Error 0x800700e8: Failed to write send message to pipe.
    [0C68:017C][2013-07-04T13:33:07]: Error 0x800700e8: Failed to send BURN_ELEVATION_MESSAGE_TYPE_CLEAN_PACKAGE message to per-machine process.
    [0C68:017C][2013-07-04T13:33:07]: Error 0x800700e8: Failed to write message type to pipe.
    [0C68:017C][2013-07-04T13:33:07]: Error 0x800700e8: Failed to write send message to pipe.
    [0C68:017C][2013-07-04T13:33:07]: Error 0x800700e8: Failed to send BURN_ELEVATION_MESSAGE_TYPE_CLEAN_PACKAGE message to per-machine process.
    [0C68:017C][2013-07-04T13:33:07]: Error 0x800700e8: Failed to write message type to pipe.
    [0C68:017C][2013-07-04T13:33:07]: Error 0x800700e8: Failed to write send message to pipe.
    [0C68:017C][2013-07-04T13:33:07]: Error 0x800700e8: Failed to send BURN_ELEVATION_MESSAGE_TYPE_CLEAN_PACKAGE message to per-machine process.
    [0C68:017C][2013-07-04T13:33:07]: Error 0x800700e8: Failed to write message type to pipe.
    [0C68:017C][2013-07-04T13:33:07]: Error 0x800700e8: Failed to write send message to pipe.
    [0C68:017C][2013-07-04T13:33:07]: Error 0x800700e8: Failed to send BURN_ELEVATION_MESSAGE_TYPE_CLEAN_PACKAGE message to per-machine process.
    [0C68:017C][2013-07-04T13:33:07]: Error 0x800700e8: Failed to write message type to pipe.
    [0C68:017C][2013-07-04T13:33:07]: Error 0x800700e8: Failed to write send message to pipe.
    [0C68:017C][2013-07-04T13:33:07]: Error 0x800700e8: Failed to send BURN_ELEVATION_MESSAGE_TYPE_CLEAN_PACKAGE message to per-machine process.
    [0C68:017C][2013-07-04T13:33:07]: Error 0x800700e8: Failed to write message type to pipe.
    [0C68:017C][2013-07-04T13:33:07]: Error 0x800700e8: Failed to write send message to pipe.
    [0C68:017C][2013-07-04T13:33:07]: Error 0x800700e8: Failed to send BURN_ELEVATION_MESSAGE_TYPE_CLEAN_PACKAGE message to per-machine process.
    [0C68:017C][2013-07-04T13:33:07]: Error 0x800700e8: Failed to write message type to pipe.
    [0C68:017C][2013-07-04T13:33:07]: Error 0x800700e8: Failed to write send message to pipe.
    [0C68:017C][2013-07-04T13:33:07]: Error 0x800700e8: Failed to send BURN_ELEVATION_MESSAGE_TYPE_CLEAN_PACKAGE message to per-machine process.
    [0C68:017C][2013-07-04T13:33:07]: Error 0x800700e8: Failed to write message type to pipe.
    [0C68:017C][2013-07-04T13:33:07]: Error 0x800700e8: Failed to write send message to pipe.
    [0C68:017C][2013-07-04T13:33:07]: Error 0x800700e8: Failed to send BURN_ELEVATION_MESSAGE_TYPE_CLEAN_PACKAGE message to per-machine process.
    [0C68:017C][2013-07-04T13:33:07]: Error 0x800700e8: Failed to write message type to pipe.
    [0C68:017C][2013-07-04T13:33:07]: Error 0x800700e8: Failed to write send message to pipe.
    [0C68:017C][2013-07-04T13:33:07]: Error 0x800700e8: Failed to send BURN_ELEVATION_MESSAGE_TYPE_CLEAN_PACKAGE message to per-machine process.
    [0C68:017C][2013-07-04T13:33:07]: Error 0x800700e8: Failed to write message type to pipe.
    [0C68:017C][2013-07-04T13:33:07]: Error 0x800700e8: Failed to write send message to pipe.
    [0C68:017C][2013-07-04T13:33:07]: Error 0x800700e8: Failed to send BURN_ELEVATION_MESSAGE_TYPE_CLEAN_PACKAGE message to per-machine process.
    [0C68:017C][2013-07-04T13:33:07]: Error 0x800700e8: Failed to write message type to pipe.
    [0C68:017C][2013-07-04T13:33:07]: Error 0x800700e8: Failed to write send message to pipe.
    [0C68:017C][2013-07-04T13:33:07]: Error 0x800700e8: Failed to send BURN_ELEVATION_MESSAGE_TYPE_CLEAN_PACKAGE message to per-machine process.
    [0C68:017C][2013-07-04T13:33:07]: Error 0x800700e8: Failed to write message type to pipe.
    [0C68:017C][2013-07-04T13:33:07]: Error 0x800700e8: Failed to write send message to pipe.
    [0C68:017C][2013-07-04T13:33:07]: Error 0x800700e8: Failed to send BURN_ELEVATION_MESSAGE_TYPE_CLEAN_PACKAGE message to per-machine process.
    [0C68:017C][2013-07-04T13:33:07]: Error 0x800700e8: Failed to write message type to pipe.
    [0C68:017C][2013-07-04T13:33:07]: Error 0x800700e8: Failed to write send message to pipe.
    [0C68:017C][2013-07-04T13:33:07]: Error 0x800700e8: Failed to send BURN_ELEVATION_MESSAGE_TYPE_CLEAN_PACKAGE message to per-machine process.
    [0C68:017C][2013-07-04T13:33:07]: Error 0x800700e8: Failed to write message type to pipe.
    [0C68:017C][2013-07-04T13:33:07]: Error 0x800700e8: Failed to write send message to pipe.
    [0C68:017C][2013-07-04T13:33:07]: Error 0x800700e8: Failed to send BURN_ELEVATION_MESSAGE_TYPE_CLEAN_PACKAGE message to per-machine process.
    [0C68:017C][2013-07-04T13:33:07]: Error 0x800700e8: Failed to write message type to pipe.
    [0C68:017C][2013-07-04T13:33:07]: Error 0x800700e8: Failed to write send message to pipe.
    [0C68:017C][2013-07-04T13:33:07]: Error 0x800700e8: Failed to send BURN_ELEVATION_MESSAGE_TYPE_CLEAN_PACKAGE message to per-machine process.
    [0C68:017C][2013-07-04T13:33:07]: Error 0x800700e8: Failed to write message type to pipe.
    [0C68:017C][2013-07-04T13:33:07]: Error 0x800700e8: Failed to write send message to pipe.
    [0C68:017C][2013-07-04T13:33:07]: Error 0x800700e8: Failed to send BURN_ELEVATION_MESSAGE_TYPE_CLEAN_PACKAGE message to per-machine process.
    [0C68:017C][2013-07-04T13:33:07]: Error 0x800700e8: Failed to write message type to pipe.
    [0C68:017C][2013-07-04T13:33:07]: Error 0x800700e8: Failed to write send message to pipe.
    [0C68:017C][2013-07-04T13:33:07]: Error 0x800700e8: Failed to send BURN_ELEVATION_MESSAGE_TYPE_CLEAN_PACKAGE message to per-machine process.
    [0C68:017C][2013-07-04T13:33:07]: Error 0x800700e8: Failed to write message type to pipe.
    [0C68:017C][2013-07-04T13:33:07]: Error 0x800700e8: Failed to write send message to pipe.
    [0C68:017C][2013-07-04T13:33:07]: Error 0x800700e8: Failed to send BURN_ELEVATION_MESSAGE_TYPE_CLEAN_PACKAGE message to per-machine process.
    [0C68:017C][2013-07-04T13:33:07]: Error 0x800700e8: Failed to write message type to pipe.
    [0C68:017C][2013-07-04T13:33:07]: Error 0x800700e8: Failed to write send message to pipe.
    [0C68:017C][2013-07-04T13:33:07]: Error 0x800700e8: Failed to send BURN_ELEVATION_MESSAGE_TYPE_CACHE_CLEANUP message to per-machine process.
    [0C68:0FE0][2013-07-04T13:33:07]: Error 0x800700e8: Failed to write message type to pipe.
    [0C68:0FE0][2013-07-04T13:33:07]: Error 0x800700e8: Failed to write send message to pipe.
    [0C68:0FE0][2013-07-04T13:33:07]: Error 0x800700e8: Failed to send message to per-machine process.
    [0C68:0FE0][2013-07-04T13:33:07]: Error 0x800700e8: Failed to end session in per-machine process.
    [0C68:0FE0][2013-07-04T13:33:07]: Error 0x800700e8: Failed to write message type to pipe.
    [0C68:0FE0][2013-07-04T13:33:07]: Error 0x800700e8: Failed to write send message to pipe.
    [0C68:0FE0][2013-07-04T13:33:07]: Error 0x800700e8: Failed to send message to per-machine process.
    [0C68:0FE0][2013-07-04T13:33:07]: MUX: Apply Complete: Disk Space Used in bytes for Installation: MaxAppDrive: 0 MaxSysDrive: 532635648 AppDrive: 0 SysDrive: 544120832
    [0C68:0FE0][2013-07-04T13:33:07]: MUX: Free Disk Space after install: SystemDrive C:\ 133321719808 bytes AppDrive C:\ 133321719808 bytes
    [0C68:0FE0][2013-07-04T13:33:07]: MUX: Set Result: Return Code=-2147024664 (0x800700E8), Error Message=, Result Detail=, Vital=True, Package Action=Install, Package Id=Apply Failure
    [0C68:0FE0][2013-07-04T13:33:07]: MUX: Go to Finished page.
    [0C68:0FE0][2013-07-04T13:33:07]: Apply complete, result: 0x800700e8, restart: None, ba requested restart: No

    Thanks!
    Casper

    DB:2.64:Error When Installing Vs 2012 Update 3 - The Pipe Is Being Closed. 9c

    Please try the steps mentioned in this blog post:
    http://blogs.msdn.com/b/smondal/archive/2013/09/23/the-pipe-is-being-closed.aspx

  • RELEVANCY SCORE 2.64

    DB:2.64:[Solved]Syslinux Install Failed With Btrfs Subvolume /Boot 3z



    I have a MBR 1GB device with Windows and brand new Arch on it.

    After installing base and base-devel, partitioning devices, Ive tried to install Syslinux.

    But
    # syslinux-install_update -iam
    Syslinux BIOS install successful
    FAILED to Set the boot flag on /dev/sda6[/bootfs]
    # fdisk -l
    ...
    /dev/sda6 * 211816845 311773454 49978305 83 Linux
    ...

    DB:2.64:[Solved]Syslinux Install Failed With Btrfs Subvolume /Boot 3z


    I just switch to ext4, and everything is fine now. Thank you guys.

    Last edited by yhylord (2014-07-21 06:44:16)

  • RELEVANCY SCORE 2.63

    DB:2.63:Can't Install Latest Skype Version: Error 1603 j1



    Hi, i am getting spype failed error code 1603 while it can't remove 6.18 version of Skype. I am currently using 6.11 version, Any ideas how to install new version? Can't sign on. Thank you.







    Solved!
    Go to Solution.

  • RELEVANCY SCORE 2.63

    DB:2.63:Install Failed jp


    Please disregard this post.Message Edited by jmcbee on 03-13-2009 08:07 AM



    CLA, CLED, CTD,CPI, LabVIEW ChampionPlatinum Alliance PartnerSenior EngineerUsing LV 2013, 2012Don't forget Kudos for Good Answers, and Mark a solution if your problem is solved.

    DB:2.63:Install Failed jp

    OK



    Steve BirdCulverson Software - Elegant software that is a pleasure to use.Culverson.com
    Blog for (mostly LabVIEW) programmers: Tips And Tricks

  • RELEVANCY SCORE 2.63

    DB:2.63:[Solved]Uefi Boot Gives Failed To Install Override Security Policy 7x



    Hi, newb here who has hit a dead end quite early in the process of installing Arch.

    When trying to boot Arch into EFI mode, it says
    failed to install override security policy

    DB:2.63:[Solved]Uefi Boot Gives Failed To Install Override Security Policy 7x


    Eh, I think I have experienced two different errors here. I managed to get into the menu by switching bootx64.efi for loader.efi, but selecting Arch from the menu gives me a blank screen. I think this is yet another bug, so I opened a different topic. https://bbs.archlinux.org/viewtopic.php … 2#p1510402This thread is marked as solved.

    Last edited by 0x33 (2015-03-11 17:36:10)

  • RELEVANCY SCORE 2.63

    DB:2.63:Workstation V7.1 To V8, 32 Bit Failed To Install dk



    purchased workstation v8 upgrade. tried to install get install error 5 with message "Failed to write to the requested registry value. Value: core."

    Tried to reinstall version 7.1 same message. Tried to repair/modify/remove with control panel add/remove programs also failed.

    Now cannot run any images because VMWare will not run. What else can I try?

    DB:2.63:Workstation V7.1 To V8, 32 Bit Failed To Install dk


    thats not a problemIMHO legacy emulation should be used as the Default

  • RELEVANCY SCORE 2.63

    DB:2.63:Windows - Delayed Write Failed 3p


    I replaced the hard drive with a brand new one and did a fresh xp install and am having exactly the same problems

    DB:2.63:Windows - Delayed Write Failed 3p

    I replaced the hard drive with a brand new one and did a fresh xp install and am having exactly the same problems

  • RELEVANCY SCORE 2.63

    DB:2.63:Loss Of Admin Rights - Partially ps


    A strange loss of rights. I am admin on the computer and can install programs after entering my password. Updating installations fail, however. Mac OS upgrades pass.

    I've discovered that it is when the new install has to overwrite an older installation and delete the old version. Initially the pw is accepted and it proceeds to write files. After this it fails with a message quite simply 'installation failed - try again'.
    If I first delete the old version (admin pw there too) then install it works.
    Permissions repair has not solved the problem the only corrections there were to some Java stuff.

    Any ideas how to correct this?

    Tel.

    DB:2.63:Loss Of Admin Rights - Partially ps

    A strange loss of rights. I am admin on the computer and can install programs after entering my password. Updating installations fail, however. Mac OS upgrades pass.

    I've discovered that it is when the new install has to overwrite an older installation and delete the old version. Initially the pw is accepted and it proceeds to write files. After this it fails with a message quite simply 'installation failed - try again'.
    If I first delete the old version (admin pw there too) then install it works.
    Permissions repair has not solved the problem the only corrections there were to some Java stuff.

    Any ideas how to correct this?

    Tel.

  • RELEVANCY SCORE 2.63

    DB:2.63:[Solved] Cannot Change Brightness Or Use Xrandr In Macbook Pro 1a



    Hi, guys, I just install arch linux on macbook pro, but I couldnt change brightness of the screen.

    I tried to write 1 to /sys/class/backlight/acpi_video0/brightness, the file has changed but the brightness did not. There are two directories under /sys/class/backlight, one is acpi_video0 and the other is apple_backlight, but neither worked.

    I tried to use brightness configure in Gnome, it didnt work either.

    The I tried to use xrandr, but it just output this:

    → xrandr 13:11:13xrandr: Failed to get size of gamma for output defaultScreen 0: minimum 1280 x 800, current 1280 x 800, maximum 1280 x 800default connected 1280x800+0+0 0mm x 0mm 1280x800 0.0*

    DB:2.63:[Solved] Cannot Change Brightness Or Use Xrandr In Macbook Pro 1a


    Hi, guys.

    I solved this by reinstall xf86-video-intel. And it works fine.

  • RELEVANCY SCORE 2.63

    DB:2.63:Ssh Write Failed: Broken Pipe [Solved] ks



    Hi everyone,

    I got a problem with sshd, it just wont let me connect after the latest update (this afternoon). Kernel was updated, I rebooted. I have switched off the sshd service: systemctl stop sshd.service, then started it by hand:
    /usr/bin/sshd -Dddd

    DB:2.63:Ssh Write Failed: Broken Pipe [Solved] ks


    Thanks for the fix. This happened to me sometime over the past 2 days on both my machines, strange casue it has been running just fine daily for maybe 18 mnths since my last reinstall.

    fatal: privsep_preauth: preauth child terminated by signal 31

    Your solution worked for me also, i wonder if there is any cons to losing the sandbox? or doesnt it really matter if its not sandbox

  • RELEVANCY SCORE 2.63

    DB:2.63:My Case Windows 8 Installation Had Failed - Solved Finally j9


    Bought Win8Pro upgrade dvd and tried to install it on my Dell with Win7Ultimate and then hit thefamous"Windows 8 installation had failed" msg.

    Had tried many suggestions that I found from the posts here and nothing worked.

    DB:2.63:My Case Windows 8 Installation Had Failed - Solved Finally j9

    Bought Win8Pro upgrade dvd and tried to install it on my Dell with Win7Ultimate and then hit thefamous"Windows 8 installation had failed" msg.

    Had tried many suggestions that I found from the posts here and nothing worked.

  • RELEVANCY SCORE 2.62

    DB:2.62:[Solved] Recipie For Target All-Recursive Failed am



    Hello Arch Forums! Im compiling prboom and alephone. Both give me the same error,

    Makefile:285: recipe for target install-recursive failed

    DB:2.62:[Solved] Recipie For Target All-Recursive Failed am


    Using a pkgbuild means that pacman can manage all of the files, making it easier to remove the software and/or manage updates. Just make sure that the pkgbuild doesnt do any weird stuff and the AUR will prove to be rather useful for installing software.

    Last edited by runical (2015-03-03 19:36:09)

  • RELEVANCY SCORE 2.62

    DB:2.62:Vmware Workstation X64.Msi Failed Could Not Write Value Key \System\Currentcontrolset\Service\Vmware\Performance 8x



    i have this problem when try to install vmware workstation

    vmware workstation x64.msi failed could not write value key \system\currentcontrolset\service\vmware\performance

    i try to install vmware workstation as admin (run as administrator) and not work , i try delete temp file and also not work

    DB:2.62:Vmware Workstation X64.Msi Failed Could Not Write Value Key \System\Currentcontrolset\Service\Vmware\Performance 8x


    i have this problem when try to install vmware workstation

    vmware workstation x64.msi failed could not write value key \system\currentcontrolset\service\vmware\performance

    i try to install vmware workstation as admin (run as administrator) and not work , i try delete temp file and also not work

  • RELEVANCY SCORE 2.62

    DB:2.62:Failed To Write 65536 Bytes In Readfilefromserver ms





    OK i emailed Plesk at got this reply why cs whouldnt install

    Your problem occured due to bug in steam program which is a third-party
    program for Plesk. Steam was trying to use uncompress, but FedoraCore uses gunzip instead if it.
    Please creating a link for uncompress:

    ln -s gunzip /bin/uncompress

    Also, after creating link you should re-install your CS module.

    Ok im going crazy i
    created link
    deleted cs mod
    reinstalled cs mod

    And these are the last 4 lines of code from error i got when i tryed to reinstall
    .......................
    Downloading: /hlds_l\valve\game.ico
    Downloading: /hlds_l\valve\gfx.wad
    Downloading: /hlds_l\valve\halflife.wad
    Failed to write 65536 bytes in ReadFileFromServer
    .......................

    what would cause this error now
    Failed to write 65536 bytes in ReadFileFromServer

    DB:2.62:Failed To Write 65536 Bytes In Readfilefromserver ms




    Heres another error between the tro im going crazy
    ..................................
    Checking bootstrapper version ...
    Updating Installation
    Logging in as csclanaow
    No installation record found at /hlds_l
    Checking/Installing Linux Server Engine version 16
    Failed to open key TopKey\4
    Details: CMultiFieldBlob(pParent,FieldName): Field does not exist
    .................................

  • RELEVANCY SCORE 2.62

    DB:2.62:Installation Failed p1



    Hi!

    I got a installation failed on an app. Yet when I "Try Again..." I get the error "Can't install Installation package not found".

    How do I remove the application from the application list?







    Solved!
    Go to Solution.

    DB:2.62:Installation Failed p1


    I am unable to install a game I purchased. It downloads without any problems, but the installation fails everytime.

    I cannot get anyone to help my. I suspect that it is a setting on my phone.

    Any assistance will be greatly appreciated

  • RELEVANCY SCORE 2.62

    DB:2.62:Vmware Server Install Issue Setup Failed To Write Data To Registry xj



    I am installing VMWare on a copy of XP Pro. When I try to install I get an error message during the install process that states "Setup failed to write data to the registry" during the VMWare Vmperl scripting API Installation phase.

    DB:2.62:Vmware Server Install Issue Setup Failed To Write Data To Registry xj


    Thanks for the answer. The install log in the temp folder was a big help. I changed the permissions on those specific key entries in the registry and that corrected the problem. I had installed VMWare before, a previous edition, on the same PC with a different user account. I think the "ownership" permissions were originally created for that now deleted user account. It didn't display the username, just the SID. But now that I think about it, those registry entries should have been removed when i uninstalled the older version awhile ago.

  • RELEVANCY SCORE 2.61

    DB:2.61:Solved : 10.5 - Itunes Failed To Install f7


    Hello. Im having this problem just now and now I managed to solved it Goto : My Computer -- Unistall All "apple related named" ( I forgot to copy the name ) Uninstall all Apple name. And Try to install it again. It works for me and some of my friends

    DB:2.61:Solved : 10.5 - Itunes Failed To Install f7

    Hello. Im having this problem just now and now I managed to solved it Goto : My Computer -- Unistall All "apple related named" ( I forgot to copy the name ) Uninstall all Apple name. And Try to install it again. It works for me and some of my friends

  • RELEVANCY SCORE 2.61

    DB:2.61:Failed Updates jk


    My updates keep failing to install, but fixit says problem solved!! any ideas to help please

    DB:2.61:Failed Updates jk

    Hello Tommy Oldham.
    First, check the Windows Update log as suggested in the Microsoft Knowledge Base article
    902093. Then try resetting the Windows Update (as indicated in the Microsoft Knowledge Base article
    971058) and run Windows Update again.
    Bye.Luigi Bruno

  • RELEVANCY SCORE 2.61

    DB:2.61:[Solved]Bug-Grub Generate-Archlinux Install pz



    Hello again,

    Today I try to make triple boot but when write this command:
    grub-mkconfig -o /boot/grub/grub.cfg

    DB:2.61:[Solved]Bug-Grub Generate-Archlinux Install pz


    Hello again,

    Today I try to make triple boot but when write this command:
    grub-mkconfig -o /boot/grub/grub.cfg