• RELEVANCY SCORE 3.81

    DB:3.81:Problems Building A Set Of Libraries jf




    Hello,I am trying to build a set of libraries for a 3D visualization package called vtk using VC++ 6.0. I am using a centrino duo xp system with swap space set to 2000 MB. The compiler seems to freeze in attempt to link and build the a library called vtkzlib. At this point the CPU utilization drops to zero. Below is a copy of the compiler output leading up to the freezing point. I am not sure whether this is a vtk or a vc 6.0 issue. Does anyone know what is causing this or can point me in the right direction into solving this problem?Thank you,Daina--------------------Configuration: vtkGraphics - Win32 Debug--------------------Compiling...vtkAppendFilter.cxxvtkAppendPolyData.cxxvtkApproximatingSubdivisionFilter.cxxvtkArrayCalculator.cxxvtkArrowSource.cxxvtkAssignAttribute.cxxvtkAttributeDataToFieldDataFilter.cxxvtkAxes.cxxvtkBandedPolyDataContourFilter.cxxvtkBlankStructuredGrid.cxxvtkBlankStructuredGridWithImage.cxxvtkBoxClipDataSet.cxxvtkBrownianPoints.cxxvtkButterflySubdivisionFilter.cxxvtkButtonSource.cxxvtkBSPCuts.cxxvtkBSPIntersections.cxxvtkCellCenterDepthSort.cxxvtkCellCenters.cxxvtkCellDataToPointData.cxxGenerating Code...Compiling...vtkCellDerivatives.cxxvtkCleanPolyData.cxxvtkClipDataSet.cxxvtkClipPolyData.cxxvtkClipVolume.cxxvtkConeSource.cxxvtkConnectivityFilter.cxxvtkContourFilter.cxxvtkContourGrid.cxxvtkCubeSource.cxxvtkCursor3D.cxxvtkCutter.cxxvtkCurvatures.cxxvtkCylinderSource.cxxvtkDashedStreamLine.cxxvtkDataObjectToDataSetFilter.cxxvtkDataSetSurfaceFilter.cxxvtkDataSetToDataObjectFilter.cxxvtkDataSetTriangleFilter.cxxvtkDecimatePro.cxxGenerating Code...Compiling...vtkDelaunay2D.cxxvtkDelaunay3D.cxxvtkDicer.cxxvtkDiscreteMarchingCubes.cxxvtkDiskSource.cxxvtkEdgePoints.cxxvtkElevationFilter.cxxvtkEllipticalButtonSource.cxxvtkExtractCells.cxxvtkExtractDataOverTime.cxxvtkExtractEdges.cxxvtkExtractGeometry.cxxvtkExtractGrid.cxxvtkExtractPolyDataGeometry.cxxvtkExtractRectilinearGrid.cxxvtkExtractTensorComponents.cxxvtkExtractUnstructuredGrid.cxxvtkExtractVectorComponents.cxxvtkFeatureEdges.cxxvtkFieldDataToAttributeDataFilter.cxxGenerating Code...Compiling...vtkGeometryFilter.cxxvtkGlyph2D.cxxvtkGlyph3D.cxxvtkGlyphSource2D.cxxvtkGraphLayoutFilter.cxxvtkGridSynchronizedTemplates3D.cxxvtkHierarchicalDataSetGeometryFilter.cxxvtkHedgeHog.cxxvtkHierarchicalDataExtractDataSets.cxxvtkHierarchicalDataExtractLevel.cxxvtkHierarchicalDataLevelFilter.cxxvtkHull.cxxvtkHyperStreamline.cxxvtkIdFilter.cxxvtkImageDataGeometryFilter.cxxvtkImageMarchingCubes.cxxvtkImplicitTextureCoords.cxxvtkInterpolateDataSetAttributes.cxxvtkInterpolatingSubdivisionFilter.cxxvtkKdNode.cxxGenerating Code...Compiling...vtkKdTree.cxxvtkLineSource.cxxvtkLinearExtrusionFilter.cxxvtkLinearSubdivisionFilter.cxxvtkLinkEdgels.cxxvtkLoopSubdivisionFilter.cxxvtkMarchingContourFilter.cxxvtkMarchingCubes.cxxvtkMarchingSquares.cxxvtkMaskFields.cxxvtkMaskPoints.cxxvtkMaskPolyData.cxxvtkMassProperties.cxxvtkMergeDataObjectFilter.cxxvtkMergeCells.cxxvtkMergeFields.cxxvtkMergeFilter.cxxvtkMeshQuality.cxxvtkModelMetadata.cxxvtkOBBDicer.cxxGenerating Code...Compiling...vtkOBBTree.cxxvtkOutlineCornerFilter.cxxvtkOutlineCornerSource.cxxvtkOutlineFilter.cxxvtkOutlineSource.cxxvtkParametricFunctionSource.cxxvtkPlaneSource.cxxvtkPlanesIntersection.cxxvtkPlatonicSolidSource.cxxvtkPointDataToCellData.cxxvtkPointsProjectedHull.cxxvtkPointSource.cxxvtkPolyDataConnectivityFilter.cxxvtkPolyDataNormals.cxxvtkPolyDataStreamer.cxxvtkProbeFilter.cxxvtkProgrammableAttributeDataFilter.cxxvtkProgrammableDataObjectSource.cxxvtkProgrammableFilter.cxxvtkProgrammableGlyphFilter.cxxGenerating Code...Compiling...vtkProgrammableSource.cxxvtkProjectedTexture.cxxvtkQuadricClustering.cxxvtkQuadricDecimation.cxxvtkQuantizePolyDataPoints.cxxvtkRearrangeFields.cxxvtkRectangularButtonSource.cxxvtkRectilinearGridClip.cxxvtkRectilinearGridGeometryFilter.cxxvtkRectilinearGridToTetrahedra.cxxvtkRectilinearSynchronizedTemplates.cxxvtkRecursiveDividingCubes.cxxvtkReflectionFilter.cxxvtkRegularPolygonSource.cxxvtkReverseSense.cxxvtkRibbonFilter.cxxvtkRotationalExtrusionFilter.cxxvtkRotationFilter.cxxvtkRuledSurfaceFilter.cxxvtkSelectPolyData.cxxGenerating Code...Compiling...vtkShrinkFilter.cxxvtkShrinkPolyData.cxxvtkSimpleElevationFilter.cxxvtkSliceCubes.cxxvtkSmoothPolyDataFilter.cxxvtkSortDataArray.cxxvtkSpatialRepresentationFilter.cxxvtkSpherePuzzle.cxxvtkSpherePuzzleArrows.cxxvtkSphereSource.cxxvtkSplineFilter.cxxvtkSplitField.cxxvtkStreamLine.cxxvtkStreamPoints.cxxvtkStreamTracer.cxxvtkStreamer.cxxvtkStripper.cxxvtkStructuredGridClip.cxxvtkStructuredGridGeometryFilter.cxxvtkStructuredGridOutlineFilter.cxxGenerating Code...Compiling...vtkStructuredPointsGeometryFilter.cxxvtkSubPixelPositionEdgels.cxxvtkSubdivideTetra.cxxvtkSuperquadricSource.cxxvtkSynchronizedTemplates2D.cxxvtkSynchronizedTemplates3D.cxxvtkSynchronizedTemplatesCutter3D.cxxvtkTensorGlyph.cxxvtkTextSource.cxxvtkTextureMapToCylinder.cxxvtkTextureMapToPlane.cxxvtkTextureMapToSphere.cxxvtkTexturedSphereSource.cxxvtkThreshold.cxxvtkThresholdPoints.cxxvtkThresholdTextureCoords.cxxvtkTransformFilter.cxxvtkTransformPolyDataFilter.cxxvtkTransformTextureCoords.cxxvtkTriangleFilter.cxxGenerating Code...Compiling...vtkTriangularTCoords.cxxvtkTubeFilter.cxxvtkVectorDot.cxxvtkVectorNorm.cxxvtkVisibilitySort.cxxvtkVoxelContoursToSurfaceFilter.cxxvtkWarpLens.cxxvtkWarpScalar.cxxvtkWarpTo.cxxvtkWarpVector.cxxvtkWindowedSincPolyDataFilter.cxxvtkGraphicsInstantiator.cxxGenerating Code...Linking...   Creating library D:\ITK\VTK_binary\bin\Debug/vtkGraphics.lib and object D:\ITK\VTK_binary\bin\Debug/vtkGraphics.exp--------------------Configuration: vtkGenericFiltering - Win32 Debug--------------------Compiling...vtkGenericContourFilter.cxxvtkGenericGeometryFilter.cxxvtkGenericClip.cxxvtkGenericProbeFilter.cxxvtkGenericDataSetTessellator.cxxvtkGenericCutter.cxxvtkGenericGlyph3DFilter.cxxvtkGenericStreamTracer.cxxvtkGenericOutlineFilter.cxxvtkGenericFilteringInstantiator.cxxGenerating Code...Linking...   Creating library D:\ITK\VTK_binary\bin\Debug/vtkGenericFiltering.lib and object D:\ITK\VTK_binary\bin\Debug/vtkGenericFiltering.exp--------------------Configuration: vtkDICOMParser - Win32 Debug--------------------Compiling...DICOMFile.cxxDICOMParser.cxxDICOMAppHelper.cxxGenerating Code...Linking...   Creating library D:\ITK\VTK_binary\bin\Debug/vtkDICOMParser.lib and object D:\ITK\VTK_binary\bin\Debug/vtkDICOMParser.exp--------------------Configuration: vtkzlib - Win32 Debug--------------------Compiling resources...Compiling...adler32.cgzio.cinftrees.cuncompr.ccompress.cinfblock.cinfutil.czutil.ccrc32.cinfcodes.cdeflate.cinffast.cinflate.ctrees.cGenerating Code...Linking...

    DB:3.81:Problems Building A Set Of Libraries jf

    I'm afraid VC6 isn't supported by these forums. For the best possible answers, you should visit the VC newsgroups at http://msdn.microsoft.com/newsgroups.
    Checking by the support forum (if there is such a thing) of the library in question would also be a good idea. Others may have experienced the same issue.

  • RELEVANCY SCORE 3.75

    DB:3.75:Re: Facing Problem While Compiling The Source Code Of Java mk




    Why? If your planning on modifying the code, I don't believe your skills are up to it, if you can't even find your start point.

    DB:3.75:Re: Facing Problem While Compiling The Source Code Of Java mk

    hi ejp...

    Sir, i actually want to find the exact path location in the source code where exactly from which the JDK or VM is loaded.
    For example in the source code of JDK, there are some many C files and their header files and in that the exact code is written i.e from where the JVM and other things are loaded that are related to java.
    I would like to know exactly from which file it is being loaded and run.
    As there are around 4000 files , I could not find in the exact file.
    So i would like to know that file.
    Can I include some other class files from there if possible then How can i do that?

    please help in this .........

  • RELEVANCY SCORE 3.75

    DB:3.75:Re: Help Me Out In This Issue mk


    I am not attempting to unzip anything in my code. This problem only appears from within netbeans, either when compiling or editing (if compiling, I get an error in the compile window, if editing, the application just vanishes).

    DB:3.75:Re: Help Me Out In This Issue mk

    I'm using jdk 1.4.2_02 and am still seeing this problem in NetBeans. Its happened to me about 5 times already today while just editing file.

    Here's the top of my err file:

    An unexpected exception has been detected in native code outside the VM.
    Unexpected Signal : EXCEPTION_ACCESS_VIOLATION (0xc0000005) occurred at PC=0x77F58CAA
    Function=RtlFreeHeap+0x3B2
    Library=C:\WINDOWS\System32\ntdll.dll

    Current Java thread:
    at java.util.zip.ZipFile.getEntry(Native Method)
    at java.util.zip.ZipFile.getEntry(ZipFile.java:146)
    - locked 0x110585d8 (a java.util.jar.JarFile)
    at java.util.jar.JarFile.getEntry(JarFile.java:194)
    at java.util.jar.JarFile.getJarEntry(JarFile.java:181)
    at org.openide.filesystems.JarFileSystem.getEntry(JarFileSystem.java:593)
    - locked 0x10ce54f8 (a java.lang.Object)
    at org.openide.filesystems.JarFileSystem.lastModified(JarFileSystem.java:303)
    at org.openide.filesystems.JarFileSystem$Impl.lastModified(JarFileSystem.java:698)

    HEY SUN!!! fix this!!!

  • RELEVANCY SCORE 3.71

    DB:3.71:Have Problem In Configuring Code For Version 4.5 7s



    Hi

    I am configuring the code 4.5 here the repository is pointing to http://repository.jboss.com/maven2 but this repository is not accessible

    Following error is finding while compiling the code:

    Access denied to http://repository.jboss.com/maven2/org/hyperic/hq/hq-parent/4.5/hq-parent-4.5.pom. Error code 403, Forbidden

    Please can any one suggest solution for the above issue

    Thanks

    Sandeep G

    DB:3.71:Have Problem In Configuring Code For Version 4.5 7s


    Hi

    I am configuring the code 4.5 here the repository is pointing to http://repository.jboss.com/maven2 but this repository is not accessible

    Following error is finding while compiling the code:

    Access denied to http://repository.jboss.com/maven2/org/hyperic/hq/hq-parent/4.5/hq-parent-4.5.pom. Error code 403, Forbidden

    Please can any one suggest solution for the above issue

    Thanks

    Sandeep G

  • RELEVANCY SCORE 3.57

    DB:3.57:Problem With Compilation Of Credentail Provider Using Visual Studio 3z


     
    hi everyone,
     
    i have been working on to write my own credential provider . with the help of sample code provided. But when compiling i am getting errors. the errors are like
    1. cannot open credentialprovide.h, which is a builtin header file.
    2. Icredentialprovider base class not defined
    3.macros like IFACEMETHODIMP, CREDENTAILPROVIDER_FILEDSTATE, etc not defined.

     
    i am guessing some settings or includes to be done in visual studio, which i use for compiling the source code..
    please suggest me whats the problem.
     
     
    thanks and regards
    Narayanaswamy

    DB:3.57:Problem With Compilation Of Credentail Provider Using Visual Studio 3z

     
    hi everyone,
     
    i have been working on to write my own credential provider . with the help of sample code provided. But when compiling i am getting errors. the errors are like
    1. cannot open credentialprovide.h, which is a builtin header file.
    2. Icredentialprovider base class not defined
    3.macros like IFACEMETHODIMP, CREDENTAILPROVIDER_FILEDSTATE, etc not defined.

     
    i am guessing some settings or includes to be done in visual studio, which i use for compiling the source code..
    please suggest me whats the problem.
     
     
    thanks and regards
    Narayanaswamy

  • RELEVANCY SCORE 3.55

    DB:3.55:Compiling Java Byte Codes To Native Code 1j


    Is it possible to compile java byte codes to native code? And
    just in time compiling ? (like with JSP's but to native code)

    Thanks

    DB:3.55:Compiling Java Byte Codes To Native Code 1j

    Modern JVM performs just-in-time (JIT) translation of bytecode sequences to native instructions as a matter of course - they don't (usually) save these to a file, so this is done each time the program is run.

    Search this forum for the other 10,000 times the question of how to create native executables from Java bytecode files has been asked and answered...

    Chuck

  • RELEVANCY SCORE 3.46

    DB:3.46:Problem When Compiling Fpga : Control And Indicator Missingi 7z


    HiI have got a problem when compiling an FPGA application. I added 2 controls and 1 indicator in the code and I compiled my FPGA application. I created a new lvbit file. In my RT application, I load this application and use READ/WRITE Control to affect value to parameters. But the tree new ones doesn't appear in the list!!! I've compliled several times the application and it's always the same!!!Has anybody encountered this? How could I handle with this?Thanks

    DB:3.46:Problem When Compiling Fpga : Control And Indicator Missingi 7z

    Hi jules,NI moderates this forum, Yahoo (probably) only mirrors the forum.



    Best regards,GerdWCLAD, using 2009SP1 + LV2011SP1 + LV2014f1 on WinXP+Win7+cRIOKudos are welcome

  • RELEVANCY SCORE 3.45

    DB:3.45:Jdk Code kj


    How come the ide is compiling the jdk code into my web app?

    DB:3.45:Jdk Code kj

    never mind it was a setting in the preferences..

  • RELEVANCY SCORE 3.44

    DB:3.44:Tool Completed With Exit Code -1073741510 3x


    Hi all, I'm having a problem when I compile any code i have written before .. its giving me this:

    Tool completed with exit code -1073741510

    and its not compiling my new code ..

    can someone tell me whats wrong (this problem appeared suddenly).

    Thanks,
    zeid

    DB:3.44:Tool Completed With Exit Code -1073741510 3x

    Hi all, I'm having a problem when I compile any code i have written before .. its giving me this:

    Tool completed with exit code -1073741510

    and its not compiling my new code ..

    can someone tell me whats wrong (this problem appeared suddenly).

    Thanks,
    zeid

  • RELEVANCY SCORE 3.43

    DB:3.43:Problem With Dsn Name!!! Urgent x1


    I want to run my web application perfectly without compiling the code even though the DSN name change occurs at site. Is there any technique to do this.

    DB:3.43:Problem With Dsn Name!!! Urgent x1

    Check out a beginning Java tutorial for how to pass parameters to methods. To construct the URL string:String url = "jdbc:odbc:" + dsn;
    conn = DriverManager.getConnection(url,"","");

  • RELEVANCY SCORE 3.43

    DB:3.43:Problem Mqx 3.81 p9



    The following code is the classic example hello world present inside the folder EXAMPLE.

    Now, with compiling and CW10.2 MQX3.8 works, but compiling with MQX CW10.2 and 3.81 does not work.

    I explained it off???

    Following the example of what I did:

    void hello_task(uint_32 initial_data){uint_32 i=0;while(1){i++;*((unsigned char*)BSP_EXTERNAL_MRAM_RAM_BASE) = 0xAA; //write_time_delay(20);if (i==0xFFFFFFFF) break;}printf("Hello World\n");_task_block();}

    Maurizio Felicioni

    DB:3.43:Problem Mqx 3.81 p9


    Hello,rose more than two weeks now and still can not understand why you can not sull'MQX 3.81 more to use the address 0x600000 flexbus CS0.I also sent an SR but still nothing ...It 'possible that nessno have encountered this problem??

    Maurizio

  • RELEVANCY SCORE 3.42

    DB:3.42:Visual C++ 6.0 + Ado dp


    I have a problem in compiling code written for VC ++ 6.0 , which uses ADO : where should I post my question ?

    DB:3.42:Visual C++ 6.0 + Ado dp

    Or ask in the VC forum on MSDN.
    Thanks!Ed Price (a.k.a User Ed), SQL Server Experience Program Manager (Blog,
    Twitter,
    Wiki)

  • RELEVANCY SCORE 3.39

    DB:3.39:Error Lnk2022: Metadata Operation Failed (801311d7) j9


    Hi, I have a problem with compiling the following code with a list handle as an argument ofextract_results function.

    DB:3.39:Error Lnk2022: Metadata Operation Failed (801311d7) j9


    Hi,

    According to the error message, Linker Tools Error LNK2022 detected an error while merging metadata.

    One reason for LNK2022 is when a type (such as a struct) exists in multiple compilands with the same name, but with conflicting definitions, and when you compile with
    /clr. In this case, make sure that the type has an identical definition in all compilands. The type name is listed in error message.
    For example:

    In a.cpp, the Class Test has the definition.

    // compile with: /clr /c

    public ref class Test {};

    However in b.cpp the Class Test has another definition.

    public ref class Test {

    void func() {}

    int var;

    };

    I hope my suggestion can help you to resolve your issue.

    Best Regards,

    Rob
    Rob Pan [MSFT]
    MSDN Community Support | Feedback to us
    Get or Request Code Sample from Microsoft
    Please remember to mark the replies as answers if they help and unmark them if they provide no help.

  • RELEVANCY SCORE 3.39

    DB:3.39:C++ Code Size Limit 7m



    Developing code for an S08/MC13213 uP on CodeWarrior v10.6, build 140329.

    Created code in C without any problem.

    Summary of section sizes per section type:

    READ_ONLY (R): 31D1 (dec: 12753)

    READ_WRITE (R/W): 432 (dec: 1074)

    NO_INIT (N/I): 7E (dec: 126)

    Compiling the C++ translation displays the following error:

    code size 3009 1024 bytes

    What am I doing incorrectly and how do I fix this?

    Thanks,

    Dan

  • RELEVANCY SCORE 3.35

    DB:3.35:Icpc 14.0.1 C++11 Template Argument Deduction Not Working? 3m



    I'm having a problem compiling the attached code (which reimplements something like C++14's integer_sequence).

    I've attempted compiling with "icpc --std=c++11 (using g++ 4.8.1's libstdc++)", but the compiler refuses to then find and instantiate the templated function. When I remove the "type indirection" (from TH::Indices... to TH::THDetail::integer_sequenceunsigned, ...) then the code compiles.

    Both clang 3.3 and g++ 4.8.1 compile this example just fine.

    DB:3.35:Icpc 14.0.1 C++11 Template Argument Deduction Not Working? 3m


     

    Hi Daniel,

    I have been able to reproduce this and have entered it as  DPD200252873 in our internal bug tracking database.

    This looks like a problem with variadic templates used as template aliases -- here is a workaround (inside the #ifdef OK) which avoids the problem:

    templateunsigned ...Is

    static void testFunc

    #ifdef OK

    (typename TH::THDetail::integer_sequenceunsigned, Is ...)

    #else

    (TH::IndicesIs ...)

    #endif

     

    Thanks for reporting it and we will get this fixed as soon as possible.

    Judy

     

     

  • RELEVANCY SCORE 3.35

    DB:3.35:How To Turn Off Warnings While Compiling The Code? p8


    How to turn off warnings while compiling the code?

  • RELEVANCY SCORE 3.35

    DB:3.35:Vb Compiling Quirk c7


    Code Snippet

    DB:3.35:Vb Compiling Quirk c7

    System.Console is defined in mscorlib.dll, which is implicitly referenced by the compiler. System.ComponentModel.Component is defined in System.dll, which you need to add an explicit reference to.
     
    Remember - there is not a one-to-one mapping between assembly names and namespaces
     
    Best regards,
    Johan Stenberg

  • RELEVANCY SCORE 3.34

    DB:3.34:Dev C Compiling Problems 1z


    hallow:
    iam newbie in c programming and iam using dev c++ compiler its work good for me when i write my own code but when i download some source codes from internet and try to compile it it's give me many erorrs so i want to know is this a compiler problem or what?

  • RELEVANCY SCORE 3.34

    DB:3.34:Compiling Source Code, Please Help! mk


    hi,

    when i try to compile my source code i get the message:

    "Too many parameters - and"

    i searched the web for help and it said "Sometimes, you may run out of environmental space, and see the message "Too many parameters" on boot up. If this happens, add the following line to config.sys (located in the root directory)
    shell=c:\command.com /p /e:32000". problem is i have XP and dont know how to do this. i think i have the PATH set correctly but i havent set the CLASSPATH. but this shouldnt affect the compiling process should it?

    cheers, thanks for any help.

    DB:3.34:Compiling Source Code, Please Help! mk

    i did a search for config.sys but no results, does
    anyone know what the config.sys file is called in XP
    and wheres its located? My XP system does not have config.sys but it does have a cmd.exe that launches a command prompt window.

    Maybe you should try here.

    http://java.sun.com/docs/books/tutorial/getStarted/cupojava/win32.html

  • RELEVANCY SCORE 3.33

    DB:3.33:Re: Problem With Ant 7z


    Use code tags when you post code.

    There is no way you can get that error compiling the code. The only way you can get that is by running the code. If you are getting it when running Ant then you have some weird in ant.

    However your stack trace looks like you are in fact running it. And thus your problem has nothing to do with Ant.

    DB:3.33:Re: Problem With Ant 7z

    Hi,

    I have a simple java code for connect to database using jdbc thin driver for Oracle database 9i,
    when I compile with jgrasp works fine, but when I compile with ant I got the error:

    Exception in thread "main" java.lang.ClassNotFoundException: oracle.jdbc.driver.
    OracleDriver
    at java.net.URLClassLoader$1.run(URLClassLoader.java:202)
    at java.security.AccessController.doPrivileged(Native Method)
    at java.net.URLClassLoader.findClass(URLClassLoader.java:190)
    at java.lang.ClassLoader.loadClass(ClassLoader.java:307)
    at sun.misc.Launcher$AppClassLoader.loadClass(Launcher.java:301)
    at java.lang.ClassLoader.loadClass(ClassLoader.java:248)
    at java.lang.Class.forName0(Native Method)
    at java.lang.Class.forName(Class.java:169)
    at Conn.main(Unknown Source)

    the code is (Conn.java):
    import java.sql.*;
    class Conn {
    public static void main (String args []) throws Exception
    {
    Class.forName ("oracle.jdbc.driver.OracleDriver");

    Connection conn = DriverManager.getConnection
    ("jdbc:oracle:thin:@192.168.1.100:1521:TEST", "scott", "tiger");
    try {
    Statement stmt = conn.createStatement();
    try {
    ResultSet rset = stmt.executeQuery("select name from customer where rownum10");
    try {
    while (rset.next())
    System.out.println (rset.getString(1)); // Print col 1
    } finally {
    try { rset.close(); } catch (Exception ignore) {}
    }
    } finally {
    try { stmt.close(); } catch (Exception ignore) {}
    }
    } finally {
    try { conn.close(); } catch (Exception ignore) {}
    }
    }
    }My CLASSPATH is:
    echo %CLASSPATH%
    C:\DevSuiteHome_1\jdbc\lib\ojdbc14.jar

    My JDK is:
    java -version
    java version "1.6.0_22"
    Java(TM) SE Runtime Environment (build 1.6.0_22-b04)
    Java HotSpot(TM) Client VM (build 17.1-b03, mixed mode, sharing)

    The ant version is:
    ant -version
    Apache Ant(TM) version 1.8.2 compiled on December 20 2010

    My build.xml is:

    ?xml version="1.0" encoding="UTF-8"?
    project basedir="." default="build" name="Conn"

    property name="src" value="${basedir}"/
    property name="build" value="${basedir}/build"/
    path id="files-classpath"
    fileset dir="C:\DevSuiteHome_1\jdbc\lib"
    filename name="ojdbc14.jar"/
    /fileset
    /path

    target name="clean"
    delete dir="${build}" /
    delete file="${basedir}/Conn.jar" /
    /target

    target name="init"
    tstamp/
    /target

    target name="prepare" depends="init"
    mkdir dir="${build}"/
    /target

    target depends="prepare" name="compile"
    javac destdir="${build}" srcdir="${src}"
    classpath refid="files-classpath"/
    /javac
    /target

    target depends="compile" name="copy"
    copy todir="${build}/Conn" file="${src}/Conn.properties"/
    copy todir="${build}/Conn"
    fileset dir="${src}/Conn"
    include name="**/*.gif"/
    /fileset
    /copy
    /target

    target depends="copy" name="jar"
    jar jarfile="${basedir}/Conn.jar"
    fileset dir="${build}" /
    manifest
    attribute name="Main-Class" value="Conn"/
    /manifest
    /jar
    /target

    target depends="jar" name="build"/

    /projectthat is wrong with this buildfile?

    Edited by: user9323408 on 29-12-2010 06:49 PM

  • RELEVANCY SCORE 3.32

    DB:3.32:Compiling Problem ja


    Hi, I have a problem with the compiling of a program. The TGZ archive with the source code can be download at this link: http://sourceforge.net/project/downloading.php?group_id=73939use_mirror=kentfilename=viper-full-20060131.tgz8114559

    Is there someone that can help me to compile this?? Because it has a large number of packages and external JAR files, and I don't know how to do it.
    Thanks and sorry for my English but I'm Italian.
    Bye Bye!

    DB:3.32:Compiling Problem ja

    I've occurred in some errors...

    Read the error messages; they tell you what's wrong, and by induction, what to fix. If you are confused by an error message, copy and paste the exact, full error message, and we can help point you in the right direction. Us downloading and compiling the software isn't going to identify where you went wrong.

    ~

  • RELEVANCY SCORE 3.31

    DB:3.31:Frmcmp Issue ! fa


    Hey Guys,
    I'm compiling forms 6i using frmcmp. Here is my code. The problem I'm having is that all the fmbs are compiled but fmx are not generated. Can anyone find what I'm doing wrong ?

    Thanx

    :COMPILE PLSQL LFORMS
    ECHO COMPILING PLLs files from the HM directory
    cls
    Echo compiling Libraries....
    for %%f IN (C:\*.fmb) do frmplsqlconv userid=username/password@database module=%%f batch=yes logfilename=C:\fmb_converter.log generateruntime=true
    ECHO FINISHED COMPILING APPLIB Libraries files

    ECHO COMPILING PLLs files from the HM directory
    cls
    for %%f in (C:\*.fmb) do frmcmp userid=username/password@database
    module=%%f module_type=FORM batch=yes window_state=minimize compile_all=yes
    ECHO FINISHED GENERATING COMPILING APPLIB Libraries files

  • RELEVANCY SCORE 3.31

    DB:3.31:.For Code Errors 97


    I am trying to compile a fortran code. the code files have .FOR extension. I am using Salford FTN95 compiler (http://www.silverfrost.com/11/ftn95...for_windows.asp). But I am getting errors. Actually this code was in working condition earlier. So I think it could be a problem due to compiler. Can anyone tell me if I should use any specific compiler for compiling building .FOR codes. Please let me know ur suggestions...

    DB:3.31:.For Code Errors 97

    changed the extension to .f ran on f77. worked fine..

  • RELEVANCY SCORE 3.29

    DB:3.29:Flash Timeout Error On Frdm-Kl25z Using Jlink With Keil. Cannot Find Appropriate Flash Programming Algorithm. 38



    When I try to load my code to flash on my KL25Z, I get a flash timeout error. The project compiles, and JLink recognizes the device. I am using uVision 5, and JLink v4.78d.

    I believe the problem arises from using the wrong programming algorithm, but I can't figure out where to get the right one.

    -------- Here are my current flash options and settings ----------

    -------- Here are my current available flash programming algorithms ----------

    -------- Here is the compile output --------

    Rebuild Project 'mytest3' - Target 'KL25Z128 - Flash'

    compiling mytest3.c...

    compiling uif.c...

    compiling alloc.c...

    compiling assert.c...

    compiling io.c...

    compiling memtest.c...

    compiling queue.c...

    compiling stdlib.c...

    compiling nmi_isr_handler.c...

    compiling start.c...

    compiling sysinit.c...

    compiling system_MKL25Z4.c...

    assembling startup_MKL25Z4.s...

    compiling cmp.c...

    compiling llwu.c...

    compiling lptmr.c...

    compiling mcg.c...

    compiling pmc.c...

    compiling rcm.c...

    compiling rtc.c...

    compiling smc.c...

    compiling uart.c...

    compiling Serial.c...

    compiling Retarget.c...

    linking...

    Program Size: Code=7164 RO-data=1844 RW-data=40 ZI-data=0

    After Build - User command #1: C:\Keil\\ARM\ARMCC\bin\fromelf.exe --m32combined --output=.\UV4Build\mytest3_Flash.srec .\UV4Build\mytest3_Flash.axf

    After Build - User command #2: C:\Keil\\ARM\ARMCC\bin\fromelf.exe --bincombined --output=.\UV4Build\mytest3_Flash.bin .\UV4Build\mytest3_Flash.axf

    ".\UV4Build\mytest3_Flash.axf" - 0 Error(s), 0 Warning(s).

    -------- End -------

    -------------- Here is the Load Code output --------------

    Load "C:\\Users\\robga_000\\Documents\\KL25 Sample Code\\kl25_sc_rev9\\klxx-sc-baremetal\\build\\keil\\mytest3\\UV4Build\\mytest3_Flash.axf"

    Set JLink Project File to "C:\Users\robga_000\Documents\KL25 Sample Code\kl25_sc_rev9\klxx-sc-baremetal\build\keil\mytest3\JLinkSettings.ini"

    * JLink Info: Device "MKL25Z128XXX4" selected (128 KB flash, 16 KB RAM).

    JLink info:

    ------------

    DLL: V4.76d, compiled Sep 13 2013 16:35:06

    Firmware: J-Link V9 compiled Oct 18 2013 17:37:30

    Hardware: V9.00

    S/N : 59102566

    Feature(s) : GDB

    * JLink Info: Found SWD-DP with ID 0x0BC11477

    * JLink Info: Found SWD-DP with ID 0x0BC11477

    * JLink Info: Found Cortex-M0 r0p0, Little endian.

    * JLink Info: FPUnit: 2 code (BP) slots and 0 literal slots

    ROMTableAddr = 0xE00FF003

    * JLink Info: Kinetis L-series (setup): Disabling watchdog.

    Target info:

    ------------

    Device: MKL25Z128xxx4

    VTarget = 3.311V

    State of Pins:

    TCK: 0, TDI: 0, TDO: 0, TMS: 1, TRES: 1, TRST: 1

    Hardware-Breakpoints: 2

    Software-Breakpoints: 8192

    Watchpoints: 2

    JTAG speed: 1000 kHz

    Erase Failed!

    Error: Flash Download failed - "Cortex-M0+"

    -------------- End ---------------

    The erase doesn't get past a single bit:

    Here are the actual error windows:

    Thank you so much for reading all of this. I appreciate your help.

    DB:3.29:Flash Timeout Error On Frdm-Kl25z Using Jlink With Keil. Cannot Find Appropriate Flash Programming Algorithm. 38


    When I try to load my code to flash on my KL25Z, I get a flash timeout error. The project compiles, and JLink recognizes the device. I am using uVision 5, and JLink v4.78d.

    I believe the problem arises from using the wrong programming algorithm, but I can't figure out where to get the right one.

    -------- Here are my current flash options and settings ----------

    -------- Here are my current available flash programming algorithms ----------

    -------- Here is the compile output --------

    Rebuild Project 'mytest3' - Target 'KL25Z128 - Flash'

    compiling mytest3.c...

    compiling uif.c...

    compiling alloc.c...

    compiling assert.c...

    compiling io.c...

    compiling memtest.c...

    compiling queue.c...

    compiling stdlib.c...

    compiling nmi_isr_handler.c...

    compiling start.c...

    compiling sysinit.c...

    compiling system_MKL25Z4.c...

    assembling startup_MKL25Z4.s...

    compiling cmp.c...

    compiling llwu.c...

    compiling lptmr.c...

    compiling mcg.c...

    compiling pmc.c...

    compiling rcm.c...

    compiling rtc.c...

    compiling smc.c...

    compiling uart.c...

    compiling Serial.c...

    compiling Retarget.c...

    linking...

    Program Size: Code=7164 RO-data=1844 RW-data=40 ZI-data=0

    After Build - User command #1: C:\Keil\\ARM\ARMCC\bin\fromelf.exe --m32combined --output=.\UV4Build\mytest3_Flash.srec .\UV4Build\mytest3_Flash.axf

    After Build - User command #2: C:\Keil\\ARM\ARMCC\bin\fromelf.exe --bincombined --output=.\UV4Build\mytest3_Flash.bin .\UV4Build\mytest3_Flash.axf

    ".\UV4Build\mytest3_Flash.axf" - 0 Error(s), 0 Warning(s).

    -------- End -------

    -------------- Here is the Load Code output --------------

    Load "C:\\Users\\robga_000\\Documents\\KL25 Sample Code\\kl25_sc_rev9\\klxx-sc-baremetal\\build\\keil\\mytest3\\UV4Build\\mytest3_Flash.axf"

    Set JLink Project File to "C:\Users\robga_000\Documents\KL25 Sample Code\kl25_sc_rev9\klxx-sc-baremetal\build\keil\mytest3\JLinkSettings.ini"

    * JLink Info: Device "MKL25Z128XXX4" selected (128 KB flash, 16 KB RAM).

    JLink info:

    ------------

    DLL: V4.76d, compiled Sep 13 2013 16:35:06

    Firmware: J-Link V9 compiled Oct 18 2013 17:37:30

    Hardware: V9.00

    S/N : 59102566

    Feature(s) : GDB

    * JLink Info: Found SWD-DP with ID 0x0BC11477

    * JLink Info: Found SWD-DP with ID 0x0BC11477

    * JLink Info: Found Cortex-M0 r0p0, Little endian.

    * JLink Info: FPUnit: 2 code (BP) slots and 0 literal slots

    ROMTableAddr = 0xE00FF003

    * JLink Info: Kinetis L-series (setup): Disabling watchdog.

    Target info:

    ------------

    Device: MKL25Z128xxx4

    VTarget = 3.311V

    State of Pins:

    TCK: 0, TDI: 0, TDO: 0, TMS: 1, TRES: 1, TRST: 1

    Hardware-Breakpoints: 2

    Software-Breakpoints: 8192

    Watchpoints: 2

    JTAG speed: 1000 kHz

    Erase Failed!

    Error: Flash Download failed - "Cortex-M0+"

    -------------- End ---------------

    The erase doesn't get past a single bit:

    Here are the actual error windows:

    Thank you so much for reading all of this. I appreciate your help.

  • RELEVANCY SCORE 3.29

    DB:3.29:Is Jvm Needed While Compiling Java Code k9


    Is JVM needed while compiling Java code ??

    DB:3.29:Is Jvm Needed While Compiling Java Code k9

    How is the compiler ever going to resolve all
    references to standard java classes (Date, String,
    etc.) when the runtime lib (from the JVM) is not
    present?There's a difference between the rt.jar and the JVM.

  • RELEVANCY SCORE 3.29

    DB:3.29:Difference In Reported Array Length Actual Content. pd



    The problem was that the word length was spelled incorrectly and without a #pragma strict the code was compiling...

    DB:3.29:Difference In Reported Array Length Actual Content. pd


    The problem was that the word length was spelled incorrectly and without a #pragma strict the code was compiling...

  • RELEVANCY SCORE 3.29

    DB:3.29:Has Someone Met Such Problem When Compiling ------" **Internal Compiler Error: Internal Abort** " dp



    I am using the newest version of intel visual fortran for programming recently.And I met a strang problem when compiling the following code.Code:

    program Console4
    implicit none

    integer, parameter::N_a = 10
    real::Array_a(N_a)

    Array_a(1:N_a-1) = 0

    end program Console4
    The error message is "**Internal compiler error: internal abort** Please report this error along with the circumstances in which it occurred in a Software Problem Report. Note: File and line given may not be explicit cause of this error. " I have tried replacing theabove code with the following one:Code:

    program Console4
    implicit none

    integer, parameter::N_a=10
    integer:: temp_N
    real::Array_a(N_a)

    temp_N = N_a -1
    Array_a(1:temp_N) = 0

    end program Console4
    and then the compiling is ok. But the first code can be successfully compilied with other versions of intel fortran and Compaq visual fortran. Could anyone answer me, I'd be very thankful.

    DB:3.29:Has Someone Met Such Problem When Compiling ------" **Internal Compiler Error: Internal Abort** " dp


    Exactly which version of Intel Visual Fortran are you using and which compiler switches are used to compile? I have not been able to reproduce this error with your code using 9.0.028.

    Anytime you get this error, you have found a compiler bug, and you should send a test case and as much information as you can about reproducing the problem to Intel Premier Support.

  • RELEVANCY SCORE 3.29

    DB:3.29:Two Places At Once? Someone Help. cx


    I could be wrong, but when compiling i beleive when javac is compiling the .java file, it is also looking for the class files associated with it. But there is a problem, if i am right, it is pointing to two files, different in code, but with the same name. How can i possibly have these two in the same directory??? or is there a work-around? someone respond. very urgent!

    Thanks!

    DB:3.29:Two Places At Once? Someone Help. cx

    by the way. this file is decompiled, So no, i did not write it.

  • RELEVANCY SCORE 3.29

    DB:3.29:Pe Iic Component Error 7s



    Anyone know what is the problem with PE IIC component ? I am getting an error message while compiling PE code:

    TIA

    DB:3.29:Pe Iic Component Error 7s


    Hi,

    I'm sorry, but I'm still not able to reproduce the problem. Have you originally created the project in CW 10.6? When I tried to frozen the project and the unfrozen it again it worked normally (except that modified parts are gone, which is however normal behavior).

    I would need the project (or some simplified one) that would reproduce the problem.

    Best regards

    Petr Hradsky

  • RELEVANCY SCORE 3.29

    DB:3.29:While Compile Api Code, The Link File Is Not Accept fp



    hai i am installed vmware server in linux. my objective is to monitor virtual machine by

    using programming API. i had a problem while compiling my client code by using the

    below code it shows "No such file or directory : libvmware-vix.so.0"

    gcc -o myprogram main.c libvmware-vix.so.0

    DB:3.29:While Compile Api Code, The Link File Is Not Accept fp


    hai i am installed vmware server in linux. my objective is to monitor virtual machine by

    using programming API. i had a problem while compiling my client code by using the

    below code it shows "No such file or directory : libvmware-vix.so.0"

    gcc -o myprogram main.c libvmware-vix.so.0

  • RELEVANCY SCORE 3.29

    DB:3.29:When Compiling C++ Source Code ,Which Library Need To Be Linked ? dj


    in TRU64 UNIX, when compiling c++ source code (the code has used OCCI,which library need to be linked ?

    DB:3.29:When Compiling C++ Source Code ,Which Library Need To Be Linked ? dj

    Please see demo_rdbms.mk under rdbms/demo directory
    for building OCCI.

  • RELEVANCY SCORE 3.29

    DB:3.29:Forte C++:Error: Multiple Declaration For Std::Exception 9x


    The code did compiled in the classic mode (i.e. with -compact option),
    but the problem is in compiling in standard mode.

    Thanks in advance

    DB:3.29:Forte C++:Error: Multiple Declaration For Std::Exception 9x

    I haven't tried this but you might try

    #include cmath
    using namespace std;

    but this may only work on Solaris 8.

  • RELEVANCY SCORE 3.26

    DB:3.26:Compiling "Write To Jpg\Bmp\Png File" In Labview2011 7x



    Hello everyone,

    I'm trying to compile a source code written in Labview 8.5 into Labview 2011.

    In the old source code I used the"writeBMP/JPG/PNG file" VIs.

    I noticed that these VIs have changed in Labview 2011.

    Either way (using the old or new VIs) I get an error (#1003 - Vi is not executable) when I try to run my compiled .exe file.

    Did anyone encounter this problem?

    Do you have any idea how to bypass this problem?

    Thanks in advance.

    DB:3.26:Compiling "Write To Jpg\Bmp\Png File" In Labview2011 7x


    1) Yes, The same PC is used to compile the source code and then check the application. The problem repeats itself on other PCs but all have LABVIEW and source code installed.

    2) Yes, I reinstalled the Labview 2011 runtime engine. No change

  • RELEVANCY SCORE 3.25

    DB:3.25:Error In Compiling Java Source Code In A Package pj


    hi all...
    am having a problem in compiling a java source code:
    i have a class named 'Test' in the package 'packone'....
    i have another class named 'getTest' in the same package....
    in the class getTest i am taking a reference to Test class...
    on compiling i am getting the following error....
    cannot resolve symbol
    symbol : class Test
    The source code for the two classes are :

    package packone;
    public class Test{
    }

    and

    package packone;
    public class getTest{
    public void me(){
    Test t = new Test();
    }
    }

    i have included the directory path in the classpath....
    still its not compiling .....
    please help
    thanks....

    DB:3.25:Error In Compiling Java Source Code In A Package pj

    i have included the directory path in the
    classpath....
    still its not compiling .....
    please help
    thanks.... For example, if you have c:\myjava\packone\Text.classthen you need to have c:\myjava in the Classpath, NOT c:\myjava\packone.

    Oh, and make sure you have a Test.class file. It looks like you do not have any code in Test. I think javac will not produce a class file if there isn't anything to compile.

  • RELEVANCY SCORE 3.24

    DB:3.24:Problem Understanding Why The Code Not Compiling cf


    I am getting this error when compiling the project:
    Error4Type 'WebContextBase' is not defined.C:\Temp\Budget_2307\Budget_SL\Generated_Code\Budget_SL.Web.g.vb3414Budget_SL
    Error5Name 'WebContextBase' is not declared.C:\Temp\Budget_2307\Budget_SL\Generated_Code\Budget_SL.Web.g.vb6526Budget_SL
    However, this file budget_sl.web.g.vb I do not see this anywhere.

    DB:3.24:Problem Understanding Why The Code Not Compiling cf

    Hi tusharr,
    Visual Web Developer is a tool for creating and working with ASP.NET Web applications (called simply Web sites) in a variety of configurations. I suggest you post your question in

    ASP.NET forums(http://forums.asp.net/) because there are more
    ASP.Net specialists and you will get better support. Thanks.
    Best regards,
    Alex LiangPlease remember to mark the replies as answers if they help and unmark them if they provide no help.

    Welcome to the All-In-One Code Framework! If you have any feedback, please tell us.

  • RELEVANCY SCORE 3.24

    DB:3.24:Problem With Getting A Soapheader Object In Jaxm af


    I used following code to generate a SOAPMessage:

    SOAPPart sp = message.getSOAPPart();
    SOAPEnvelope se = sp.getEnvelope();
    SOAPHeader sh = se.getHeader();
    SOAPBody sb = se.getBody();compiling of this code is ok but when i run it i got java.lang.NullPointerException because of the
    SOAPHeader sh = se.getHeader();don't know the reason. Could anybody give me some help?

    LG

    DB:3.24:Problem With Getting A Soapheader Object In Jaxm af

    Hi! SchelleyC

    I am surprised also because I find the problem disappear automatically this morning when I restart my computer and restart the NetBeans which I used to write my java program.

    It is really funny!

    till now I cannot find the exact reason, I think it might be the jar file mounting problem in NetBeans

    Thanks a lot for ur kind help

    LG

  • RELEVANCY SCORE 3.24

    DB:3.24:Compiling C++ x7


    Hello all,

    I am new to c and using vb c express, but my main problem is after compiling the code the program runs through and exits on its own before I can see anything that I wanted the program to print on the screen. Is there any way to not have
    the program close on its own so I can see the results of the program?

    DB:3.24:Compiling C++ x7


    Hi bacman232,
    I suggest you force a pause at the end of the application to see the running result, or press CTRLF5 to run it instead of F5 alone. To force a pause at the end, you can put either of the following lines of code before the application returns:
    system(pause);
    getchar();
    Best regards,
    Helen Zhao Helen Zhao [MSFT]
    MSDN Community Support | Feedback to us

  • RELEVANCY SCORE 3.24

    DB:3.24:Code Too Large For Try Statement fx


    hai frnds,

    when compiling a servlet file i was getting Code too large for try statement - what is that problem ...but when remove some length of codes then it's compiling properly

    if any body know the solution plz mail me at
    itramesh_p@yahoo.co.in

    DB:3.24:Code Too Large For Try Statement fx

    In weblogic 8.1, i've met the same error, and solved the problem by adding param to weblogic.xml.
    jsp-descriptor
    jsp-param
    param-namenoTryBlocks/param-name
    param-valuetrue/param-value
    /jsp-param
    /jsp-descriptorHope this may help you out.

  • RELEVANCY SCORE 3.23

    DB:3.23:/ Problem 8m


    I have a string like 'mm/dd/yyyy' within my procedure.

    This / (forward slash) goes missing after i compile the package from a notepad from sql prompt.
    But in Toad it works fine.

    In note pad it will be correct; but after compiling, the code within the DB, The code becomes like 'mmddyyyy'

    Thanks
    Sunil

    DB:3.23:/ Problem 8m

    Thx. SBH

    I found the mistake.

    Before creating the package i was inserting some records in which i had set the escape character as /.

    Just forgot to cancel that before creating the package.

    Thanks
    sunil

  • RELEVANCY SCORE 3.23

    DB:3.23:Compiler Is Not Compiling dc



    All of a sadden FB stopped compiling my code. I change code but the app. still runs the same.

    Any idea?

    Thanks

    DB:3.23:Compiler Is Not Compiling dc


    Try Project -- clean.

    Also clean the cache on the browser.

    Rgds.

  • RELEVANCY SCORE 3.23

    DB:3.23:Compiling An Fpga Vi 3z



    Hi. I'm trying to compile a certain FPGA VI (with no errors). However, everytime I compile my code, LabVIEW eventually stops responding. I'm using a PXIe - 7962R module (NI FlexRIO). What can I do to solve this problem? Thank you for your time.

    DB:3.23:Compiling An Fpga Vi 3z


    Duplicate post. Responded to here:http://forums.ni.com/t5/Real-Time-Measurement-and/compiling-an-fpga-vi/m-p/1829517/highlight/false#M...




    Applications EngineerNational Instruments

  • RELEVANCY SCORE 3.21

    DB:3.21:Re: Logistics Problem 19


    Its not compiling.

    DB:3.21:Re: Logistics Problem 19

    AM150 wrote:
    I have two squares which share an edge. I want to create classes "main" "square" "edge" and assign references to the left and right hand side squares and also assign the edge to the appropriate square "east" and "west" edges. I have a slightly different question: what do you mean by an "edge"? Do you mean a side? To me, a square could have 8 possible squares that touch yours by an an 'edge'.

    Winston

  • RELEVANCY SCORE 3.21

    DB:3.21:Error Code = 0xbffa002e c9


    I just upgrade the NI-Scope from 2.6 to 2.7. The program which previously worked doesn't work on version 2.7 after re-compiling. The error code returned is 0xBFFA002E. Does anyone has a clue what causes this problem?Thanks.

    DB:3.21:Error Code = 0xbffa002e c9

    Please install the latest NI-VISA driver (3.2) found here:http://digital.ni.com/softlib.nsf/websearch/F20288​844692F8D086256EE6006983D8?opendocumentnode=13206​0_USIf the problem persists, please let us know.Best Regards.

  • RELEVANCY SCORE 3.20

    DB:3.20:Compiling Assembly Code To Produce Com Files. fa


    Hi.I have MS VS2005 Professional, which has Masm v.8 (OS MS Windows XP SP2)I recently started learning assembly language. And I have no problems compiling 32-bit code.There's only something wrong while compiling asm code to produce COM files.Here's simple code sample:

    Code Block

    DB:3.20:Compiling Assembly Code To Produce Com Files. fa

    Wow, it  worked. You're right that by default it generates object files in coff format. Without specifying, that ml has to compile an object module format object file, even if I used 16-bit linker, it would give a fatal error:
    TEST.OBJ : fatal error L1101: invalid object module
    , which now makes sense. A couple of days ago I figured out on myself how to compile my example code using MASM v.6.xx and 16-bit link.exe. I thought that I definetely have to use not only 16-bit linker, but ml.exe version 6.xx. But at last I was able to compile using ml.exe v.8! But still you have to use 16-bit linker ( for instance Microsoft link.exe v.5.xx) to link 16-bit code. It will produce an .EXE file, which I easily convert to .COM using exe2bin.
     
    And of course it's easier to write a batch file for this to make the compilation faster:

    Code Block

  • RELEVANCY SCORE 3.20

    DB:3.20:Cannot Resolve Symbol For Oracle.Sql.Clob.Duration_Call xk


    Hi,

    I'm having a problem compiling my code in one of my servers.

    The line causing the problem is this:
    oracle.sql.CLOB newClob = oracle.sql.CLOB.createTemporary(connection, false, oracle.sql.CLOB.DURATION_CALL);

    There's no error with import oracle.sql.CLOB so I assume that the classes12.zip library has been correctly imported. Why doesnt the DURATION_CALL for that class work then?

    I have compiled the same codes in another server with no problem. The classes12.zip used is of the same version. What else should I be checking for? I'm compiling using ANT.

    Cheers!

    DB:3.20:Cannot Resolve Symbol For Oracle.Sql.Clob.Duration_Call xk

    I have the same problem before. I have solved it maybe it will helpful to you.

    The version classes12.zip jdbc driver for oracle8.1.7 does not support DURATION_CALL, DURATION_SESSION and createTemporary function. You can read the javadoc for that version.

    I have used a workaround for this problem. Here is the code that I have used.

    Clob newClob= oracle.sql.CLOB.empty_lob();
    if(data!=null) {
    try{
    if(newClob!=null) {
    ((oracle.sql.CLOB)newClob).putString(1, data);
    }
    } catch (Exception e){
    }I do not know whether this is appropriate as it does not have a temporary space to store the large object but it works. Hope this would be helpful...

  • RELEVANCY SCORE 3.20

    DB:3.20:Assertions, Compiling With Jdeveloper9i ca


    Does JDeveloper9i (902)/ojc have a problem compiling code with assertions?

    Compiling:

    public class Main4
    {
    public static void main(String[] argv)
    throws Exception
    {
    assert false:"ERROR: Assertion failed";
    }
    }

    Is fine. Compiling:

    public class Main4
    {
    public static void main(String[] argv)
    throws Exception
    {
    assert false ||
    true:"ERROR: Assertion failed";
    }
    }

    Gives:

    Error: compiler internal error

    Compiling (and running) outside of JDeveloper with JDK 1.4 is fine.

    Thanks for your help,

    Ian

    DB:3.20:Assertions, Compiling With Jdeveloper9i ca

    Hi

    As far i can see assertions still do not work in Rel. 9.0.3...

    Have you any suggestion how to avoid this problem?

    Thanks

  • RELEVANCY SCORE 3.18

    DB:3.18:Too Many Errors. I Want To See All Of Them In Ms-Dos. 39


    I am wondering why no one ever wants to see all their errors when compiling programs. Several times I have looked for someone who is in the same boat as I am. I can't seem to find any hints or solutions to this problem.

    I know that when compiling code in c or c++ you can redirect any output/errors to a file in UNIX and I think MS-DOS as well. When compiling Java code you can use the script command in UNIX to solve the issue of errors scrolling off the screen, but in MS-DOS, I know no other solution than getting an Integrated Development Environment (IDE) like VIDE.

    Can anyone help me with this problem. Thank you.

    DB:3.18:Too Many Errors. I Want To See All Of Them In Ms-Dos. 39

    It worked for me under NT. Okay, different tack: write a class using Runtime.exec() and Process.getErrorStream() which compiles, putting the error stream from javac onto stdout.

  • RELEVANCY SCORE 3.18

    DB:3.18:Compiling Mod_Jk: Libtool Error 1k


    While compiling mod_jk on my solaris 9 (sparc/64):
    I got the following error:
    /usr/local/apr/build-1/libtool --silent --mode=install cp `pwd`/mod_jk.so
    libtool: install: you must specify a destination
    Try `libtool --help --mode=install' for more information.
    *** Error code 1
    make: Fatal error: Command failed for target `mod_jk.so'
    Current working directory /gecici/jakarta-tomcat-connectors-1.2.15-src/jk/native/apache-2.0
    *** Error code 1
    make: Fatal error: Command failed for target `all-recursive'

    What might be the problem?

    DB:3.18:Compiling Mod_Jk: Libtool Error 1k

    when i used the gcc make (not the one at /usr/ccs), problem solved.(you should also instal autoconf anf automake)

  • RELEVANCY SCORE 3.18

    DB:3.18:Problem With Compiling C Code With Labview 7.0 aa


    I have some C code for use with CINs that compiled at worked fine with an earlier version of LabVIEW.I have recently installed LabVIEW 7.0 and the programs no longer compile giving the error 'Cannot open include file 'extcode.h''I have changed the compile options to point to the CINTOOLS directory. (I realise that the directory structure of LabVIEW 7.0 is different from the earlier version I was using)Has anybody got any advice?thanks.

    DB:3.18:Problem With Compiling C Code With Labview 7.0 aa

    I have some C code for use with CINs that compiled at worked fine with an earlier version of LabVIEW.I have recently installed LabVIEW 7.0 and the programs no longer compile giving the error 'Cannot open include file 'extcode.h''I have changed the compile options to point to the CINTOOLS directory. (I realise that the directory structure of LabVIEW 7.0 is different from the earlier version I was using)Has anybody got any advice?thanks.

  • RELEVANCY SCORE 3.17

    DB:3.17:[C++] Include Problem Causing Compiling Error [Solved] 7a



    Hello.
    I am working on some code snippets that I finally want to put together.
    There are three relevant files that cause the compiling error:
    mpdscrob.cpp
    options.h
    librc.h

    DB:3.17:[C++] Include Problem Causing Compiling Error [Solved] 7a


    codemac: No, the error is still the same. Why it should be anything differend?

    drakosha: librc is written by myself. It is comprised of these files:
    librc.h
    librc.cpp

  • RELEVANCY SCORE 3.17

    DB:3.17:Problems In Compiling The Jmf Source Code xa


    Hi all,
    i am getting the following error in compiling Jmf source code. i am using a redhat 8.0 linux machine.
    this is part of the output

    make[2]: *** No rule to make target
    `../../../../../build/linux/lib/com/sun/media/codec/audio/msadpcm/MsAdpcm.class',
    needed by `all'. Stop.
    make[1]: *** [com/sun/media] Error 2
    make: *** [all] Error 2
    -- Making image
    -- -- Deleting unnecessary files
    -- -- Copying libraries
    /bin/cp: cannot stat `../../build/linux/lib/*.so': No
    such file or
    directory
    make: *** [image] Error 1

    what is needed to be done to over come this problem
    please kindly help me.
    thanking you
    bye
    suresh

    DB:3.17:Problems In Compiling The Jmf Source Code xa

    I found Sun states some codecs which Sun ships with JMF 2.1.1 binary release are not available for source code release. So I have to copy some binary class files to build directory. It works now. But after build there are still have some errors or warnings as follows. I am not sure will it work properly?

    ***********************************************************************************
    -- Registering default plugins and committing...
    -- -- Compiling ../../../test/registry/RegisterPlugIn.java
    No plugins found
    Could not load library jmutil native module
    java.lang.UnsatisfiedLinkError: JMFSecurityManager: java.lang.UnsatisfiedLinkErr
    or: /home/john/JMF2.1.1/build/linux/lib/libjmutil.so: /home/john/JMF2.1.1/build/
    linux/lib/libjmutil.so: undefined symbol: __gxx_personality_v0
    at com.sun.media.JMFSecurityManager.loadLibrary(JMFSecurityManager.java:206)
    at com.sun.media.util.WindowUtil.clinit(WindowUtil.java:48)
    at com.sun.media.renderer.video.XLibRenderer.clinit(XLibRenderer.java:23)
    at java.lang.Class.forName0(Native Method)
    at java.lang.Class.forName(Class.java:141)
    at com.sun.media.util.RegistryGen.registerPlugIn(RegistryGen.java:320)
    at com.sun.media.util.RegistryGen.registerPlugIns(RegistryGen.java:385)
    at com.sun.media.util.RegistryGen.main(RegistryGen.java:614)
    java.lang.UnsatisfiedLinkError: JMFSecurityManager: java.lang.UnsatisfiedLinkErr
    or: /home/john/JMF2.1.1/build/linux/lib/libjmutil.so: /home/john/JMF2.1.1/build/
    linux/lib/libjmutil.so: undefined symbol: __gxx_personality_v0
    at com.sun.media.JMFSecurityManager.loadLibrary(JMFSecurityManager.java:206)
    at com.sun.media.util.WindowUtil.clinit(WindowUtil.java:48)
    at com.sun.media.renderer.video.XLibRenderer.clinit(XLibRenderer.java:23)
    at java.lang.Class.forName0(Native Method)
    at java.lang.Class.forName(Class.java:141)
    at com.sun.media.util.RegistryGen.registerPlugIn(RegistryGen.java:320)
    at com.sun.media.util.RegistryGen.registerPlugIns(RegistryGen.java:385)
    at com.sun.media.util.JMFPropertiesGen.main(JMFPropertiesGen.java:29)
    java.lang.UnsatisfiedLinkError: JMFSecurityManager: java.lang.UnsatisfiedLinkErr
    or: /home/john/JMF2.1.1/build/linux/lib/libjmutil.so: /home/john/JMF2.1.1/build/
    linux/lib/libjmutil.so: undefined symbol: __gxx_personality_v0
    at com.sun.media.JMFSecurityManager.loadLibrary(JMFSecurityManager.java:206)
    at com.sun.media.renderer.video.XLibRenderer.init(XLibRenderer.java:60)
    at sun.reflect.NativeConstructorAccessorImpl.newInstance0(Native Method)
    at sun.reflect.NativeConstructorAccessorImpl.newInstance(NativeConstructorAccessorImpl.java:39)
    at sun.reflect.DelegatingConstructorAccessorImpl.newInstance(DelegatingConstructorAccessorImpl.java:27)
    at java.lang.reflect.Constructor.newInstance(Constructor.java:274)
    at java.lang.Class.newInstance0(Class.java:308)
    at java.lang.Class.newInstance(Class.java:261)
    at com.sun.media.util.RegistryGen.registerPlugIn(RegistryGen.java:321)
    at com.sun.media.util.RegistryGen.registerPlugIns(RegistryGen.java:385)
    at com.sun.media.util.JMFPropertiesGen.main(JMFPropertiesGen.java:29)
    -- -- Generating customizer.jar

  • RELEVANCY SCORE 3.17

    DB:3.17:Problem Compiling Static Linking cx


     
    Hi,
     
    I was having trouble transfering compiled code from one computer to another - one solution was to downloaded the VC2008 Runtime library.  This fixed the problem but I also read that another solution was to compile with the static library.  So I tried to do this from directions here:
    http://msdn2.microsoft.com/en-us/library/ms235627(VS.80).aspx
     
    But there was a problem compiling:
     

    Code Snippet

  • RELEVANCY SCORE 3.17

    DB:3.17:Problem During Deploying 87



    Error in compiling Flex application: Error: A function in the code exceeds the 64K byte limit (actual size = '72792'). Since the problem occurs in the compiler-generated deferred instantiation code, please refactor/componentize portions of this document.

    (/usr/sap/APD/JC00/j2ee/cluster/server0/GUIMachine_Business_Packages/MPSEZ_PMS_23879/FLEX_COMPILATION_FOLDER/AADTEH.mxml:19)

    Failed to compile AADTEH.mxml

    Kindly help

    Thanks

    Nivedita

    DB:3.17:Problem During Deploying 87


    Hi,

    This is well know problem and it will be solved with Flex2 Compiler.

    see the below wiki

    [https://www.sdn.sap.com/irj/sdn/wiki?path=/display/vc/64kbytelimit]

    Regards,

    Govindu

  • RELEVANCY SCORE 3.17

    DB:3.17:Bluecove Compilation Problem j8


    How should i configure netbeans so that i can compile bluetooth code using bluecove?

    Any other alternative way of compiling bluetooth code using Bluecove?

    DB:3.17:Bluecove Compilation Problem j8

    How should i configure netbeans so that i can compile bluetooth code using bluecove?

    Any other alternative way of compiling bluetooth code using Bluecove?

  • RELEVANCY SCORE 3.17

    DB:3.17:Error Compiling Flash Forms am


    Hi,

    I'm currently experiencing a problem when compiling flash
    forms:


    Error /Copyoftest2.cfm:-1
    macromedia.css.LocatorParser

    Error /Copyoftest.mxml:376
    The class 'mx.rpc.RemoteClassRelayResponder' could not be
    loaded.

    I've searched for a resolution but had no joy, The code is
    simple and as follows:

    cfform format="flash" width="500"
    cfinput type="button" value="Hello" name="test" /
    /cfform

    Can anyone shed any light on this?

    DB:3.17:Error Compiling Flash Forms am

    Check this link which addresses issue for some similar
    scenarios
    http://livedocs.adobe.com/coldfusion/7/htmldocs/wwhelp/wwhimpl/common/html/wwhelp.htm?cont ext=ColdFusion_Documentationfile=00000058.htm

  • RELEVANCY SCORE 3.17

    DB:3.17:Quick Question: Compiling .F And .F90 cm



    is there any problem in compiling .f and .f90 files into the same program?

    DB:3.17:Quick Question: Compiling .F And .F90 cm


    Yes good point, or reverse the order of the source files to see if the lack of fixed-form indentation in main.f90 triggered errors.

  • RELEVANCY SCORE 3.17

    DB:3.17:Problem In Compiling Ssse3 In Ubuntu12.04lts fp



    Hi

                I have a code  in which i used the SSSE3 inrtuctions, i wanted to compile in Ubuntu12.04 , the same code is compiling in Windows.My system  is Intel Xeon which supports SSSE3.(Got the info from the following command "more /proc/cpuinfo" .

    While compiling in Ubuntu i added compiler option  "-mssse3 ", but still it is giving Error ."_mm_shuffle_epi8 was not declared in scope" , other instructions of SSSE3 are also not recognized.

    Please let me know what might be the reason.Please reply.

    Thanks in Advance.

    Regards,

    Harikrishna.K

    DB:3.17:Problem In Compiling Ssse3 In Ubuntu12.04lts fp


    ...i got the error when i am using _mm_load_si128 insruction as "Segmentation Fault" ,though the argunment i am passing is

    filled Buffer(Frame Buffer of 1920x1080)...

    Address to the buffer must be 16-byte aligned. In case of unaligned address to the buffer use _mm_loadu_si128. At the moment it is Not clear how you declared the Buffer.

  • RELEVANCY SCORE 3.16

    DB:3.16:Javax.Comm Does Not Exist 1z


    I am using j2sdk1.4.2 within Win98 env. I am trying to access COM port through javax.comm package.

    I always getting error message while compiling the code as follows.

    import javax.comm.*;
    ^
    package javax.comm does not exist

    I have placed all the three files in their required places.
    * win32com.dll in jdk\jre\bin.
    * comm.jar in jdk\jre\lib\ext.
    * javax.comm.properties in jdk\jre\lib.

    The same code is compiling on another Computer without problem.

    What may be the mistake I am making?

    D. Avijit

    DB:3.16:Javax.Comm Does Not Exist 1z

    I have connected the foot pedal to the serial port and access the signal using javax.comm api (Linux) and getting the signal successfully but it takes long time(compared to windows).

    is their any solution for it?????

  • RELEVANCY SCORE 3.16

    DB:3.16:Errorcode 6 Compiling dx


    When I try to compile my Labview FPGA I get the error: Xflow - Program xst returned error code 6. Aborting flow execution...
    I have checked all my inputs and they're all connected properly so that shouldn't be the problem. I never had any problems like this before while compiling.
    It is a very simple program that's suppost to write a desired signal to the FPGA memory and read it again changing samplefrequency and amplitude.
    I enclosed my file so you might find my mistake.

    Thanks for helping









    Attachments:







    FPGA_blok.vi ‏257 KB

    DB:3.16:Errorcode 6 Compiling dx

    Hi,The following KBs are related to this issue:http://digital.ni.com/public.nsf/websearch/D0181D0​5C79F763D86256F8500732563?OpenDocumentYou didn't include the subVI but maybe this is the problem:http://digital.ni.com/public.nsf/websearch/FE379EA​FF553982286256D740076B9C5?OpenDocumentI've noticed that there is one unconnected terminal.Otherwise I cannot see any unbounded arrays or other problem causes.Add more detail to your post the next time. Stuff like LabVIEW, FPGA, and RIO versions.Regards.Joris V

  • RELEVANCY SCORE 3.16

    DB:3.16:Need Help On Oracle 8.1.7 Proc*C!!! kd


    Does anyone have a handon experience on compiling a proc (*.pc) file which is
    larger than 4 Mbytes in Oracle 8.1.7 (this file was generated from a code generator automatically)? I got a file limitation error when
    compiling this file. Is there anyway to get arround this problem? Please
    help...Thanks

    email: rayliang@e-toyou.com

    Ray Liang

    DB:3.16:Need Help On Oracle 8.1.7 Proc*C!!! kd

    Dear Liang,

    I am not sure whether there is any constraint on source code for Pro*C compilation. Can you send me the source to me so that I can compile and send you the 'make' files?

    Thanks,
    Renjith

  • RELEVANCY SCORE 3.16

    DB:3.16:Compiling Help Needed 1j


    Hi. I am getting going and have a question...
    I am in the process of compiling a project and
    have arrived at a compiling impass. I have two
    java files, file A and file B. In each case, the
    code in one depends on the availability of the
    other's class file. So, I can't compile either.
    I am guessing that this is a pretty common problem
    when compiling interrelated files. Does anybody
    know how i can compile without commenting out the
    dependent methods?

    I hope this was reasonably clear.

    thanks,
    peter

    DB:3.16:Compiling Help Needed 1j

    ok. i figured it out, thanks.
    i added a package heading to the java files and
    the compiler didn't seem to like that. when i
    took out the common package heading, it compiled
    straight away. thanks again.

  • RELEVANCY SCORE 3.16

    DB:3.16:Hollerith Problem 3j



    Hi guys,I'm compiling a old FORTRAN code for my research using Intel Composer XE 2011 command line. I got whole bunch of errors saying: end of statement found while lexing a hollerith constant. I have no idea about this but it comes from the old format?I'm wondering if you know how to fix this. Or at least how to ignore it when compiling. It works fine when I was using Lahey compiler. Any compiling options I can use? Thanks very much for your time.Regards,JasonBTW, you may find the source code in the attachment if that helps.

    DB:3.16:Hollerith Problem 3j


    Steve,

    Your effort is highly appreciated. I'll keep playing with this. Thanks.

    Jason

  • RELEVANCY SCORE 3.15

    DB:3.15:Problem When Compiling Dfc Code c7


    hi guys i am getting a problem when running a dfc code 0 [main] WARN com.documentum.fc.common.DfLogger - Failed to load log4j.properties. Using default log4j configurationcan u tell me what the problemTx in advance

    DB:3.15:Problem When Compiling Dfc Code c7

    Hi,this is either a classpath or missing file problem.In general, classpath is supposed to contain the Documentum\config folder, and youprobably do have this as well. Inside this folder, DFC will look for dfc.properties, dbor.properties and log4j.properties. If there is no log4j .properties located in the folder,you'll receive this message.On the hand, it is just a warning, and default properties are used.Check your classpath and folder,.RegardsJoerg

  • RELEVANCY SCORE 3.14

    DB:3.14:Pe Iic Component Error ks



    Anyone know what is the problem with PE IIC component ? I am getting an error message while compiling PE code:

    TIA

    DB:3.14:Pe Iic Component Error ks


    Fiona, as you asked for a simple project, it helped me in workaround this error. I created a new small project, and PW with I2C OK.

    It is not the 1st time that I see that after freezing PE and writing long code, trying to reuse of the PE not always succeed.

    Thank you, I understand that this is a bug, but consider my question solved. I copied the files from the new project I created to my application, and it works OK.

  • RELEVANCY SCORE 3.14

    DB:3.14:Re: Compiling Swing To Native Code k8


    Because 2% of people have java :(

  • RELEVANCY SCORE 3.13

    DB:3.13:Error While Compiling 88



    Hello to everyone,

    I have a problem while compiling a proyect for the NetFPGA. For different reasons I have to use Fedora 14 and Xilinx ISE 13.4. The error is the next one:

    ERROR:(null):11 - Unexpected symbol 'MICROBLAZE', 'ADDRESS_MAP name' expected. Line #3, File "system.bmm".ADDRESS_MAP microblaze_0 MICROBLAZE-LE 100

    I did not make any part of the code, but it is supposed to work.

    Can anybody help me please?

    Thank you in advanced

    DB:3.13:Error While Compiling 88


    Hi,

    Is this error seen during running data2mem when generating bitstream or running the simulation?

    --Hem




    ----------------------------------------------------------------------------------------------Kindly note- Please mark the Answer as "Accept as solution" if information provided is helpful.Give Kudos to a post which you think is helpful and reply oriented.----------------------------------------------------------------------------------------------

  • RELEVANCY SCORE 3.13

    DB:3.13:Fpga Timing Violation - How To Find? jc



    Hi

    I run into a timing violation problem during compiling my FPGA code. Even if I change the compile options to "balanced" or anything else the problem is still there.

    My question is now, how can I find the function block in my code where the problem occurs? I use several SCTL's in my code.

    thanks in advance







    Solved!
    Go to Solution.

    DB:3.13:Fpga Timing Violation - How To Find? jc


    Use controls for the FPGA-Host communication as long as you have enough FPGA resources. It's recommended to use DMA FIFO communication between Host and FPGA.

    Only the controls on the FPGA top level vi are accessible on the Host side.

    Global variables are used to communicate with a FPGA scope only.

    You use a sbRIO device so I think the FPGA shall communicate with the RT target (Host) ...

  • RELEVANCY SCORE 3.13

    DB:3.13:Strange Problem... Jsp Pages Not Updating With The Changed Code ps


    hi,
    i am facing a strange problem. Suddenly my server stopped responding to the changes in my jsp code. it is showing only my old jsp pages. i..e.. i think it stopped compiling the code and its showing all the old class files..

    plzz help me out
    thanx

    DB:3.13:Strange Problem... Jsp Pages Not Updating With The Changed Code ps

    hi,
    i am facing a strange problem. Suddenly my server stopped responding to the changes in my jsp code. it is showing only my old jsp pages. i..e.. i think it stopped compiling the code and its showing all the old class files..

    plzz help me out
    thanx

  • RELEVANCY SCORE 3.13

    DB:3.13:Odbcpslib Library For Palm ks


    I have a problem with #include odbc.h in application that use ODBC to connect Oracle9i Lite on Palm
    compiling I have Declaration sintax error for this line code

    class odbcPSLib;

    I've try to include various library and header file but nothing to do.

    Someone have the same problem or know what i missing?

    DB:3.13:Odbcpslib Library For Palm ks

    I have a problem with #include odbc.h in application that use ODBC to connect Oracle9i Lite on Palm
    compiling I have Declaration sintax error for this line code

    class odbcPSLib;

    I've try to include various library and header file but nothing to do.

    Someone have the same problem or know what i missing?

  • RELEVANCY SCORE 3.10

    DB:3.10:Assertions, Compiling With Jdeveloper9i az


    Does JDeveloper9i (902)/ojc have a problem compiling code with assertions?

    Compiling:

    public class Main4
    {
    public static void main(String[] argv)
    throws Exception
    {
    assert false:"ERROR: Assertion failed";
    }
    }

    Is fine. Compiling:

    public class Main4
    {
    public static void main(String[] argv)
    throws Exception
    {
    assert false ||
    true:"ERROR: Assertion failed";
    }
    }

    Gives:

    Error: compiler internal error

    Compiling (and running) outside of JDeveloper with JDK 1.4 is fine.

    Thanks for your help,

    Ian

    DB:3.10:Assertions, Compiling With Jdeveloper9i az

    Assertions are enabled.

    The JDeveloper team have told me it's a bug in JDeveloper9i 902 and it's fixed in 903.

  • RELEVANCY SCORE 3.10

    DB:3.10:Occi.H Compiling Problem p7


    I have problems to compile a sample code that uses occi interface due to the occi.h header. can anyone give any suggestion?
    Thanks in advance.

    DB:3.10:Occi.H Compiling Problem p7

    I also got a link error when i tried to compile occidml.cpp under solaris using g++. The error is some undefined symbol in libocci.so.

    Any suggestion.

  • RELEVANCY SCORE 3.10

    DB:3.10:Help With Java Software xf


    hey everyone.
    I'm brand new to jave programing and im having some trouble compiling my first program im sure it would be no problem for you guys to help me out. Ok, I downloaded J2SE version 1.4 or something from the sun website and this is my code

    public class Firsttry {

    public static void main (String[] args) {
    System.out.printIn("Hello!");
    }
    }

    Simple enough right? Except when I try compiling

    Firsttry.java [4:1] cannot resolve symbol
    symbol : method printIn (java.lang.String)
    location: class java.io.PrintStream
    System.out.printIn("Hello!");
    ^
    1 error
    Errors compiling Firsttry.

    I cant think of why I would get an error here, I dont think there is anything wrong with the code I'm assuming im using the software inproperly. I'm not sure if I set up the PATH to the bin directory correctly could that maybe be the problem? Please help.

    DB:3.10:Help With Java Software xf

    3. Your parameters don't match the signature.

  • RELEVANCY SCORE 3.10

    DB:3.10:Urgent: Codegenerator Throws Stringindexoutofbounds Exception sp



    When I try to compile a JSP using WebLogic JSP compiler (WebLogic 4.5.1, Solaris 2.7, JDK 1.2.1), the Code Generator throws StringOutOfBoundsException while parsing the JSP. Could somebody help me debugging this problem.

    I get this problem only while compiling a particular JSP - other JSPs compile without any problem.

    I have attached the stack trace.

    DB:3.10:Urgent: Codegenerator Throws Stringindexoutofbounds Exception sp


    "Niranjan" Niranjan.Murthy@ctp.com wrote:

    When I try to compile a JSP using WebLogic JSP compiler (WebLogic 4.5.1, Solaris 2.7, JDK 1.2.1), the Code Generator throws StringOutOfBoundsException while parsing the JSP. Could somebody help me debugging this problem.

    I get this problem only while compiling a particular JSP - other JSPs compile without any problem.

    I have attached the stack trace.

    Did you forget to attach your stack trace?

    Jong

  • RELEVANCY SCORE 3.10

    DB:3.10:Variable Quality Images 81


    I'm inserting bitmaps into a Word 2003 document via the Ctrl
    + G Robohelp command, then compiling. The bitmaps are compiling as
    variable quality, despite being originally saved as 'high quality'
    images. The problem is independent of file size as sometime quite
    small screenshots come out poor quality, while larger ones are OK.

    To describe the effect - the images begome very grainy and
    lose some of their definition.

    One thought - I'm compiling in WSYIWYG mode - would I do
    better to convert to True Code before compiling?

    DB:3.10:Variable Quality Images 81

    I've just posted to the 'images very fuzzy' thread on this
    subject, if any use to you...

  • RELEVANCY SCORE 3.09

    DB:3.09:Problem With Cimom Process At Boot Up a7


    I have three ESX 3.5 U1 servers and all three of them have the same problem when it starts Pegasus CIMOM (cimserver). I don't know what it means or the impact it has on the server. Attached is an exceprt the log file. This error repeats over and over every time the system is restarted. I'm also curious why this install proceedure happens at every reboot. Is that necessary?

    Starting Pegasus CIMOM (cimserver)... [60G[ [0;32mOK

    CIMOM not responding, sleeping...

    CIMOM not responding, sleeping...

    CIMOM is up, proceeding...

    Installing MOFs...

    Compiling roleauth-schema.mof into root/PG_Interop

    Parsing error: parse error: Error adding class VMware_IdentityMemberOfCollection to the repository: CIM_ERR_NOT_FOUND: The requested object could not be found: "VMware_Identity"

    Compiling omc-smash-interop-schema.mof into root/PG_Interop

    Compiling identity-schema.mof into root/cimv2

    Compiling omc-smash-ipmi-schema.mof into root/cimv2

    Compiling omc-smash-schema.mof into root/cimv2

    Compiling roleauth-schema.mof into root/cimv2

    Compiling vmware-schema.mof into root/cimv2

    Compiling config_schema.mof into root/config

    Installing Configuration instances.

    MOF Compiling /var/pegasus/vmware/install_queue/1_files/mofs/root/config/config_ipmi.mof

    MOF Compiling /var/pegasus/vmware/install_queue/1_files/mofs/root/config/config_pegasus_instances.mof

    MOF Compiling /var/pegasus/vmware/install_queue/1_files/mofs/root/config/config_pegasus_quals.mof

    MOF Compiling /var/pegasus/vmware/install_queue/1_files/mofs/root/config/config_schema.mof

    MOF Compiling /var/pegasus/vmware/install_queue/1_files/mofs/root/config/config_smbios.mof

    Installing new Providers.

    MOF Compiling /var/pegasus/vmware/install_queue/1_files/regs/adp-interop_PegReg.mof

    MOF Compiling /var/pegasus/vmware/install_queue/1_files/regs/adp_PegReg.mof

    MOF Compiling /var/pegasus/vmware/install_queue/1_files/regs/battery_PegReg.mof

    MOF Compiling /var/pegasus/vmware/install_queue/1_files/regs/bsp_PegReg.mof

    MOF Compiling /var/pegasus/vmware/install_queue/1_files/regs/composite_PegReg.mof

    MOF Compiling /var/pegasus/vmware/install_queue/1_files/regs/cp-interop_PegReg.mof

    MOF Compiling /var/pegasus/vmware/install_queue/1_files/regs/cp_PegReg.mof

    MOF Compiling /var/pegasus/vmware/install_queue/1_files/regs/cs_PegReg.mof

    MOF Compiling /var/pegasus/vmware/install_queue/1_files/regs/fan_PegReg.mof

    MOF Compiling /var/pegasus/vmware/install_queue/1_files/regs/identity_PegReg.mof

    MOF Compiling /var/pegasus/vmware/install_queue/1_files/regs/ipmi_PegReg.mof

    MOF Compiling /var/pegasus/vmware/install_queue/1_files/regs/pap_PegReg.mof

    MOF Compiling /var/pegasus/vmware/install_queue/1_files/regs/prp_PegReg.mof

    MOF Compiling /var/pegasus/vmware/install_queue/1_files/regs/psp_PegReg.mof

    MOF Compiling /var/pegasus/vmware/install_queue/1_files/regs/raw-ipmi_PegReg.mof

    MOF Compiling /var/pegasus/vmware/install_queue/1_files/regs/roleauth_PegReg.mof

    MOF Compiling /var/pegasus/vmware/install_queue/1_files/regs/smbios_PegReg.mof

    MOF Compiling /var/pegasus/vmware/install_queue/1_files/regs/smp-interop_PegReg.mof

    MOF Compiling /var/pegasus/vmware/install_queue/1_files/regs/smp_PegReg.mof

    MOF Compiling /var/pegasus/vmware/install_queue/1_files/regs/sp-interop_PegReg.mof

    MOF Compiling /var/pegasus/vmware/install_queue/1_files/regs/sp_PegReg.mof

    MOF Compiling /var/pegasus/vmware/install_queue/1_files/regs/swid_PegReg.mof

    MOF Compiling /var/pegasus/vmware/install_queue/1_files/regs/vmware_PegReg.mof

    Done.

    DB:3.09:Problem With Cimom Process At Boot Up a7

    I found the fix.. Just note I did do a search on vmware's site but it didn't bring up anything

    Did a google search and it brought me back to.. http://communities.vmware.com/thread/138706?tstart=0start=0

    ..which was the fix.

  • RELEVANCY SCORE 3.09

    DB:3.09:Eroor When Compiling On Visual Studio 2005 xs


    Hi,I m compiling a c++ code,which works fine on 2003 VS but gives error on 2005 VS.
    The code snippet is:

  • RELEVANCY SCORE 3.08

    DB:3.08:Pl/Sql Code Compilation mp


    I want to know that if there is any PL/SQL commad for compiling the code?
    My problem is, I am working in an environment where we are using a Database tool named TOAD of QUEST Software. Every body can look into the code. I just want to hide this code from others. A Quick reply in this regard will be really very helpful.

    DB:3.08:Pl/Sql Code Compilation mp

    HI,

    Thanks a lot in this regard. It worked.

    Thank you again.

    Syed Iftikhar Ahmed

  • RELEVANCY SCORE 3.08

    DB:3.08:Re: Problem Compiling And Executing m7


    Set it to both

    DB:3.08:Re: Problem Compiling And Executing m7

    Hi,

    Try this

    1. Go to your desktop screen
    2. Select My Computer Icon and Right Click
    3. Select Properties from the Popup Menu
    4. Select Advanced Tab
    5. Click Environment Variables button
    6. Now click New button in the User Variables and enter JAVA_HOME then value C:\ Java Home Directory ( This path may vary from user to user)
    7. Select classpath from System variables then click Edit and add C:\Java Home Directory\lib\tools.jar

    Then apply these changes
    then try your program

    bye for now
    sat

  • RELEVANCY SCORE 3.08

    DB:3.08:Unsafe Code In Asp.Net Site k1


    Hi Guys I met a problem in building an ASP.NET web site that includes an unsafe function.The error said:"Unsafe code may only appear if compiling with /unsafe"I tried to find where I can modify the build switch, but failed.Can you help me?Thanks

    DB:3.08:Unsafe Code In Asp.Net Site k1

    it works on website project in VS2010, the only line i changed is Version=2.0.0.0 to Version=4.0.0.0

  • RELEVANCY SCORE 3.08

    DB:3.08:[Help]Problem With Bmd Simulation k9



    I meet a problem when I simulate the DMA free_ware.

    Here is the excerpt of the Modelsim log showing the errors at elaboration time :

    do simulate_mti.do

    # ** Warning: (vlib-34) Library already exists at "work".# Reading D:\modeltech_6.4d\win32/../modelsim.ini# "work" maps to directory work. (Default mapping)# Model Technology ModelSim SE vlog 6.4d Compiler 2009.03 Mar 16 2009# -- Compiling module boardx04# -- Compiling module sys_clk_gen# -- Compiling module sys_clk_gen_ds# -- Compiling module BMD# -- Compiling module BMD_64_RX_ENGINE# -- Compiling module BMD_64_TX_ENGINE# -- Compiling module BMD_EP_MEM_ACCESS# -- Compiling module BMD_EP_MEM# -- Compiling module BMD_EP# -- Compiling module BMD_INTR_CTRL# -- Compiling module BMD_TO_CTRL# -- Compiling module xilinx_pci_exp_4_lane_ep# -- Compiling module endpoint_blk_plus_v1_5# -- Compiling module glbl# -- Compiling module pci_exp_64b_app# -- Compiling module xilinx_pci_exp_4_lane_downstream_port# -- Compiling module xilinx_pci_exp_4_lane_dsport# -- Compiling module dsport_cfg# -- Compiling module pci_exp_usrapp_rx# -- Compiling module pci_exp_usrapp_tx# -- Compiling module pci_exp_usrapp_com# -- Compiling module pci_exp_usrapp_cfg# -- Compiling module pci_exp_4_lane_64b_dsport# -- Scanning library directory 'D:\Xilinx\10.1\ISE/verilog/src/simprims'# -- Scanning library directory 'D:\Xilinx\10.1\ISE/verilog/src/unisims'# -- Compiling module IBUFDS# -- Compiling module IBUF# -- Compiling module VCC# -- Compiling module GND# -- Compiling module INV# -- Compiling module LUT5# -- Compiling module LUT3# -- Compiling module LUT4# -- Compiling module FDR# -- Compiling module LUT2# -- Compiling module LUT6# -- Compiling module FDC# -- Compiling module FDCE# -- Compiling module FDP# -- Compiling module BUFG# -- Compiling module PLL_ADV# -- Compiling module PCIE_INTERNAL_1_1# -- Compiling module RAMB36_EXP# -- Compiling module RAMB36SDP_EXP# -- Compiling module FDRE# -- Compiling module GTP_DUAL# -- Compiling module LDP_1# -- Compiling module FD# -- Compiling module FDE# -- Compiling module SRLC16E# -- Compiling module MUXF7# -- Compiling module FDRS# -- Compiling module LUT1# -- Compiling module FDRSE# -- Compiling module FDS# -- Compiling module FDSE# -- Compiling module MUXCY# -- Compiling module XORCY# -- Compiling module RAM32X1D# -- Compiling module GT11CLK_MGT# -- Compiling module OBUF# -- Compiling module LUT4_L# -- Compiling module LUT1_L# -- Compiling module LUT2_L# -- Compiling module LUT3_L# -- Compiling module MUXF5# -- Compiling module FDPE# -- Compiling module BUF# -- Compiling module DCM_ADV# -- Compiling module dcm_adv_clock_divide_by_2# -- Compiling module dcm_adv_maximum_period_check# -- Compiling module dcm_adv_clock_lost# -- Compiling module BUFGMUX_VIRTEX4# -- Compiling module MUXCY_L# -- Compiling module SRLC16# -- Compiling module SRL16# -- Compiling module GT11# -- Compiling module RAM16X1D# -- Compiling module SRL16E# -- Compiling module RAMB16_S18_S18# -- Compiling module MULT_AND# -- Compiling module MUXF6# -- Compiling module ARAMB36_INTERNAL# -- Compiling module BUFGCTRL# -- Scanning library directory 'D:\Xilinx\10.1\ISE/smartmodel/nt/wrappers/mtiverilog'# -- Compiling module PCIE_INTERNAL_1_1_SWIFT# -- Compiling module GTP_DUAL_FAST# -- Compiling module GTP_DUAL_SWIFT# -- Compiling module GT11_SWIFT# -- Compiling module PCIE_INTERNAL_1_1_SWIFT_BIT# -- Compiling module GTP_DUAL_FAST_BIT# -- Compiling module GTP_DUAL_SWIFT_BIT# -- Compiling module GT11_SWIFT_BIT# # Top level modules:# boardx04# glbl# vsim +notimingchecks +TESTNAME=sample_smoke_test0 -L work work.boardx04 glbl # ** Note: (vsim-3813) Design is being optimized due to module recompilation...# ** Note: (vsim-3865) Due to PLI being present, full design access is being specified.# Loading D:\Xilinx\10.1\ISE\smartmodel\nt\installed_nt/lib/pcnt.lib/swiftpli_mti.dll# Loading work.boardx04(fast)# Loading work.xilinx_pci_exp_4_lane_ep(fast)# Loading work.IBUFDS(fast)# Loading work.IBUF(fast)# Loading work.pci_exp_64b_app(fast)# Loading work.BMD(fast)# Loading work.BMD_EP(fast)# Loading work.BMD_EP_MEM_ACCESS(fast)# Loading work.BMD_EP_MEM(fast)# Loading work.BMD_64_RX_ENGINE(fast)# Loading work.BMD_64_TX_ENGINE(fast)# Loading work.BMD_INTR_CTRL(fast)# Loading work.BMD_TO_CTRL(fast)# Loading work.endpoint_blk_plus_v1_5(fast)# Loading work.VCC(fast)# Loading work.GND(fast)# Loading work.INV(fast)# Loading work.LUT5(fast)# Loading work.LUT3(fast)# Loading work.LUT4(fast)# Loading work.FDR(fast)# Loading work.LUT2(fast)# Loading work.LUT6(fast)# Loading work.LUT2(fast__1)# Loading work.LUT2(fast__2)# Loading work.LUT2(fast__3)# Loading work.LUT2(fast__4)# Loading work.FDC(fast)# Loading work.FDCE(fast)# Loading work.FDP(fast)# Loading work.BUFG(fast)# Loading work.PLL_ADV(fast)# Loading work.PCIE_INTERNAL_1_1(fast)# Loading work.PCIE_INTERNAL_1_1_SWIFT(fast)# Loading work.PCIE_INTERNAL_1_1_SWIFT_BIT(fast)# Loading work.RAMB36_EXP(fast)# Loading work.ARAMB36_INTERNAL(fast)# Loading work.RAMB36SDP_EXP(fast)# Loading work.ARAMB36_INTERNAL(fast__1)# Loading work.FDRE(fast)# Loading work.GTP_DUAL(fast)# Loading work.GTP_DUAL_FAST(fast)# Loading work.GTP_DUAL_FAST_BIT(fast)# Loading work.GTP_DUAL(fast__1)# Loading work.LDP_1(fast)# Loading work.FD(fast)# Loading work.FD(fast__1)# Loading work.FDE(fast)# Loading work.SRLC16E(fast)# Loading work.MUXF7(fast)# Loading work.RAMB36SDP_EXP(fast__1)# Loading work.ARAMB36_INTERNAL(fast__2)# Loading work.LUT2(fast__5)# Loading work.LUT2(fast__6)# Loading work.FDRS(fast)# Loading work.LUT1(fast)# Loading work.FDRSE(fast)# Loading work.FDS(fast)# Loading work.LUT2(fast__7)# Loading work.FDSE(fast)# Loading work.FDRSE(fast__1)# Loading work.FDE(fast__1)# Loading work.MUXCY(fast)# Loading work.XORCY(fast)# Loading work.FDSE(fast__1)# Loading work.RAM32X1D(fast)# Loading work.xilinx_pci_exp_4_lane_downstream_port(fast)# Loading work.xilinx_pci_exp_4_lane_dsport(fast)# Loading work.GT11CLK_MGT(fast)# Loading work.OBUF(fast)# Loading work.pci_exp_4_lane_64b_dsport(fast)# Loading work.LUT1(fast__1)# Loading work.LUT2(fast__8)# Loading work.LUT4_L(fast)# Loading work.LUT1_L(fast)# Loading work.LUT2_L(fast)# Loading work.LUT2_L(fast__1)# Loading work.LUT2_L(fast__2)# Loading work.LUT3_L(fast)# Loading work.LUT2(fast__9)# Loading work.MUXF5(fast)# Loading work.LUT2_L(fast__3)# Loading work.LUT2_L(fast__4)# Loading work.LUT2_L(fast__5)# Loading work.FDPE(fast)# Loading work.BUF(fast)# Loading work.DCM_ADV(fast)# Loading work.dcm_adv_clock_divide_by_2(fast)# Loading work.dcm_adv_maximum_period_check(fast)# Loading work.dcm_adv_maximum_period_check(fast__1)# Loading work.dcm_adv_clock_lost(fast)# Loading work.BUFGMUX_VIRTEX4(fast)# Loading work.BUFGCTRL(fast)# Loading work.MUXCY_L(fast)# Loading work.LUT2_L(fast__6)# Loading work.SRLC16(fast)# Loading work.SRL16(fast)# Loading work.LUT1_L(fast__1)# Loading work.GT11(fast)# Loading work.GT11_SWIFT(fast)# Loading work.GT11_SWIFT_BIT(fast)# Loading work.GT11(fast__1)# Loading work.GT11(fast__2)# Loading work.LUT2_L(fast__7)# Loading work.RAM16X1D(fast)# Loading work.LUT2_L(fast__8)# Loading work.LUT2_L(fast__9)# Loading work.SRL16E(fast)# Loading work.RAMB16_S18_S18(fast)# Loading work.MULT_AND(fast)# Loading work.MUXF6(fast)# Loading work.dsport_cfg(fast)# Loading work.pci_exp_usrapp_rx(fast)# Loading work.pci_exp_usrapp_tx(fast)# Loading work.pci_exp_usrapp_cfg(fast)# Loading work.pci_exp_usrapp_com(fast)# Loading work.sys_clk_gen_ds(fast)# Loading work.sys_clk_gen(fast)# Loading work.sys_clk_gen_ds(fast__1)# Loading work.sys_clk_gen(fast__1)# Loading work.glbl(fast)# ** Warning: (vsim-PLI-3003) ../board.v(123): [TOFD] - System task or function '$fsdbDumpfile' is not defined.# Region: /boardx04# ** Warning: (vsim-PLI-3003) ../board.v(124): [TOFD] - System task or function '$fsdbDumpvars' is not defined.# Region: /boardx04# ** Warning: (vsim-3015) D:/Xilinx/10.1/ISE/verilog/src/unisims/GTP_DUAL.v(3488): [PCDPC] - Port size (9 or 9) does not match connection size (12) for port 'SIM_PLL_PERDIV2'.# Region: /boardx04/xilinx_pci_exp_4_lane_ep/ep/\BU2/U0/pcie_ep0/pcie_blk/SIO/.pcie_gt_wrapper_i/GTD[2].GT_i /genblk1/gtp_dual_fast_1# ** Warning: (vsim-3015) D:/Xilinx/10.1/ISE/verilog/src/unisims/GTP_DUAL.v(3488): [PCDPC] - Port size (9 or 9) does not match connection size (12) for port 'SIM_PLL_PERDIV2'.# Region: /boardx04/xilinx_pci_exp_4_lane_ep/ep/\BU2/U0/pcie_ep0/pcie_blk/SIO/.pcie_gt_wrapper_i/GTD[0].GT_i /genblk1/gtp_dual_fast_1# ** Warning: (vsim-3015) ../dsport/xilinx_pci_exp_dsport.v(551): [PCDPC] - Port size (5 or 5) does not match connection size (3) for port 'trn_tbuf_av'.# Region: /boardx04/xilinx_pci_exp_4_lane_downstream_port/xilinx_pci_exp_4_lane_dsport/pci_exp_4_lane_64b_dsport# Runtime, LMTV v12.4# Copyright (c) 1984-2009 Synopsys Inc. ALL RIGHTS RESERVED# You can use the Browser tool to configure the SmartModel# Library and access information about SmartModels:# $LMC_HOME/bin/sl_browser# # SmartModel product documentation is available here:# $LMC_HOME/doc/smartmodel/manuals/intro.pdf# http://www.synopsys.com/products/lm/doc/smartmodel.html# # (LMTV) (3006)Error: Model named 'PCIE_INTERNAL_1_1_SWIFT' was not installed at $LMC_HOME/models/PCIE_INTERNAL_1_1_SWIFT for this platform - # $lm_model failed to find model. Verify that instance path is correct.# (LMTV) (3006)Error: Model named 'GTP_DUAL_FAST' was not installed at $LMC_HOME/models/GTP_DUAL_FAST for this platform - # $lm_model failed to find model. Verify that instance path is correct.# (LMTV) (3006)Error: Model named 'GTP_DUAL_FAST' was not installed at $LMC_HOME/models/GTP_DUAL_FAST for this platform - # $lm_model failed to find model. Verify that instance path is correct.# Model gt11_swift: Model Vendor: xilinx'.# Running test {sample_smoke_test0}......# [ 0] : System Reset Asserted...# [ 4995000] : System Reset De-asserted...# [ 8522100] : Transaction Reset Is De-asserted...# Break key hit

    I have changed the file modelsim.ini and comipled the library with the following command:

    compxlib -s mti_se -arch all -lib all -l verilog -w

    but'PCIE_INTERNAL_1_1_SWIFT' and 'GTP_DUAL_FAST' arenot appear in the model list, andsome models are lost too. WHY?

    How to correct the errors? Please help!
    Message Edited by hithust on 06-08-2009 08:51 PMMessage Edited by hithust on 06-09-2009 12:34 AMMessage Edited by hithust on 06-09-2009 01:39 AM

    DB:3.08:[Help]Problem With Bmd Simulation k9


    I don't believe that Modelsim supports SmartModels in 6.4.

    When you use secureip, make sure to add the reference to the library in your vsim command:

    vsim +notimingchecks +TESTNAME=sample_smoke_test0 -L secureip -L work work.boardx04 glbl

  • RELEVANCY SCORE 3.08

    DB:3.08:Recompile Problem 9a


    I am writing some code for both server and client, so ant build file is something like this:

    target name="compile-core" ...

    target name="compile-server" depends="compile-core" ...

    target name="compile-client" depends="compile-core" ...

    The problem is that after compiling either the server or the client, compiling the other one recompiles the core code, which causes some problem later in running the application. My question is why javac recompile the core code (which is not changed at all) and how to stop javac from recompiling the core code.

    Thanks.

    DB:3.08:Recompile Problem 9a

    I actually have something like

    target name="build" depends="compile-server, compile-client" ..

  • RELEVANCY SCORE 3.07

    DB:3.07:Problem Audio Speker Example 1x



    Hi,

    i'm trying to build the example audio_speaker on USB Host with CodeWarrior 10.2 and MQX 3.8 using K60N512 but it's not compiling correctly.

    where is the problem of this example code?

    thanks in advance for reply

  • RELEVANCY SCORE 3.07

    DB:3.07:Team Build With Unsafe Code Problem d9


    My project has some unsafe code exist that I already marked project Allow unsafe code option.  SO I can build it from my machine
    But It cannot build in Team Build Server....the following is error message
    ThemeManager.cs(457,33): error CS0227: Unsafe code may only appear if compiling with /unsafe
    Please help

    DB:3.07:Team Build With Unsafe Code Problem d9

    What does line 11 column 22 corresponds to?  I guess it corresponds to the unicode char.
    Check for the following -
    1) The file is saved properly in Unicode setting.
    2) On build machine, you are able to compile it using msbuild command line mentioned earlier.
    Thanks,
    Gautam

  • RELEVANCY SCORE 3.07

    DB:3.07:Re: Error While Compiling Interface-Odi jp


    Hi Rubita,

    Please paste the code here.

    Thanks,
    Guru

    DB:3.07:Re: Error While Compiling Interface-Odi jp

    Just to add on to what Guru already said ..
    ODI and be used to insert data into not only RDBMS table , it can be used to populate data into files , xml , jms etc
    provided you have a driver for it .

    Thanks,
    Sutirtha

  • RELEVANCY SCORE 3.06

    DB:3.06:Assertion Error! s9


    Hi,
    We are facing one problem when compiling one program using SUN CC 5.1 ( Forte 6 ). This program includes a header file called "timeb.h" which is enclosed in extern "C" ( At the beginning of the file ). While compiling this program we are getting the following errors,

    Assertion: (../links/prepexpression.cc, line 65)while processing src/MultiIntf.cpp at line 0.

    *** Error code 1
    Can any help us on this?

    TIA.
    Natarajan.

    DB:3.06:Assertion Error! s9

    I see this kind of assertion failure occasionally. Unfortunately I don't have a simple answer for you. I am currently having a similar problem. Here is my message:

    Assertion: (../links/bind.cc, line 241)
    while processing /SDE/common/src/lib/Excel/ExcelWorkbook/lib/ExcelWorkbook.cpp at line 0.

    I have found that in the past that simply moving code around in my C++ file can solve the problem. Huh??? Yes, simply moving the code around in the file. Say if you have functions A, B and C appearing in that order in the file. Move them around so that they appear in the file as say, C, A, B. And you might have luck.

    I cannot think of a more useless message than the one above. Something funky was going on when this assertion failed, why can't they give just a bit more information so that we might be able to figure out what is up. Do I ask too much??

    Since my message is slightly different from yours, I'm going to create another topic.

    Does anyone from Sun ever read this stuff??

  • RELEVANCY SCORE 3.06

    DB:3.06:Unchecked Problem While Compiling dx


    When compiling, I get a non-fatal warning, 'unchecked', what ever that means. It is the command flag Xlint-unchecked or something.

    The code is a static hashtable which I am statically putting elements into:

    public static Hashtable variables = new Hashtable();

    static{
    variables.put("###",...);
    //another 30 lines or so of the same...
    }1. What does unchecked mean?
    2. Why does the Hashtable give me this warning?
    3. How can it be fixed?

    Thanks

    DB:3.06:Unchecked Problem While Compiling dx

    This all has to do with the addition of generics to Java 5. Generics allow the specification of data types in the code so that errors (for instance, placing a String value in a hashtable intended to hold Integers) can be detected at compile time rather than run time.

    You are compiling some code that doesn't specify the data type.

    Add the following to the javac option to see the details of the warning. (See the javac documentation.)

    -Xlint:unchecked

    Give more detail for unchecked conversion warnings that are mandated by the Java Language Specification.

    Refer to this for what to do to fix it:
    http://java.sun.com/j2se/1.5.0/docs/guide/language/generics.html

  • RELEVANCY SCORE 3.05

    DB:3.05:Cw Development Studio For Freescale Mpc55xx Version 2.1 - Problems Compiling Sample Code pa


    DB:3.05:Cw Development Studio For Freescale Mpc55xx Version 2.1 - Problems Compiling Sample Code pa

    You can find more information about GCC-Style syntax at http://gcc.gnu.org/onlinedocs/gcc-3.4.0/gcc/Extended-Asm.html#Extended%20Asm Hope this helps...

  • RELEVANCY SCORE 3.05

    DB:3.05:[Solved] Problem Compiling Context Code 1m



    Id like to start learning ConTeXt and Ive just tried to compile a simple hello world:
    \starttext
    Hello world.
    \stoptext

    DB:3.05:[Solved] Problem Compiling Context Code 1m


    Id like to start learning ConTeXt and Ive just tried to compile a simple hello world:
    \starttext
    Hello world.
    \stoptext

  • RELEVANCY SCORE 3.05

    DB:3.05:How To Reduce The Time Of Compiling In Fpga? fm



    I wrote some code for PID control by using FPGA .But only if a little change is in the code,i have to recompile the code .It takesabout 15 minutes per time. It is time-consuming and terrible.

    Could anyone have the good way to fix the problem?

    Thanks

    DB:3.05:How To Reduce The Time Of Compiling In Fpga? fm


    Unfortunately, when you compile for the actual hardware, you are generating a custom application for an entire FPGA which takes time. To reduce the design cycle, use the development features for executing your code on the desktop to quickly find functional issues. After that, you can simulate the code with Xilinx ISIM or Mentors ModelSim to find cycle-level timing issues. At that point, the code should be ready for deployment and hopefully will work on the first compile for hardware.

  • RELEVANCY SCORE 3.05

    DB:3.05:Compiling Java Code From A Running Java Application 1m


    How does compiling of java code from a running java application work?

    I found a class: com.sun.tools.apt.main.JavaCompiler
    but cannot find any documentation of how this class works.

    DB:3.05:Compiling Java Code From A Running Java Application 1m

    Ok, but is there any other way then using Runtime.exec() of doing what I want?

  • RELEVANCY SCORE 3.05

    DB:3.05:Netbeans And Java Compilation k3


    Hi all,

    I got a number of files done by Netbeans but when I use those file for compilation in normal Java (it means not compiling in netbeans but in Java), i got some problem with the code automatically generated by netbeans.

    can anyone help me a solution for the chance of compiling my files (all of them still .java) in normal Java (javac ...) because if not, i will have to do again all the code for UIs :(

    thanks all

    DB:3.05:Netbeans And Java Compilation k3

    thanks for reply.

    when i try to compile in normal command prompt, the part relating to "position" of each component in the frame generated by Netbeans appear to be errors, e.g. "package org.jdesktop.layout does not exist" which means to me that this would be a only-in-netbeans library.

    is there any way for me to link to a specific classpath to get this compilable ?

    and, by the way, i have one more question raised from Netbeans.

    I try to read a .txt (text ) file in Netbeans by placing that file into the "src" folder but netbeans said "FileNotFoundException" and when i try to read the properties of text file, it states "unrecognized file". any idea how to get Netbeans recognise this file???

  • RELEVANCY SCORE 3.05

    DB:3.05:How Can I Compile C Code In Labview At Win98 1s


    friend i am using cin in labview but i am facing problem in compiling c code with labview. plz help me.

    DB:3.05:How Can I Compile C Code In Labview At Win98 1s

    Hi;You need a C compiler in order to compile C code. Specifically to create a CIN, you need specific compilers. The following page includes a list of compilers that support CINs (See point 7):External Code for LabVIEW - CIN / DLL - Starting PointInstructions on how to build a CIN are here:How to build a CIN code resource (.lsb file)The main reference is the manual "Using External Code in LabVIEW", which should be included with LabVIEW.Regards;Enriquewww.visecurity.com



    www.vartortech.com

  • RELEVANCY SCORE 3.05

    DB:3.05:Compiling Source Code In Linux Mode k3



    Hi all,

    I have a problem in compiling my source code in EDK,

    when I select linux as OS and set variables, I can just run libgen, and when I run bulid application, it occures one error which explains

    no boot.o file in $EDK\gnu\powerpc-eabi\nt\powerpc-eabi\lib.

    I test it in EDK 7.1 and 10.1, but result is same.

    how can I compile my source code in mvl3.1 OS mode?

    DB:3.05:Compiling Source Code In Linux Mode k3


    correct you must use the MontaVista SW suite to build a kernel.

    When Linux is selected as the OS, EDK is only used to build the BSP, it is not used to compile source code.

  • RELEVANCY SCORE 3.05

    DB:3.05:Compiling From Textpad 31


    I've got a problem with using TextPad 4.4.0 to write my java code:
    When I'm compiling a class that creates objects of another class, the compiler doesn't know the other class.
    I write every class in his own .java file, but that shouldn't give a problem if there in the same directory.
    Does anyone know what I could be doing wrong here?
    (Using Java 2 SDK, Standard Edition version 1.3.0)

    Please help me!

    DB:3.05:Compiling From Textpad 31

    Good morning...

    i used textpad for a while to write my code (i use jcreator now: www.jcreator.com) and didn't seem to have that problem. obviously textpad is not a java ide, it simply allows you feed your document (i.e.: code) into an external program (i.e.: javac), so you have to be very meticulous about how you configure the external program.

    go into your preferences (configure | preferences), expand the tool section, and select your java compiler. make sure the parameters and path are set properly. you may need to set-up several javac tools if you're working on different projects at the same time with different classpath requirements (it always comes down ot the classpath doesn't it?! :-)

    also check-out textpad's website for java add-ons.

  • RELEVANCY SCORE 3.05

    DB:3.05:Problem Compiling Java Code mj


    Hello,I am running on OIM 11.1.2.1.0 and am trying to write a post process event handler.The code doesn't compile on these lines. Long usrKey = getLongParameterValue(parameters, "usr_key"); //Retrieving the orgKey for the user Long orgKey = getLongParameterValue(parameters, "act_key");What am I missing?ThanksKhanh

    DB:3.05:Problem Compiling Java Code mj

    I hope you are following some sample code.This will help you.http://fusionsecurity.blogspot.in/2011/09/oim-11g-event-handler-example.html~J

  • RELEVANCY SCORE 3.04

    DB:3.04:Jsp El Class Compiling 37


    i am new to web design using java jsp and EL and i have run into a problem.
    Im trying to run examples in a book(from novice to professional J2EE 5).

    When compiling a java class that has expression language within, it gives me a compile error "cannot find symbol".
    The code and package match what the book has and i just dont get what is wrong.

    i have tried compiling with -classpath and it still brings the same error.

    Please help Anyone so i can continue working

    DB:3.04:Jsp El Class Compiling 37

    hey thanks it worked(the last solution you gave me)Glad that you got it working :).

    I hope you do know that i will be pestering you time
    and time again for support That's what this forum its members are for :)

    ram.

  • RELEVANCY SCORE 3.04

    DB:3.04:Compiling A Simple Helloworld Console Program In Vc++ 2010 9j


    i have tried to compile the following code in vc2010 express. the code is
    #include iostream
    using namespace std;
    int main()
    {
    cout Hello,World!;
    return 0;
    }
    after compiling igot the error:required file is missing.please help me solve the problem

    DB:3.04:Compiling A Simple Helloworld Console Program In Vc++ 2010 9j

    Hi Punnareddy,
    Welcome to the MSDN forum.
    I have tested your code on VS Express for desktop 2012 and Visual Studio 2012; it compiles and works well.
    Would you mind post your entire error or a screenshot?
    Have a nice day.
    Regards,Elegentin Xie
    MSDN Community Support | Feedback to us
    Develop and promote your apps in Windows Store
    Please remember to mark the replies as answers if they help and unmark them if they provide no help.

  • RELEVANCY SCORE 3.04

    DB:3.04:Problem During Multi File Optimization Compilation (Code 3) 7z



    Hi everyone,

    I use ifort compiler and while trying compiling megan (emisson model) code i see this error :

    ifort: error: problem during multi-file optimization compilation (code 3)

    Any idea? I use 2 linked libraries (netcdf and ioapi)

    Thanks

    DB:3.04:Problem During Multi File Optimization Compilation (Code 3) 7z


    Ok - thanks. If you encounter "internal compiler error" again, and are using a current compiler version, please let us know.

  • RELEVANCY SCORE 3.04

    DB:3.04:Simulation Problem With Pci Express Endpoint_Pipe V1.7-Help???!! ms



    I have used the modelsim se6.1b+ISE 10.1webpack to do the simulation of PCI-E endpoint_pipe v1.7 example design,the fault occer:

    cd C:/coregen/endpoint_pipe/simulation/functionaldo C:/coregen/endpoint_pipe/simulation/functional/sim​ulate_mti.do# ** Warning: (vlib-34) Library already exists at "work".# Reading C:\Modeltech_6.1b\win32/../modelsim.ini# "work" maps to directory work. (Default mapping)# Model Technology ModelSim SE vlog 6.1b Compiler 2005.09 Sep 8 2005# ** Warning: (vlog-2103) Directory "C:\Xilinx\10.1\ISE/smartmodel/lin/wrappers/mtiver​ilog" for -y option not found.# -- Compiling module px1011a# -- Compiling module boardx01# -- Compiling module sys_clk_gen# -- Compiling module sys_clk_gen_ds# -- Compiling module xilinx_pci_exp_1_lane_epipe_ep# -- Compiling module endpoint_pipe# -- Compiling module glbl# -- Compiling module pci_exp_32b_app# -- Compiling module PIO_EP# -- Compiling module PIO_EP_MEM_ACCESS# -- Compiling module EP_MEM# -- Compiling module PIO_32_RX_ENGINE# -- Compiling module PIO_32_TX_ENGINE# -- Compiling module PIO_TO_CTRL# -- Compiling module PIO# -- Compiling module xilinx_pci_exp_1_lane_downstream_port# -- Compiling module xilinx_pci_exp_1_lane_dsport# -- Compiling module dsport_cfg# -- Compiling module pci_exp_usrapp_rx# -- Compiling module pci_exp_usrapp_tx# -- Compiling module pci_exp_usrapp_com# -- Compiling module pci_exp_usrapp_cfg# -- Compiling module pci_exp_1_lane_64b_dsport# -- Scanning library directory 'C:\Xilinx\10.1\ISE/verilog/src/simprims'# -- Scanning library directory 'C:\Xilinx\10.1\ISE/verilog/src/unisims'# -- Compiling module OBUF# -- Compiling module IBUF# -- Compiling module VCC# -- Compiling module GND# -- Compiling module INV# -- Compiling module FD# -- Compiling module SRL16# -- Compiling module FDE# -- Compiling module SRL16E# -- Compiling module LUT4_L# -- Compiling module LUT4_D# -- Compiling module LUT3_L# -- Compiling module LUT3_D# -- Compiling module LUT2_D# -- Compiling module LUT2_L# -- Compiling module MUXF5# -- Compiling module LUT2# -- Compiling module LUT3# -- Compiling module LUT4# -- Compiling module FDP# -- Compiling module FDR# -- Compiling module BUF# -- Compiling module LUT1# -- Compiling module FDRSE# -- Compiling module FDRE# -- Compiling module FDCE# -- Compiling module FDRS# -- Compiling module FDS# -- Compiling module MUXF6# -- Compiling module MUXCY# -- Compiling module XORCY# -- Compiling module FDSE# -- Compiling module SRLC16E# -- Compiling module RAMB16_S9_S9# -- Compiling module FDPE# -- Compiling module FDC# -- Compiling module RAM16X1D# -- Compiling module FDDRCPE# -- Compiling module BUFG# -- Compiling module DCM# -- Compiling module dcm_clock_divide_by_2# -- Compiling module dcm_maximum_period_check# -- Compiling module dcm_clock_lost# -- Compiling module RAMB16_S36_S36# -- Compiling module GT11CLK_MGT# -- Compiling module LUT1_L# -- Compiling module DCM_ADV# -- Compiling module dcm_adv_clock_divide_by_2# -- Compiling module dcm_adv_maximum_period_check# -- Compiling module dcm_adv_clock_lost# -- Compiling module MUXCY_L# -- Compiling module SRLC16# -- Compiling module GT11# -- Compiling module MULT_AND# -- Compiling module RAMB16_S18_S18# -- Scanning library directory 'C:\Xilinx\10.1\ISE/verilog/src/simprims'# -- Scanning library directory 'C:\Xilinx\10.1\ISE/verilog/src/unisims'# # Referenced (but uncompiled) modules or primitives:# GT11_SWIFT# # Top level modules:# boardx01# glbl# vsim +notimingchecks +TESTNAME=sample_smoke_test0 -L work work.boardx01 glbl # Loading work.boardx01# Loading work.px1011a# Loading work.xilinx_pci_exp_1_lane_epipe_ep# Loading work.OBUF# Loading work.IBUF# Loading work.pci_exp_32b_app# Loading work.PIO# Loading work.PIO_EP# Loading work.PIO_EP_MEM_ACCESS# Loading work.EP_MEM# Loading work.RAMB16_S36_S36# Loading work.PIO_32_RX_ENGINE# Loading work.PIO_32_TX_ENGINE# Loading work.PIO_TO_CTRL# Loading work.endpoint_pipe# Loading work.VCC# Loading work.GND# Loading work.INV# Loading work.FD# Loading work.SRL16# Loading work.FDE# Loading work.SRL16E# Loading work.LUT4_L# Loading work.LUT4_D# Loading work.LUT3_L# Loading work.LUT3_D# Loading work.LUT2_D# Loading work.LUT2_L# Loading work.MUXF5# Loading work.LUT2# Loading work.LUT3# Loading work.LUT4# Loading work.FDP# Loading work.FDR# Loading work.BUF# Loading work.LUT1# Loading work.FDRSE# Loading work.FDRE# Loading work.FDCE# Loading work.FDRS# Loading work.FDS# Loading work.MUXF6# Loading work.MUXCY# Loading work.XORCY# Loading work.FDSE# Loading work.SRLC16E# Loading work.RAMB16_S9_S9# Loading work.FDPE# Loading work.FDC# Loading work.RAM16X1D# Loading work.FDDRCPE# Loading work.BUFG# Loading work.DCM# Loading work.xilinx_pci_exp_1_lane_downstream_port# Loading work.xilinx_pci_exp_1_lane_dsport# Loading work.GT11CLK_MGT# Loading work.pci_exp_1_lane_64b_dsport# Loading work.LUT1_L# Loading work.DCM_ADV# Loading work.dcm_adv_clock_divide_by_2# Loading work.dcm_adv_maximum_period_check# Loading work.dcm_adv_clock_lost# Loading work.MUXCY_L# Loading work.SRLC16# Loading work.GT11# ** Error: (vsim-3033) C:/Xilinx/10.1/ISE/verilog/src/unisims/GT11.v(2563​): Instantiation of 'GT11_SWIFT' failed. The design unit was not found.# Region: /boardx01/xilinx_pci_exp_1_lane_downstream_port/xi​linx_pci_exp_1_lane_dsport/pci_exp_1_lane_64b_dspo​rt/plm_v4f_mgt_gt11_by1_GT11_PCIEXP_2_INST# Searched libraries:# work# work# ** Error: (vsim-3033) C:/Xilinx/10.1/ISE/verilog/src/unisims/GT11.v(2563​): Instantiation of 'GT11_SWIFT' failed. The design unit was not found.# Region: /boardx01/xilinx_pci_exp_1_lane_downstream_port/xi​linx_pci_exp_1_lane_dsport/pci_exp_1_lane_64b_dspo​rt/plm_v4f_mgt_gt11_by1_GT11_PCIEXP_2_INST2# Searched libraries:# work# work# Loading work.MULT_AND# Loading work.RAMB16_S18_S18# Loading work.dsport_cfg# Loading work.pci_exp_usrapp_rx# Loading work.pci_exp_usrapp_tx# Loading work.pci_exp_usrapp_cfg# Loading work.pci_exp_usrapp_com# Loading work.sys_clk_gen_ds# Loading work.sys_clk_gen# Loading work.glbl# Error loading design# Error: Error loading design # Pausing macro execution # MACRO C:\coregen\endpoint_pipe\simulation\functional\sim​ulate_mti.do PAUSED at line 8

    DB:3.04:Simulation Problem With Pci Express Endpoint_Pipe V1.7-Help???!! ms


    Do you know if you compiled your libraries for Modelsim?

    You should see them in your Libraries tab.

    The Libraries that you should see is the "secureip" and "unisims_ver" libraries.

    If you have them compiled, then you need to make sure that your vsim command uses these libraries.

    You'll need to add the following to you vsim command:

    -L unisims_ver

    -L secureip

  • RELEVANCY SCORE 3.04

    DB:3.04:Visual C++ 2008 Source Code Code Page Detection Problem 3f


    It seems that VC 9.0 always detects my source code's code page as cp936, and warning C4819 always pops up. Could I specify the code page of my source code when compiling it? Thanks.

    DB:3.04:Visual C++ 2008 Source Code Code Page Detection Problem 3f

    Or, as I said before, fix GCC:
    Bug33415 - Can't compile .cpp file with UTF-8 BOM.Which version of GCC version are you using?

    Answering policy: see profile.