• RELEVANCY SCORE 3.86

    DB:3.86:Android Sample App Getting Exception "Failed To Connect To Bluetooth Socket" aj






    Hi.

    We are getting this exception "Failed to connecto to bluetooth socket" while trying to print from a motorola XT914 (Android 4.1.2) to intermec PR3, after we migrated our code and intermec sample app from eclipse to Android Studio. We are using the lastestversion of IntermecPrinting SDK. Previously compiled app on eclipse worked fine.

    Thank you in advance.

    DB:3.86:Android Sample App Getting Exception "Failed To Connect To Bluetooth Socket" aj


    Hi.

    We are getting this exception "Failed to connecto to bluetooth socket" while trying to print from a motorola XT914 (Android 4.1.2) to intermec PR3, after we migrated our code and intermec sample app from eclipse to Android Studio. We are using the lastestversion of IntermecPrinting SDK. Previously compiled app on eclipse worked fine.

    Thank you in advance.

  • RELEVANCY SCORE 3.17

    DB:3.17:Adf Mobile: Deploying To Android Device On Osx ck





    While trying to deploy the sample app having almost nothing to an android device from the mountain lion macbook i see the following exception during deployment

    Failed to locate the Google Cloud Messaging for Android Library file named "gcm.jar". (oracle.adfmf.framework.dt.deploy.android.deployers.ValidatePreferencesDeployer)

    Please advise

    DB:3.17:Adf Mobile: Deploying To Android Device On Osx ck

    It does not work in my case.I'm using Mac OS 10.8.4 running 11.1.2.4. I checked the JDeveloper and my ADF mobile is running the latest version:11.1.2.4.39.64.44I'm using Java 1.6_051.I have installed the Google cloud message services. However, it has a word as deprecated showed up. Not sure if that is related.K.

  • RELEVANCY SCORE 3.08

    DB:3.08:Error Building Player: Exception: Android (Invokation Failed) Error: Unknown Error x3






    Hi,


    Also you can downgrade the tools version to r21 by installing:


    http://dl.google.com/android/installer_r21-windows.exe

    DB:3.08:Error Building Player: Exception: Android (Invokation Failed) Error: Unknown Error x3


    If the above fails you like it did me, then try this;


    Go into your assets folder (in your os, not unity), then your plugins folder, and find the folder 'Android'. if you have it there then move it to your desktop ( or delete it, your call ). then try to build your project again.


    This was the thing that finally solved it for me.

  • RELEVANCY SCORE 3.01

    DB:3.01:Android Authentication Failed Message 9j


    Consistently, I am getting the message Authentication Failed on my Android when trying to access Outlook. Getting the original Hotmail app is not an option as when attempting that, one is redirected to the Outlook app. What is the problem here? Thanks.

    DB:3.01:Android Authentication Failed Message 9j

    Hi

    I apologize for the frustrations this issue may have caused you. This issue with authentication is still under investigation by our product group. There is no definite timeframe on when will the fix be released. We will
    update this thread once we receive a feedback from them.

    As a temporary work around you can choose to access your email account using your phone’s native email app or using your phone’s internet browser.

    We appreciate your patience.

    Thanks!

  • RELEVANCY SCORE 2.90

    DB:2.90:Sample Notification App Does Not Work jj


    The sample rich notification API app provided here http://developer.samsung.com/samsung-mobile#rich-notificationdoes not work.

    It fails with the exception:

    Failed to find provider info for com.samsung.accessory.goproviders.sanotificationservice.rich_notifications
    Unknown URL content://com.samsung.accessory.goproviders.sanotificationservice.rich_notification/image

    I'm using Galaxy Gear 2 + Galaxy Note 3.

    Does anyone have a workaround?

    Thanks,
    i

    DB:2.90:Sample Notification App Does Not Work jj

    yes , the restrictions are as follows :

    Devices with Android 4.4 KitKat (API level 19) or higher support Rich Notification.
    Rich Notification requires Gear Manager to connect Wearable Device.

    This content has been quoted from cbartonnhs thought.
    I found your link because I am searching for a Notification sample app.

    My understanding is that the Gear S is the only device that supports Rich Notification. Gear 2 uses the standard notification process described in the Accessory API guide.

  • RELEVANCY SCORE 2.88

    DB:2.88:[C#][Dfs] Service Method ... Invocation Failed 7m



    Hi,

    I have been facing a serious problem for last few days. Some DFS (Create, Checkout, GetCheckoutInfo, etc) throw this exception :

    Service method "Checkout" invocation failed.

    Emc.Documentum.FS.Runtime.Context.Impl.ClientReflectionServiceInvoker.Invoke(Object proxy, MethodInfo method, Object[] args)

    Emc.Documentum.FS.Runtime.Context.Impl.SoapClientInvocationHandler.Invoke(Object proxy, MethodInfo method, Object[] arguments)

    Emc.Documentum.FS.Runtime.Context.Impl.UcfClientInvocationHandler.Invoke(Object proxy, MethodInfo method, Object[] args)

    Emc.Documentum.FS.Runtime.Context.Impl.HttpSessionInvocationHandler.Invoke(Object proxy, MethodInfo method, Object[] args)

    Emc.Documentum.FS.Runtime.Context.Impl.ContextThreadLocalInvocationHandler.Invoke(Object proxy, MethodInfo method, Object[] args)

    Emc.Documentum.FS.Runtime.Context.Impl.ReturnedContentTransformationHandler.Invoke(Object proxy, MethodInfo method, Object[] args)

    Emc.Documentum.FS.Runtime.Context.Impl.ServiceContextInvocationHandler.Invoke(Object proxy, MethodInfo method, Object[] args)

    $Proxy0.Emc.Documentum.FS.Services.Core.IVersiUne exception de premire chance de type 'Emc.Documentum.FS.Runtime.ServiceInvocationException' s'est produite dans Emc.Documentum.FS.Runtime.dll

    onControlService.Checkout(ObjectIdentitySet , OperationOptions )

    Emc.Documentum.FS.Doc.Samples.Client.Runner.SampleContentManager.VersionSampleObjects() dans C:\Documents and Settings\wiperaud\Bureau\DfsDotNetSamples\DotNetSampleRunner\SampleContentManager.cs:ligne 233

    Emc.Documentum.FS.Doc.Samples.Client.Runner.TVersionControlServiceDemo.TestCancelCheckout() dans C:\Documents and Settings\wiperaud\Bureau\DfsDotNetSamples\DotNetSampleRunner\TVersionControlServiceDemo.cs:ligne 63

    Failed with exception Service method "Checkout" invocation failed.

    'DotNetSampleRunner.vshost.exe' (Manag): 'C:\WINDOWS\assembly\GAC_MSIL\System.resources\2.0.0.0_fr_b77a5c561934e089\System.resources.dll' charg

    Une exception de premire chance de type 'Emc.Documentum.FS.Runtime.ServiceInvocationException' s'est produite dans Emc.Documentum.FS.Runtime.dll

    I didn't change my code (in C#) : a few days/weeks ago, everything worked.

    I also tested the DFS Sample runner from the "Documentum Foundation Services(DFS) Getting Started".

    It also failed ( demoRunner.TestCancelCheckout(); )

    In my apllication, some DFS work (ex : IQueryService.Execute() with DQL query)

    I don't understand where this could come from :s

    Another weird behavior : when I invoke the Create method, it fails, but the Object is however created in Documentum... O_o

    DB:2.88:[C#][Dfs] Service Method ... Invocation Failed 7m


    The error in the logs is not linked with the DFS problem.

    I stoped JBoss and ran it again. Now, there is nothing but debug message in my logs.

  • RELEVANCY SCORE 2.82

    DB:2.82:Error When Creating An Override In Powershell 1c


    Iam trying to create a sample override in PowerShell. I started with a sample reported to work, but getting same error whether using it or my own customized code. PowerShell and error listed below. Sample code came from

    http://social.technet.microsoft.com/Forums/en-ZA/operationsmanagergeneral/thread/03342e71-f592-4c6a-85f9-20c6caf21847

    Code:
    $mp = get-managementpack |?{$_.Name -like '*default*'}
    $rule = get-rule -ManagementPack $mp | select -last 1
    $override = New-Object Microsoft.EnterpriseManagement.Configuration.ManagementPackRulePropertyOverride $mp,'TestOverride'
    $override.Rule = $rule
    $override.Value = 'false'
    $override.Context = $rule.Target
    $override.DisplayName = 'Test Override'
    #$mp.verify()
    $mp.AcceptChanges()

    Note: verify is commented out because that does not appear to be a valid method when I look at | get-member output.

    Error:
    Exception calling AcceptChanges with 0 argument(s): Failed to validate item
    [ID=2005Deadlocks.DisableOverride].
    At line:1 char:18
    $mp.AcceptChanges ()
    CategoryInfo : NotSpecified: (:) [], MethodInvocationException
    FullyQualifiedErrorId : DotNetMethodException

    DB:2.82:Error When Creating An Override In Powershell 1c

    While trying to override a group of rules, I got the same error
    Cannot find ManagementPackElement [Type=ManagementPackClass, ID=GUID] in ManagementPack [[myOverrideManagementPack]] or any of its referenced ManagementPacks.).
    I resolved it by exporting the override management pack, and adding references to sealed management packs that contain class declaration. In your case, export the override mp, open it in Authoring Console, and add reference to Microsoft.SQLServer.2008.Discovery
    mp. Save the mp, and import it to your management group.
    Looks quite weird - to create an override by script, you need to add the reference manually. Unfortunately, I didn't find the way to create the reference programmatically.
    Hope this helps.
    Yury

  • RELEVANCY SCORE 2.82

    DB:2.82:Vsperfaspnetcmd Sp 7008: Asp.Net Exception: Http://192.168.0.1/Abc Doesnt Map To A Valid Local Website. z8


    Guys,
    Need a little help with VSPerfASPNetCmd:

    IIS6 Web site listens on 192.168.0.1:80
    All commands below give similar result:
    VSPerfASPNetCmd /sample /output:D:\OutputFile http://192.168.0.1
    VSPerfASPNetCmd /sample /output:D:\OutputFile http://192.168.0.1/
    VSPerfASPNetCmd /sample /output:D:\OutputFile http://192.168.0.1/XXX
    VSPerfASPNetCmd /sample /output:D:\OutputFile http://192.168.0.1:80/XXX
    VSPerfASPNetCmd /sample /output:D:\OutputFile http://192.168.0.1:80/XXX

    Microsoft (R) VSPerf ASP.NET Command, Version 10.0.0.0
    Copyright (C) Microsoft Corporation. All rights reserved.
    Error
    VSP 7008: ASP.net exception: http://192.168.0.1/XXX doesn't map to a valid local website.
    How do I need so specify URL to profile a web site then?

    There is nothing listens on localhost:80 (Default Web Site is stopped)
    But if I run:
    VSPerfASPNetCmd /sample /output:D:\OutputFile http://localhost:80/
    Microsoft (R) VSPerf ASP.NET Command, Version 10.0.0.0
    Copyright (C) Microsoft Corporation. All rights reserved.

    Configuring and attaching to ASP.NET process. Please wait.

    Error
    VSP 7008: ASP.net exception: The web site could not be configured correctly; getting ASP.NET process information failed.
    The server may not be running a version of ASP.NET version 2.0 or greater.
    Requesting 'http://localhost/VSEnterpriseHelper.axd' returned an error: The remote server returned an error: (400) Bad Request.

    However following lines work just fine:
    VSPerfCmd /start:sample /output:OutputFile /user:XXX\XXX /crosssession
    VSPerfCmd /attach:2576
    Except I need to find right w3wp.exe PID, which is difficult since there is whole bunch of them running

    DB:2.82:Vsperfaspnetcmd Sp 7008: Asp.Net Exception: Http://192.168.0.1/Abc Doesnt Map To A Valid Local Website. z8

    Hi,
    I am also having exactly the same problem. The command: vsperfaspnetcmd /s /tip
    http://MyWebApplication.MyCompany.co.ukcauses the following error:

    Microsoft (R) VSPerf ASP.NET Command, Version 10.0.0.0
    Copyright (C) Microsoft Corporation. All rights reserved.
    Error
    VSP 7008: ASP.net exception: http://MyWebApplication.MyCompany.co.uk/ doesn't map to a valid local website.
    I have a development machine on which I debug my application through IIS (rather than running it with F5 and running through casini). I have VS2010 ultimate and have created a web test which passes. I now want to start a profiling session through the command
    line which can analyse whilst my web test is running (The web test tests my application runningas alocal IIS application which is deployed at
    http://myWebApplication.MyCompany.co.uk on my development machine).
    How can I configure the profiler to profile this application?
    Many Thanks!

  • RELEVANCY SCORE 2.79

    DB:2.79:Reliable Messaging Newbie: Getting The Bufferedreceive Sample Working 9z


    I'm attempting to get the BufferedReceive sample working and every time I attempt to run the LoanClient app, I get the following exception:Binding validation failed because the binding's MsmqAuthenticationMode property is set to WindowsDomain but MSMQ is installed with Active Directory integration disabled. The channel factory or service host cannot be opened.I've verified that both MSMQ and Active Direction integration are installed but I'm still receiving this exception. Can I please get some guidance? Thanks!

    Blades Don't Need Reloading...

    DB:2.79:Reliable Messaging Newbie: Getting The Bufferedreceive Sample Working 9z


    Nicholas Allen has a great blog entry that explains the rules for MSMQ Active Directory integration here: http://blogs.msdn.com/drnick/archive/2008/03/03/sending-to-msmq-with-integrated-authentication.aspx
    See if that
    helps .

    The blog entry is very clear. Now I know its rules. Very appreciated.

  • RELEVANCY SCORE 2.74

    DB:2.74:Runsamples Ioexception While Installing Wli 7k



    I'm getting this exception when I try to install the sample application

    [comment] #
    [run] $ setdomain C:\bea\weblogic700\samples\integration\config\samples
    [run] Cannot execute setdomain C:\bea\weblogic700\samples\integration\conf
    ig\samples: java.io.IOException: CreateProcess: .\setdomain.sh C:\bea\weblogic70
    0\samples\integration\config\samples error=2

    RunSamples execution failed: C:\bea\weblogic700\samples\integration\samples\lib\
    RunSamples.xml:91: Cannot execute setdomain C:\bea\weblogic700\samples\integrati
    on\config\samples

    DB:2.74:Runsamples Ioexception While Installing Wli 7k


    I'm getting this exception when I try to install the sample application

    [comment] #
    [run] $ setdomain C:\bea\weblogic700\samples\integration\config\samples
    [run] Cannot execute setdomain C:\bea\weblogic700\samples\integration\conf
    ig\samples: java.io.IOException: CreateProcess: .\setdomain.sh C:\bea\weblogic70
    0\samples\integration\config\samples error=2

    RunSamples execution failed: C:\bea\weblogic700\samples\integration\samples\lib\
    RunSamples.xml:91: Cannot execute setdomain C:\bea\weblogic700\samples\integrati
    on\config\samples

  • RELEVANCY SCORE 2.73

    DB:2.73:Bad Exception Type mp


    i am getting bad exception type in web.xml ClassNotFoundException in weblogic 6.1 while giving exception type in error page tag.
    this works fine in weblogic 6.0

    sample code
    error-page
    exception-type
    java.util.MissingResourceException
    java.io.FileNotFoundException
    java.io.IOException
    java.lang.ArrayIndexOutOfBoundsException
    java.lang.ClassCastException
    java.lang.ClassNotFoundException
    java.lang.IndexOutOfBoundsException
    java.lang.IllegalArgumentException
    java.lang.NullPointerException
    java.lang.NumberFormatException
    java.lang.StringIndexOutOfBoundsException
    java.util.MissingResourceException
    java.util.NoSuchElementException
    java.net.ConnectException
    javax.mail.MessagingException
    /exception-type

    location
    errorinpage.jsp
    /location
    /error-page
    thanks in advance

    DB:2.73:Bad Exception Type mp

    i am getting bad exception type in web.xml ClassNotFoundException in weblogic 6.1 while giving exception type in error page tag.
    this works fine in weblogic 6.0

    sample code
    error-page
    exception-type
    java.util.MissingResourceException
    java.io.FileNotFoundException
    java.io.IOException
    java.lang.ArrayIndexOutOfBoundsException
    java.lang.ClassCastException
    java.lang.ClassNotFoundException
    java.lang.IndexOutOfBoundsException
    java.lang.IllegalArgumentException
    java.lang.NullPointerException
    java.lang.NumberFormatException
    java.lang.StringIndexOutOfBoundsException
    java.util.MissingResourceException
    java.util.NoSuchElementException
    java.net.ConnectException
    javax.mail.MessagingException
    /exception-type

    location
    errorinpage.jsp
    /location
    /error-page
    thanks in advance

  • RELEVANCY SCORE 2.73

    DB:2.73:Audit: Authentication Refused Exception.. mm


    Hi
    I'm using a JDBC Realm on Sun AppServer 8. I have used their LDAP realm, works fine.. but when i try to run this JdbcRealm, it is intialized, but i keep getting this error, I have created my own Jdbc Realm although I followed their sample that comes with the appserver..

    javax.enterprise.system.core.security|_ThreadID=12;|SEC5046: Audit: Authentication refused for [sunny].|#]
    [#|2005-05-11T11:05:34.390-0800|WARNING|sun-appserver-pe8.0.0_01|javax.enterprise.system.container.web|_ThreadID=12;|Web login failed: Login failed: java.lang.ArrayIndexOutOfBoundsException: 31|#]Does anyone has any idea about this exception.. highly appreciated..

    DB:2.73:Audit: Authentication Refused Exception.. mm

    Hi
    I'm using a JDBC Realm on Sun AppServer 8. I have used their LDAP realm, works fine.. but when i try to run this JdbcRealm, it is intialized, but i keep getting this error, I have created my own Jdbc Realm although I followed their sample that comes with the appserver..

    javax.enterprise.system.core.security|_ThreadID=12;|SEC5046: Audit: Authentication refused for [sunny].|#]
    [#|2005-05-11T11:05:34.390-0800|WARNING|sun-appserver-pe8.0.0_01|javax.enterprise.system.container.web|_ThreadID=12;|Web login failed: Login failed: java.lang.ArrayIndexOutOfBoundsException: 31|#]Does anyone has any idea about this exception.. highly appreciated..

  • RELEVANCY SCORE 2.73

    DB:2.73:Packaging Failed 255 Error : Porting Android App - Mac 1c



    Hi,

    I am tring to port android app in blackberry using eclipse-Eclipse Plug-in Tool(Mac Os). I had added blackberry nature and verify apk. I got packaging failed 255 error when click on Blackberry tools - sign for blackberry world. I am unable to run android app in blackberry z10. I check with Android sdk version 2.2 4.2, still i am getting packaging failed error.

    Can anyone please help to resolve..

    Thanks

  • RELEVANCY SCORE 2.72

    DB:2.72:Sample Notification App Does Not Work 3z


    The sample rich notification API app provided here http://developer.samsung.com/samsung-mobile#rich-notificationdoes not work.

    It fails with the exception:

    Failed to find provider info for com.samsung.accessory.goproviders.sanotificationservice.rich_notifications
    Unknown URL content://com.samsung.accessory.goproviders.sanotificationservice.rich_notification/image

    I'm using Galaxy Gear 2 + Galaxy Note 3.

    Does anyone have a workaround?

    Thanks,
    i

    DB:2.72:Sample Notification App Does Not Work 3z

    yes , the restrictions are as follows :

    Devices with Android 4.4 KitKat (API level 19) or higher support Rich Notification.
    Rich Notification requires Gear Manager to connect Wearable Device.

    This content has been quoted from cbartonnhs thought.
    I found your link because I am searching for a Notification sample app.

    My understanding is that the Gear S is the only device that supports Rich Notification. Gear 2 uses the standard notification process described in the Accessory API guide.

  • RELEVANCY SCORE 2.72

    DB:2.72:Controlchanneltrigger With Httpclient Sample Not Working Properly k8



    I downloaded the sample from http://code.msdn.microsoft.com/windowsapps/ControlChannelTrigger-HTTP-9d7a6b3d

    However this sample does not work properly sometimes. I have a webserver (created by Restlet lib) running on Android. The uri http://192.168.137.42:8111/hello/ can be properly accessed in any browsers. In the sample, I can see the request did reached
    the server, but the sample could not process the returned result. the log is:
    =========================
    2/4/2013 05:13:56 PM SetupHttpRequestAndSendToHttpServer started with uri: http://192.168.137.42:8111/hello/
    2/4/2013 05:13:56 PM Calling UsingTransport() ...
    2/4/2013 05:13:56 PM WaitForPushEnabled() completed with status: SoftwareSlotAllocated
    2/4/2013 05:13:56 PM In SetupHttpRequestAndSendToHttpServer httpResponse is prepared to read response from server.
    2/4/2013 05:15:36 PM PushNotifyTask PushNotificationTaskForChannelOne Starting...
    2/4/2013 05:15:36 PM There was no message for this push notification:
    2/4/2013 05:15:36 PM Failed to read from httpresponse with error: System.AggregateException: One or more errors occurred. --- System.Threading.Tasks.TaskCanceledException: A task was canceled.
    --- End of inner exception stack trace ---
    at System.Threading.Tasks.Task.ThrowIfExceptional(Boolean includeTaskCanceledExceptions)
    at System.Threading.Tasks.Task`1.GetResultCore(Boolean waitCompletionNotification)
    at System.Threading.Tasks.Task`1.get_Result()
    at HttpTransportHelper.CommModule.ReadResponse(Task`1 httpResponseTask) in c:\Users\lenovo\Downloads\ControlChannelTrigger HTTP client sample\C#\HttpClientTransportHelper\CommModule.cs:line 145
    --- (Inner Exception #0) System.Threading.Tasks.TaskCanceledException: A task was canceled.---

    2/4/2013 05:15:36 PM Connected!
    2/4/2013 05:15:36 PM RegisterWithCCTHelper Completed.
    2/4/2013 05:15:36 PM CommModule setup result: True
    =======================
    Plus, it takes about 2 minutes to trigger the push notification - I got the sample work for another php websever, the push notification is immediately triggered right after the http response is ready to read.

    Any suggestions?

    DB:2.72:Controlchanneltrigger With Httpclient Sample Not Working Properly k8

    Hi Aaron,
    To reproduce the issue, you need to go http://www.restlet.org/downloads/stable to download the sdk (edition for Android) and start a webserver onAndroidphone. I guess it is a bit complicated.
    Can you tell me howPushNotifyTask is triggered in this example? I can seeAppContext.messageQueue.Enqueue(httpResponseTask);
    So as long as something put into themessageQueue, push notification will be triggered?

    Thanks,

  • RELEVANCY SCORE 2.71

    DB:2.71:Error Creating Registerlistener Bean Of Sample-App 1j



    I got this exception trying to deploy sample-app

    org.springframework.beans.factory.BeanCreationException

    : Error creating bean with name 'registerListeners' defined in class path resource [sample-app-context.xml]: Invocation of init method failed; nested exception is org.springframework.transaction.CannotCreateTransactionException: Could not open JDBC Connection for transaction; nested exception is org.apache.commons.dbcp.SQLNestedException: Cannot create PoolableConnectionFactory (No tables used)

    any help??

    DB:2.71:Error Creating Registerlistener Bean Of Sample-App 1j


    I got this exception trying to deploy sample-app

    org.springframework.beans.factory.BeanCreationException

    : Error creating bean with name 'registerListeners' defined in class path resource [sample-app-context.xml]: Invocation of init method failed; nested exception is org.springframework.transaction.CannotCreateTransactionException: Could not open JDBC Connection for transaction; nested exception is org.apache.commons.dbcp.SQLNestedException: Cannot create PoolableConnectionFactory (No tables used)

    any help??

  • RELEVANCY SCORE 2.70

    DB:2.70:Status Error: Net.Rim.Ajde Code=0 Connection Failed: Connect Timed Out Null d7



    Hi all,

    Im getting "Status ERROR: net.rim.ajde code=0 Connection failed: connect timed out null" while running a project in BB android runtime. How to solve this?

    DB:2.70:Status Error: Net.Rim.Ajde Code=0 Connection Failed: Connect Timed Out Null d7


    This error is due to the slowness of Blackberry simulator

    Please refer this link.http://stackoverflow.com/questions/15986279/blackberry-android-runtime-adb-failedand it worked for me.

  • RELEVANCY SCORE 2.69

    DB:2.69:Javax.Naming.Communicationexception xk



    Hi,Can anybody help me to solve this error:-While trying to do this sample example with jboss 4.2 , ejb 3 ,jdk1.5 thatI found at site:- http://javahowto.blogspot.com/2007/11/simple-ejb-3-on-jboss-application.htmlI am getting the following error when I run the client class---------------------------------------------------------------------------------------------------Exception in thread "main" javax.naming.CommunicationException: Could not obtainconnection to any of these urls: localhost:1099 and discovery failed with error: javax.naming.CommunicationException: Receive timed out [Root exception is java.net.SocketTimeoutException: Receive timed out] [Root exception is javax.naming.CommunicationException: Failed to connect to server localhost:1099 [Root exception is javax.naming.ServiceUnavailableException: Failed to connect to server localhost:1099 [Root exception is java.net.ConnectException: Connection refused: connect]]]at org.jnp.interfaces.NamingContext.checkRef(NamingContext.java:1562)at org.jnp.interfaces.NamingContext.lookup(NamingContext.java:634)at org.jnp.interfaces.NamingContext.lookup(NamingContext.java:627)at javax.naming.InitialContext.lookup(Unknown Source)at foo.Client.main(Client.java:16)Caused by: javax.naming.CommunicationException: Failed to connect to server localhost:1099 [Root exception is javax.naming.ServiceUnavailableException: Failed to connect to server localhost:1099 [Root exception is java.net.ConnectException:Connection refused: connect]]at org.jnp.interfaces.NamingContext.getServer(NamingContext.java:274)at org.jnp.interfaces.NamingContext.checkRef(NamingContext.java:1533)... 4 moreCaused by: javax.naming.ServiceUnavailableException: Failed to connect to serverlocalhost:1099 [Root exception is java.net.ConnectException: Connection refused: connect]at org.jnp.interfaces.NamingContext.getServer(NamingContext.java:248)... 5 moreCaused by: java.net.ConnectException: Connection refused: connectat java.net.PlainSocketImpl.socketConnect(Native Method)at java.net.PlainSocketImpl.doConnect(Unknown Source)at java.net.PlainSocketImpl.connectToAddress(Unknown Source)at java.net.PlainSocketImpl.connect(Unknown Source)at java.net.SocksSocketImpl.connect(Unknown Source)at java.net.Socket.connect(Unknown Source)at java.net.Socket.connect(Unknown Source)at java.net.Socket.(Unknown Source)at java.net.Socket.(Unknown Source)at org.jnp.interfaces.TimedSocketFactory.createSocket(TimedSocketFactory.java:84)at org.jnp.interfaces.TimedSocketFactory.createSocket(TimedSocketFactory.java:77)at org.jnp.interfaces.NamingContext.getServer(NamingContext.java:244)... 5 more-----------------------------------------------------------------------------------------------------------------------When I tried to do the first example of ejb3 in action with Myeclipse,jboss 4.2, ejb 3, jdk1.5I am getting this same error.I am not understanding What I am missing.I will be very thankful if anybody can help me to solve this error...Thanks in advance.sisti

    DB:2.69:Javax.Naming.Communicationexception xk


    Hi,Can anybody help me to solve this error:-While trying to do this sample example with jboss 4.2 , ejb 3 ,jdk1.5 thatI found at site:- http://javahowto.blogspot.com/2007/11/simple-ejb-3-on-jboss-application.htmlI am getting the following error when I run the client class---------------------------------------------------------------------------------------------------Exception in thread "main" javax.naming.CommunicationException: Could not obtainconnection to any of these urls: localhost:1099 and discovery failed with error: javax.naming.CommunicationException: Receive timed out [Root exception is java.net.SocketTimeoutException: Receive timed out] [Root exception is javax.naming.CommunicationException: Failed to connect to server localhost:1099 [Root exception is javax.naming.ServiceUnavailableException: Failed to connect to server localhost:1099 [Root exception is java.net.ConnectException: Connection refused: connect]]]at org.jnp.interfaces.NamingContext.checkRef(NamingContext.java:1562)at org.jnp.interfaces.NamingContext.lookup(NamingContext.java:634)at org.jnp.interfaces.NamingContext.lookup(NamingContext.java:627)at javax.naming.InitialContext.lookup(Unknown Source)at foo.Client.main(Client.java:16)Caused by: javax.naming.CommunicationException: Failed to connect to server localhost:1099 [Root exception is javax.naming.ServiceUnavailableException: Failed to connect to server localhost:1099 [Root exception is java.net.ConnectException:Connection refused: connect]]at org.jnp.interfaces.NamingContext.getServer(NamingContext.java:274)at org.jnp.interfaces.NamingContext.checkRef(NamingContext.java:1533)... 4 moreCaused by: javax.naming.ServiceUnavailableException: Failed to connect to serverlocalhost:1099 [Root exception is java.net.ConnectException: Connection refused: connect]at org.jnp.interfaces.NamingContext.getServer(NamingContext.java:248)... 5 moreCaused by: java.net.ConnectException: Connection refused: connectat java.net.PlainSocketImpl.socketConnect(Native Method)at java.net.PlainSocketImpl.doConnect(Unknown Source)at java.net.PlainSocketImpl.connectToAddress(Unknown Source)at java.net.PlainSocketImpl.connect(Unknown Source)at java.net.SocksSocketImpl.connect(Unknown Source)at java.net.Socket.connect(Unknown Source)at java.net.Socket.connect(Unknown Source)at java.net.Socket.(Unknown Source)at java.net.Socket.(Unknown Source)at org.jnp.interfaces.TimedSocketFactory.createSocket(TimedSocketFactory.java:84)at org.jnp.interfaces.TimedSocketFactory.createSocket(TimedSocketFactory.java:77)at org.jnp.interfaces.NamingContext.getServer(NamingContext.java:244)... 5 more-----------------------------------------------------------------------------------------------------------------------When I tried to do the first example of ejb3 in action with Myeclipse,jboss 4.2, ejb 3, jdk1.5I am getting this same error.I am not understanding What I am missing.I will be very thankful if anybody can help me to solve this error...Thanks in advance.sisti

  • RELEVANCY SCORE 2.69

    DB:2.69:Error In Opening Addins jm


     
    Hi,
     
    Can anyone help me on the following :
     
    1) I am getting an error while opening a Addin in VS 2005 which says Addin failed to load or caused exception') Though it builds successfully. Please advice. Can someone get a modal sample of creating a addin in VS 2005 in VB?
     
    2) How to modify the right click in the solution ( just like we have cut , copy , paste etc).
     
     
    Thanks and Regards,

    DB:2.69:Error In Opening Addins jm

    I am having trouble following your problem.  Can you restate the problem with more explanation?
     
    Also, this seems like a separate issue from the first post so you might want to create a new topic for this.  More people might look at it since this thread is already marked answered.
     

  • RELEVANCY SCORE 2.69

    DB:2.69:Deployment Failed In Opc For Fod Application ps


    Hi, I am a newbie to OPC. I tried deploy FOD (fusion order demo using ADF). Sample application was built on stand alone environment and it runs fine.
    I tried to deploy the same EAR file in Oracle Public Cloud and I am getting following error and deployment fails. Any idea, what needs to be done ?

    Aug 13, 2012 10:17:00 PM oracle.nuviaq.job.Executor executeJob FINE: Starting action Deploy Application Deploy Application started [Deployer:149191]Operation 'deploy' on application 'SF3' is initializing on 'm0' [Deployer:149193]Operation 'deploy' on application 'SF3' has failed on 'm5' [Deployer:149034]An exception occurred for task [Deployer:149026]deploy application SF3 on c1.: [Deployer:149145]Unable to contact 'm5'. Deployment is deferred until 'm5' becomes available.; nested exception is: java.rmi.UnknownHostException: Could not discover administration URL for server 'm5'. [Deployer:149193]Operation 'deploy' on application 'SF3' has failed on 'm6' [Deployer:149034]An exception occurred for task [Deployer:149026]deploy application SF3 on c1.: [Deployer:149145]Unable to contact 'm6'. Deployment is deferred until 'm6' becomes available.; nested exception is: java.rmi.UnknownHostException: Could not discover administration URL for server 'm6'. [Deployer:149193]Operation 'deploy' on application 'SF3' has failed on 'm7' [Deployer:149034]An exception occurred for task [Deployer:149026]deploy application SF3 on c1.: [Deployer:149145]Unable to contact 'm7'. Deployment is deferred until 'm7' becomes available.; nested exception is: java.rmi.UnknownHostException: Could not discover administration URL for server 'm7'. [Deployer:149193]Operation 'deploy' on application 'SF3' has failed on 'm8' [Deployer:149034]An exception occurred for task [Deployer:149026]deploy application SF3 on c1.: [Deployer:149145]Unable to contact 'm8'. Deployment is deferred until 'm8' becomes available.; nested exception is: java.rmi.UnknownHostException: Could not discover administration URL for server 'm8'. [Deployer:149193]Operation 'deploy' on application 'SF3' has failed on 'm1' [Deployer:149034]An exception occurred for task [Deployer:149026]deploy application SF3 on c1.: [Deployer:149145]Unable to contact 'm1'. Deployment is deferred until 'm1' becomes available.; nested exception is: java.rmi.UnknownHostException: Could not discover administration URL for server 'm1'. [Deployer:149193]Operation 'deploy' on application 'SF3' has failed on 'm2' [Deployer:149034]An exception occurred for task [Deployer:149026]deploy application SF3 on c1.: [Deployer:149145]Unable to contact 'm2'. Deployment is deferred until 'm2' becomes available.; nested exception is: java.rmi.UnknownHostException: Could not discover administration URL for server 'm2'. [Deployer:149193]Operation 'deploy' on application 'SF3' has failed on 'm3' [Deployer:149034]An exception occurred for task [Deployer:149026]deploy application SF3 on c1.: [Deployer:149145]Unable to contact 'm3'. Deployment is deferred until 'm3' becomes available.; nested exception is: java.rmi.UnknownHostException: Could not discover administration URL for server 'm3'. [Deployer:149193]Operation 'deploy' on application 'SF3' has failed on 'm4' [Deployer:149034]An exception occurred for task [Deployer:149026]deploy application SF3 on c1.: [Deployer:149145]Unable to contact 'm4'. Deployment is deferred until 'm4' becomes available.; nested exception is: java.rmi.UnknownHostException: Could not discover administration URL for server 'm4'. [Deployer:149193]Operation 'deploy' on application 'SF3' has failed on 'm0' [Deployer:149034]An exception occurred for task [Deployer:149026]deploy application SF3 on c1.: Failed to load webapp: 'StoreFrontModule'. weblogic.application.ModuleException: Failed to load webapp: 'StoreFrontModule' FAILED Application deployment failed. Deploy Application finished Aug 13, 2012 10:17:02 PM oracle.nuviaq.job.Executor executeJob FINE: Action complete: status FAILED

    DB:2.69:Deployment Failed In Opc For Fod Application ps

    Oops.......

    No Ram.....

    But thats not an Out of Box.... from Weblogic.....

    Can you provide me the wls server logs to verify the issue.

    Regards,
    Kal

  • RELEVANCY SCORE 2.68

    DB:2.68:Addon Not Loading - jj



    After following the instructions for loading Android Developer Tools (v22.6.4) and installing Android 4.0.3 (API 15), and the DX650 add on, the add-on does not appear in the Select Build Target list when creating a new sample project. Also, the Android SDK Manager shows the add-on in the extras section with an error stating "Addon failed to load: null"

    What am I missing?

    DB:2.68:Addon Not Loading - jj


    Create a source.properties file in the addon_cisco_dx650_15 directory. Put the following text in the file:

    Addon.NameDisplay=Cisco DX650

    Addon.NameId=addon_cisco_dx650_15

    Pkg.Desc=Cisco DX650 Addon

    Addon.VendorId=Cisco

    Addon.VendorDisplay=Cisco

    Archive.Os=ANY

    Archive.Arch=ANY

    Pkg.Revision=1

    AndroidVersion.ApiLevel=15

    The add-on should load now.

    (Not all of those entries may be necessary, but that's what I put in mine, and it works. The DX650 uses an ARM processor, but ANY covers that.)

  • RELEVANCY SCORE 2.68

    DB:2.68:Set_New_Handler (Standard C++ Library) Is Throwing Exception - Vc6 Throwing Exception az


    // new_set_new_handler.cpp
    // compile with: /EHsc
    #includenew
    #includeiostream

    using namespace std;
    void __cdecl newhandler( )
    {
    cout The new_handler is called: endl;
    throw bad_alloc( );
    return;
    }

    int main( )
    {
    set_new_handler (newhandler);
    try
    {
    while ( 1 )
    {
    new int[5000000];
    cout Allocating 5000000 ints. endl;
    }
    }
    catch ( exception e )
    {
    cout e.what( ) xxx endl;
    }
    }

    Getting the following exception , while running the above program [ The Sample is from MSDN.].
    Assertion failed: new_p == 0, file setnewh.cpp, line 52

    so what can be done this case ?
    Thanks.

    DB:2.68:Set_New_Handler (Standard C++ Library) Is Throwing Exception - Vc6 Throwing Exception az

    explicator wrote:

    Getting the following exception , while running the above program [ The Sample is from MSDN.].

    Assertion failed: new_p == 0, file setnewh.cpp, line 52

    If you look at setnewh.cpp, you'll see this comment:
    * WARNING: set_new_handler is a stub function that is provided to
    * allow compilation of the Standard Template Library (STL).
    *
    * Do NOT use it to register a new handler. Use _set_new_handler instead.
    Realize that VC6 is 14 years old.

    Igor Tandetnik

  • RELEVANCY SCORE 2.66

    DB:2.66:Rfc_Error_System_Failure: Exception Condition "Failed" Bi Iview dz



    Hi,

    When i preview my Bi query on portal i am getting following exception :

    RFC_ERROR_SYSTEM_FAILURE: Exception condition "FAILED" raised

    Earlier i had already published some query which is working properly, but the new one which i am publishing now is giving me above exception.

    Regards,

    Jigar Oza

    DB:2.66:Rfc_Error_System_Failure: Exception Condition "Failed" Bi Iview dz


    Hi,

    Make sure that the Portal System which you are using to connect to Backend BI System is working fine. Also nake sure that whether you have made any changes to your BI System like change in Logical System Name etc.. It's amy also affect your Connectivity.

    And let us know the result. Hope this will help.

    Regards,

    Baskar.N

  • RELEVANCY SCORE 2.65

    DB:2.65:While Scheduling The Webi Report Through Email Getting Exception Raised: Java.Lang.Exception a1



    Hi All,

    while scheduling the webi report through email getting exception raised: java.lang.Exception.While trying for InBox option getting succsess the Instance,but through email option getting error.

    Title:
    Sample Report
    Document Type:
    Microsoft Excel
    Status
    Failed
    Destination:
    Owner:

    Creation Time:

    Start Time:

    End Time:

    Server Used:

    PID:

    Parent Object Path:

    Remote Instance in Federated Cluster:

    Expiry:
    Formats:
    Microsoft Excel
    Parameters:
    Error Message:
    exception raised: java.lang.Exception

  • RELEVANCY SCORE 2.64

    DB:2.64:Error While Executing Adobe Form 1z



    Hi all,

    I am getting the error as "
    SOAP Framework Error: soap runtime exception: Csoapexceptiontransport: http send failed with exception communication_failure(100.101)" when I execute the sample adobe form (Transaction SPF).

    I am unable to trace the cause of error. Please guide.

    Thanks,
    Kris.

    DB:2.64:Error While Executing Adobe Form 1z


    Hi murali,

    I believe, somewhere your binding of some element is causing the error. Trying deleting some of the elements and execute. backup before deletion. I had faced this issue earlier.

    Jay

  • RELEVANCY SCORE 2.64

    DB:2.64:Invoke Https Webservice 3a



    Hi,I am new to JBOSS ESB. I am trying to invoke an external webservice that is secure using https.When i deploy this webservice i am getting exception "Caused by: org.jboss.soa.esb.ConfigurationException: Failed to locate keystore '/keystore'."I tried to follow sample security_cert but still the same error.Can you please help what to do in case of invoking external web service that is secured (https)?Where should i put keystore for it to be located?thankscm

    DB:2.64:Invoke Https Webservice 3a


    Hi,I am new to JBOSS ESB. I am trying to invoke an external webservice that is secure using https.When i deploy this webservice i am getting exception "Caused by: org.jboss.soa.esb.ConfigurationException: Failed to locate keystore '/keystore'."I tried to follow sample security_cert but still the same error.Can you please help what to do in case of invoking external web service that is secured (https)?Where should i put keystore for it to be located?thankscm

  • RELEVANCY SCORE 2.63

    DB:2.63:Ftps Connectivity Issues / Setup fa


    I have been working with a VAN on establishing a passive FTPS connection with them utilizing the FTPS eWay. I think I have set up a sample project (proof-of-concept) to test that I can login to their FTPS and to a directory listing. In the log file, I am getting the following error and I am wondering if you can validate my assumptions about their certificate. For now, I am storing the certificate in the cacerts under logicalhost/jre/bin/security. Here is the exceptions that I am getting:

    Exception during logon, e=Cannot conclude ssl handshake. Cause: sun.security.validator.ValidatorException: PKIX path validation failed: java.security.cert.CertPathValidatorException: basic constraints check failed: this is not a CA certificate.

    Batch FTP Over SSL eWay connection initialization error, message=[Exception during logon, e=Cannot conclude ssl handshake. Cause: sun.security.validator.ValidatorException: PKIX path validation failed: java.security.cert.CertPathValidatorException: basic constraints check failed: this is not a CA certificate.

    Error message: Exception during logon, e=Cannot conclude ssl handshake. Cause: sun.security.validator.ValidatorException: PKIX path validation failed: java.security.cert.CertPathValidatorException: basic constraints check failed: this is not a CA certificate.

    [#|2008-01-21T09:50:37.188-0600|INFO|IS5.1.3|STC.eWay.framework.management.com.stc.connector.management.util.Alerter|_ThreadID=13; ThreadName=JMS Async S0; Context=dpTestFTPS_POC/Queue1_CMap1_jcdFTPS_POC1_ejb;|sendAlert(), connection info: ConnectionInfo [ collaboration: CMap1_jcdFTPS_POC1, project: FTPS POC, component: BatchFTPOverSSL, deployment: dp, environment: ferron1john, logicalhost: LogicalHost1, integration server: IntegrationSvr1, project path: project path not set ], monitor: ObjectReference [ name: SeeBeyond:GUID={0A000000-001A6B88170100-0A010D52-01},Name=dpTestFTPS_POC|FTPS POC|dp|CMap1_jcdFTPS_POC1_BatchFTPOverSSL ], alert message: Batch FTP Over SSL eWay connection initialization error, message=[Exception during logon, e=Cannot conclude ssl handshake. Cause: sun.security.validator.ValidatorException: PKIX path validation failed: java.security.cert.CertPathValidatorException: basic constraints check failed: this is not a CA certificate.

    Has anyone else had this problem with the FTPS eWay?

    John

    DB:2.63:Ftps Connectivity Issues / Setup fa

    CorZijlstra,

    You are talking about the wrong secure FTP protocol. SFTP (FTP over SSH) is fairly easy to set up in CAPS. All you need to make sure you do is to convert the SFTP key to IETF format. FTPS (FTP over SSL) is a different problem altogether. Here is a follow-up I posted on IToolbox about my experience.

    Since I have recently had experience trying to get FTPS to work here at my company with CAPS 5.1.3 non u1, I will give you my doctoral dissertation (aka, brain dump) on the experience.

    If you have already tested with openssl (with UNIX or cygwin) or you've had this working previously, you can skip this step.

    1.) Install openssl, (found at http://www.openssl.org/) and run the following command:

    a. openssl s_client -showcerts -starttls ftp -connect your_IP_or_DNS_entry_HERE

    What this step should do is show you the certificates from the FTP server you are trying to connect to. If you get an error similar to this and you do not see the certs, there is a problem with your firewall

    CONNECTED(00000003)
    depth=1 /O=VeriSign Trust Network/OU=VeriSign, Inc./OU=VeriSign
    International Server CA - Class 3/OU=www.verisign.com/CPS Incorp.by Ref.
    LIABILITY LTD.(c)97 VeriSign
    verify error:num :unable to get local issuer certificate verify return:0
    4064:error:0407006A:rsa routines:RSA_padding_check_PKCS1_type_1:block type is not 01:rsa_pk1.c:100:
    4064:error:04067072:rsa routines:RSA_EAY_PUBLIC_DECRYPT:padding check failed:rsa_eay.c:699:
    4064:error:1408D07B:SSL routines:SSL3_GET_KEY_EXCHANGE:bad signature:s3_clnt.c:1414:

    If your firewall is doing NAT from your corporate IP to your desktop/server IP, the problem probably lies there. I know that Checkpoint has issues with performing FTPS along with trying to NAT the IP's. I would suggest googleyour Firewall provider and FTPS and see if there are any issues.

    2.) If you are one of the lucky few to get this to work. You first need to add the server certificates into the keystore.jks out on the logicalhost under the is/domains/domain-name/config directory.
    3.) Then add the client certificate to the cacerts.jks keystoreunder the same copy. Make copies of both keystores before doing this.
    a. To add them, you can use a keystore GUI if you have one, or the keytool command that comes with java. The keytool command is documented on the web and in the BatchFTP PDF.

    I would assume if you get past this step, you are golden. Put your credentials and connectivity information in the environment explorer and deploy away. As I stated earlier, I could not get this to work.Furthermore, I lost 6 wasted weeks of my life trying to get this to work.Regards,

    John

  • RELEVANCY SCORE 2.63

    DB:2.63:Office Web Apps Configuration Failed: User Cannot Be Found ( Local User Accounts) 8j


    Hi

    I am doing a test run for a client on a supplied VM. Now, this VM has SharePoint 2010 installed with local accounts - no probs normally. I have just run through the office web apps installation , then run theconfigurationwizard. Unfortunately,
    I am getting the following error

    Failed to create sample data
    An exception of type Microsoft.SharePoint.SPException was thrown.Additionalexception information: User cannot be found.

    I wonder if I am using aunsupportedscenario and I should attach an DC to this VM.

    cheers
    Daniel, WSL

    DB:2.63:Office Web Apps Configuration Failed: User Cannot Be Found ( Local User Accounts) 8j

    Paul

    I am also inclined to agree with on this as well. Anyway, I will shortly pass on your words on to the team and will then hide under my desk and behind a layer of sandbags, if they want to get into a heated argument!

    Regards

    Daniel

  • RELEVANCY SCORE 2.63

    DB:2.63:Unable To Determine The Tools Version Of The Android Sdk 8x



    I tried installing 4.1.2 of unity and got this error:


    Error building Player: Exception: android (invokation failed) ERROR: unknown error cmd:android list target -c stdout; stderr: Exception in thread main java.lang.NullPointerException at SDKMain.main(SDKMain.java:62)

    DB:2.63:Unable To Determine The Tools Version Of The Android Sdk 8x


    I tried installing 4.1.2 of unity and got this error:


    Error building Player: Exception: android (invokation failed) ERROR: unknown error cmd:android list target -c stdout; stderr: Exception in thread main java.lang.NullPointerException at SDKMain.main(SDKMain.java:62)

  • RELEVANCY SCORE 2.63

    DB:2.63:Invalidcastexception On Lyncclient.Getclient() 83


    I cget an exception onLyncClient.GetClient() - I've tried this one two different machines, and I'm getting the same results. Here arethe details:

    Visual Studio 2012Lync 2013 Client installed, with silverlight (part of Office 2013), and running/signed inLync 2013 SDK installed
    I've first tried writing my own test project, but I'm also getting the same error on the sample projects (sample project: ContactInformation, MainWindow.xaml.cs, line 66). Here's the exception details:
    InvalidCastException: Unable to cast COM object of type 'System.__ComObject' to interface type 'Microsoft.Office.Uc.UCOfficeIntegration'. This operation failed because the QueryInterface call on the COM component for the interface with IID '{6A222195-F65E-467F-8F77-EB180BD85288}'
    failed due to the following error: No such interface supported (Exception from HRESULT: 0x80004002 (E_NOINTERFACE)).
    Stack Trace: at Microsoft.Lync.Model.LyncClient.EnsureOI()
    at Microsoft.Lync.Model.LyncClient.GetClient()
    at ContactInformation.MainWindow.Window_Loaded(Object sender, RoutedEventArgs e) in c:\Program Files (x86)\Microsoft Office\Office15\LyncSDK\samples\ContactInformation\MainWindow.xaml.cs:line 66

    Note: I've also tried adding a reference to C:\Program Files (x86)\Microsoft Office\Office15\LyncSDK\Assemblies\Desktop\Microsoft.Office.Uc.dll
    When doing the GetClient(), I get the following exception, instead: The type initializer for 'Microsoft.Lync.Model.LyncClient' threw an exception.
    InnerException:
    {Could not load file or assembly 'Microsoft.Office.Uc, Version=15.0.4454.1509, Culture=neutral, PublicKeyToken=71e9bce111e9429c' or one of its dependencies. The system cannot find the file specified.:Microsoft.Office.Uc, Version=15.0.4454.1509,
    Culture=neutral, PublicKeyToken=71e9bce111e9429c}

    DB:2.63:Invalidcastexception On Lyncclient.Getclient() 83

    the updated runtime dll is installed with the developer SDK. For Lync 2010, find the runtime at: C:\Program Files (x86)\Microsoft Lync\SDK\Redist
    For Lync 2013, find it at: C:\Program Files\Microsoft Office\Office15\LyncSDK\Redist
    John Austin Senior Programming Writer Microsoft

  • RELEVANCY SCORE 2.63

    DB:2.63:Sample Web Provider Register Failed... pd


    Error: An error occurred when attempting to call the providers register function. (WWC-43134)
    An unexpected error occurred: ORA-29532: Java call terminated by uncaught Java exception: java.net.UnknownHostException: hosta (WWC-43000)
    An unexpected error occurred: java.net.UnknownHostException: hosta
    at java.net.InetAddress.getAllByName0(InetAddress.java)
    at java.net.InetAddress.getAllByName0(InetAddress.java)
    at java.net.InetAddress.getAllByName(InetAddress.java)
    at HTTPClient.HTTPConnection$EstablishConnection.run(HTTPConnection.java:3658)
    (WWC-43000)

    I am getting the above error while registering the sample web provider.

    But, url http://hosta/servlets/sample
    is working successfully...

    DB:2.63:Sample Web Provider Register Failed... pd

    I have a similar problem where I have portal installed on a machine called portal.mgmt, which is on a network that users cannot access. Connection to portal.mgmt can only be made from our local network via a machine called install.mgmt. In a sense I guess it is acting like a reverse proxy or firewall.

    I have run ssodatan on portal providing the install.mgmt URL and can access most of Portal pages navigating to http://install.mgmt/ except any of the servlets. Actually the only servlet I can access is the sample IsItWorking servlet.

    In my java jserv.log file I am getting the following error:

    java.net.SocketException: Connection reset by peer
    at java.net.PlainSocketImpl.socketAvailable(Native Method)

    I can only assume, from reading the Troubleshooting guide as mentioned above, that portal.mgmt is trying to make a separate connection to the install.mgmt box and is failing.

    The network between portal.mgmt and install.mgmt is very restricted as to what can be run and what protocols and ports can be used. Is this restriction causing the problem?

    I see that Jserv uses port 8007, is this port used to communicate between machines?
    Are there any ports that need to be opened?

    I have tried using another machine called ogg as the firewall/access server and get the following error as well.

    java.net.UnknownHostException: ogg
    at java.lang.Throwable.fillInStackTrace(Native Method)

    Any help on this one would be very much appreciated, as I am very stuck at the minute.

    Regards,

    Garry

  • RELEVANCY SCORE 2.62

    DB:2.62:Jboss Esb 4.8 Jboss As 5.1.0.Ga md



    Hi All

    I'm a new bee in ESB. Installed ESB in jboss 5.1.0 GA. Couldn't run sample program "helloworld"

    into my jboss as using ant after deployment.

    1. I'm using windows XP and my application server location is in "c:\jboss" and esb related files

    has been installed in "C:\jboss\server\default\deploy"

    2. I can access "http://localhost:8080/" after starting JBoss as.

    3. Deployed program is in "C:\jboss\server\default\deploy\Quickstart_helloworld.esb"

    I'm getting following error:

    *************

    runtest: [echo] Runs Test JMS Sender [java] Exception in thread "main" javax.naming.CommunicationException: Could not obtain connection to any of these urls: 127.0.0.1:1099 and discovery failed with error: javax.naming.CommunicationException: Receive timed out [Root exception is java.net.SocketTimeoutException: Receive timed out][Root exception is javax.naming.CommunicationException: Failed to connect to server /127.0.0.1:1099[Root exception is javax.naming.ServiceUnavailableException: Failed to connect to server /127.0.0.1:1099 [Root exception is java.net.ConnectException: Connection refused: connect]]] [java] at org.jnp.interfaces.NamingContext.checkRef(NamingContext.java:1763) [java] at org.jnp.interfaces.NamingContext.lookup(NamingContext.java:693) [java] at org.jnp.interfaces.NamingContext.lookup(NamingContext.java:686) [java] at javax.naming.InitialContext.lookup(InitialContext.java:392) [java] at org.jboss.soa.esb.samples.quickstart.helloworld.test.SendJMSMessage.setupConnection(SendJMSMessage.java:52) [java] at org.jboss.soa.esb.samples.quickstart.helloworld.test.SendJMSMessage.main(SendJMSMessage.java:81) [java] Caused by: javax.naming.CommunicationException: Failed to connect to server /127.0.0.1:1099 [Root exception is javax.naming.ServiceUnavailableException: Failed to connect to server /127.0.0.1:1099 [Root exception is java.net.ConnectException: Connection refused: connect]] [java] at org.jnp.interfaces.NamingContext.getServer(NamingContext.java:335) [java] at org.jnp.interfaces.NamingContext.checkRef(NamingContext.java:1734) [java] ... 5 more [java] Caused by: javax.naming.ServiceUnavailableException: Failed to connect to server /127.0.0.1:1099 [Root exception is java.net.ConnectException: Connection refused: connect] [java] at org.jnp.interfaces.NamingContext.getServer(NamingContext.java:305) [java] ... 6 more [java] Caused by: java.net.ConnectException: Connection refused: connect [java] at java.net.PlainSocketImpl.socketConnect(Native Method) [java] at java.net.PlainSocketImpl.doConnect(PlainSocketImpl.java:333) [java] at java.net.PlainSocketImpl.connectToAddress(PlainSocketImpl.java:195) [java] at java.net.PlainSocketImpl.connect(PlainSocketImpl.java:182) [java] at java.net.SocksSocketImpl.connect(SocksSocketImpl.java:366) [java] at java.net.Socket.connect(Socket.java:519) [java] at org.jnp.interfaces.TimedSocketFactory.createSocket(TimedSocketFactory.java:97) [java] at org.jnp.interfaces.TimedSocketFactory.createSocket(TimedSocketFactory.java:82) [java] at org.jnp.interfaces.NamingContext.getServer(NamingContext.java:301) [java] ... 6 more

    *******************

    Please help.

    DB:2.62:Jboss Esb 4.8 Jboss As 5.1.0.Ga md


    Hi All

    I'm a new bee in ESB. Installed ESB in jboss 5.1.0 GA. Couldn't run sample program "helloworld"

    into my jboss as using ant after deployment.

    1. I'm using windows XP and my application server location is in "c:\jboss" and esb related files

    has been installed in "C:\jboss\server\default\deploy"

    2. I can access "http://localhost:8080/" after starting JBoss as.

    3. Deployed program is in "C:\jboss\server\default\deploy\Quickstart_helloworld.esb"

    I'm getting following error:

    *************

    runtest: [echo] Runs Test JMS Sender [java] Exception in thread "main" javax.naming.CommunicationException: Could not obtain connection to any of these urls: 127.0.0.1:1099 and discovery failed with error: javax.naming.CommunicationException: Receive timed out [Root exception is java.net.SocketTimeoutException: Receive timed out][Root exception is javax.naming.CommunicationException: Failed to connect to server /127.0.0.1:1099[Root exception is javax.naming.ServiceUnavailableException: Failed to connect to server /127.0.0.1:1099 [Root exception is java.net.ConnectException: Connection refused: connect]]] [java] at org.jnp.interfaces.NamingContext.checkRef(NamingContext.java:1763) [java] at org.jnp.interfaces.NamingContext.lookup(NamingContext.java:693) [java] at org.jnp.interfaces.NamingContext.lookup(NamingContext.java:686) [java] at javax.naming.InitialContext.lookup(InitialContext.java:392) [java] at org.jboss.soa.esb.samples.quickstart.helloworld.test.SendJMSMessage.setupConnection(SendJMSMessage.java:52) [java] at org.jboss.soa.esb.samples.quickstart.helloworld.test.SendJMSMessage.main(SendJMSMessage.java:81) [java] Caused by: javax.naming.CommunicationException: Failed to connect to server /127.0.0.1:1099 [Root exception is javax.naming.ServiceUnavailableException: Failed to connect to server /127.0.0.1:1099 [Root exception is java.net.ConnectException: Connection refused: connect]] [java] at org.jnp.interfaces.NamingContext.getServer(NamingContext.java:335) [java] at org.jnp.interfaces.NamingContext.checkRef(NamingContext.java:1734) [java] ... 5 more [java] Caused by: javax.naming.ServiceUnavailableException: Failed to connect to server /127.0.0.1:1099 [Root exception is java.net.ConnectException: Connection refused: connect] [java] at org.jnp.interfaces.NamingContext.getServer(NamingContext.java:305) [java] ... 6 more [java] Caused by: java.net.ConnectException: Connection refused: connect [java] at java.net.PlainSocketImpl.socketConnect(Native Method) [java] at java.net.PlainSocketImpl.doConnect(PlainSocketImpl.java:333) [java] at java.net.PlainSocketImpl.connectToAddress(PlainSocketImpl.java:195) [java] at java.net.PlainSocketImpl.connect(PlainSocketImpl.java:182) [java] at java.net.SocksSocketImpl.connect(SocksSocketImpl.java:366) [java] at java.net.Socket.connect(Socket.java:519) [java] at org.jnp.interfaces.TimedSocketFactory.createSocket(TimedSocketFactory.java:97) [java] at org.jnp.interfaces.TimedSocketFactory.createSocket(TimedSocketFactory.java:82) [java] at org.jnp.interfaces.NamingContext.getServer(NamingContext.java:301) [java] ... 6 more

    *******************

    Please help.

  • RELEVANCY SCORE 2.62

    DB:2.62:Unknown Error With Some Exception Message In Bam 7x


    Hi all

    I'm trying to deploy orderbooking tutorial in (SOA 10.1.3.1)of BAM guide. whereas message says

    A problem occured while connecting to server "localhost" using port "8888": bpel_OrderBooking_1.0.jar failed to deploy. Exception message is: javax.transaction.RollbackException: Timed out

    i'm not able to fingd out whats the error.kindly someone revert back what may be the exception and also in pre-build.xml getting some error in ant dir saying

    Basedir C:\bb\CreditRatingService does not exist

    Kindly someone revert for this issue. Not able to complete a sample tutorial also.

    thanks in advance

    DB:2.62:Unknown Error With Some Exception Message In Bam 7x

    Hello- This looks like a problem deploying the BPEL side of OrderBooking tutorial. Please post your question on the BPEL email alias/forum. Your errors will be in bpel llog directory.

  • RELEVANCY SCORE 2.62

    DB:2.62:Apk Builder Failed 8j



    Unity 3D com AMRv6 with VFP s vai conseguir compilar games para androide se a verso do Android SDK for inferior a Revision 22. Tente baixar a Android SDK revision 20, nela existe o arquivo apkbuilder.bat, copie e cole toda pasta tools em seu diretrio do Android SDK. Qualquer dvida segue link tutorial http://eciosf.wordpress.com/2013/06/27/solucao-exception-error-building-player-win32exception-apkbuilder-bat/

    DB:2.62:Apk Builder Failed 8j


    Look here: http://forum.unity3d.com/threads/107511-Problem-on-APK-Building


    maybe can help ya. -_^

  • RELEVANCY SCORE 2.62

    DB:2.62:Error Building Player: Exception: Android (Invokation Failed) x7



    It looks like Unity Android builds break when using the latest Android SDK.


    Please check this link. http://forum.unity3d.com/threads/176737-unknown-error-when-building-simple-scene

    DB:2.62:Error Building Player: Exception: Android (Invokation Failed) x7


    As mentioned by jvil in the forum thread:



    copy the content from folder:

    android-sdk/build-tools/17.0.0/


    to

    android-sdk/platform-tools/


  • RELEVANCY SCORE 2.61

    DB:2.61:Error While Developing Sap Netweaver Mobile App cj



    Hi All,

    I am developing Sample NetWeaver Gateway Application Application in android.

    I am able to connect directly to Gateway Server and I am getting Data on my Android Device.

    When I connect via SUP Server, I get Error While Making Request.

    Android Log is:

    01-10 17:53:23.859: E/MDP(707): zAlQO90g (com.sybase.mobile.lib.client.SUPServerRmiCalls:makeRequest:246) Exception while making request

    01-10 17:53:23.859: E/MDP(707): Error: 553 Message: 'readByte: unexpected EOF'

    01-10 17:53:23.859: E/MDP(707): at com.sybase.mo.MoObject.ConvertTmExceptionToMoException(MoObject.java:868)

    01-10 17:53:23.859: E/MDP(707): at com.sybase.mo.MoObject.execute(MoObject.java:683)

    01-10 17:53:23.859: E/MDP(707): at com.sybase.mobile.lib.client.SUPServerRmiCalls.makeRequest(SUPServerRmiCalls.java:158)

    01-10 17:53:23.859: E/MDP(707): at com.sybase.mobile.lib.client.SUPServerRmiCalls.makeRequest(SUPServerRmiCalls.java:243)

    01-10 17:53:23.859: E/MDP(707): at com.sybase.mobile.lib.client.IMOConnectionFactory.makeRequest(IMOConnectionFactory.java:305)

    01-10 17:53:23.859: E/MDP(707): at com.sybase.mobile.lib.client.IMOConnectionHandler.performRequest(IMOConnectionHandler.java:335)

    01-10 17:53:23.859: E/MDP(707): at com.sybase.mobile.lib.client.IMOConnectionHandler.makeHttpRequest(IMOConnectionHandler.java:176)

    01-10 17:53:23.859: E/MDP(707): at com.sap.mobile.lib.sdmconnectivity.AbstractConnectionHandler.processRequestType(AbstractConnectionHandler.java:193)

    01-10 17:53:23.859: E/MDP(707): at com.sap.mobile.lib.sdmconnectivity.AbstractConnectionHandler.processRequestsFromQueue(AbstractConnectionHandler.java:128)

    01-10 17:53:23.859: E/MDP(707): at com.sybase.mobile.lib.client.IMOConnectionHandler.run(IMOConnectionHandler.java:97)

    Domain Logs:

    Error=java.lang.SecurityException was thrown by method com.sybase.djc.mobilink.LoginHandler:authenticateUser(String user, String password, String securityConfiguration)\njava.lang.SecurityException: Login Failed: user '@HTTPconnection'. Account is locked due to previous login failures. Account will be unlocked in 59 seconds.

    I chcked my Account Credentials of GW system n SUP. They are not locked.

    SUP Server Configurations are:

    I maintained Application Endpoint As : http://(Gateway Server IP ):(Gateway Server Port )/sap/opu/odata/sap/Z_BANK_SERVICE_372/

    Application ID is created.

    Connection Parameters On Android App:

    1. SUP Host Name

    2. SUP Port Number

    3. Security Config

    4. Farm ID

    5. base_url = http\:// (GW Server IP ) \: (GW Server Port )/sap/opu/odata/sap/Z_BANK_SERVICE_372

    6. Application ID

    Please Help me out Solving this Problem

    DB:2.61:Error While Developing Sap Netweaver Mobile App cj


    Hello,

    In the Android code, you need to do following changes:

    1. Got to raw - .Properties file

    2. Change the value of Vault password (You can give blank as well )

    3. Get the Value of Vault Password:

    // the vault password

    String vaultPassword = this.properties.getProperty("vaultPassword");

    4. Use the following code for Registration

    supHelper.registerOrUnlock(userName, password, vaultPassword, securityConfig);

  • RELEVANCY SCORE 2.61

    DB:2.61:Cannot Install Sharepoint 2007, Configuration Wizard Failed To Create Sample Data At Step 8 zm


    Hello, all. I'm trying to install Sharepoint 2007, usually at Step 8, whereas this error message appears:
    Failed to create sample data.
    An exception of type System.IO.FileNotFoundException was thrown. Additional exception information: Unable to find the specified file.
    I'm installing at Windows Server 2008, by the way.
    How can I get over this problem? Thank you.
    Regards,
    Kristian

    DB:2.61:Cannot Install Sharepoint 2007, Configuration Wizard Failed To Create Sample Data At Step 8 zm


    usually at Step 8,
    It's often possible to reach step eight (and get this or other messages) if you don't have enough memory assigned to the installation.

    Just increased VM RAM and all exception errors at stage 8 gone. Thanks a lot.

  • RELEVANCY SCORE 2.61

    DB:2.61:Load Report Failed. (Again.) 8m


    Hi,
    Does CrystalDecisions.CrystalReports.Engine have any trace switches I can enable to find out why I'm getting the Load report Failed. exception.  This isn't much use as it stands.
    Incedently I've tried resetting the read/write premisions on the rpt file, creating new CR projects and even using the sample projects, as well as reinstalling VST system etc all to no avail.
    Or if any one knows what might be going on here I be very appreciative for any help or suggestions.
    Ta in advance,
    Michael McD.

    DB:2.61:Load Report Failed. (Again.) 8m

    CR basic that is included with Visual Studio does not support engine logging. Use Process Monitor to follow your application access to CR components.
    Full versions of Crystal Reports does have the ability. Search on SAP kbase system on how to enable crpe32 logging.
    DonDon Williams

  • RELEVANCY SCORE 2.60

    DB:2.60:Report Service Zip File Download Problem 7k


     
    Anyone using report service for downloading reports with V3 API
    URL u = new URL(url);

    URLConnection conn = u.openConnection();
    conn.connect();
    Getting this exceptionGetting this exception
     
     Can anyone post the sample code for this?
     
     
     
     
    javax.net.ssl.SSLHandshakeException: sun.security.validator.ValidatorException: PKIX path building failed: sun.security.provider.certpath.SunCertPathBuilderException: unable to find valid certification path to requested target
     

    DB:2.60:Report Service Zip File Download Problem 7k

    Sorry for the late reply...
    We now require SSL access to download reports. More details in the v3.61 release notes: http://msdn2.microsoft.com/en-us/library/aa982776.aspx
    Hope this helps...
    Shai

  • RELEVANCY SCORE 2.60

    DB:2.60:Build Failed In Jbpm 6 Console sc



    I am trying to build and deploy a sample jBPM process download from jBPM6 - Custom Work Item: Hello Process Example, but am getting error as below. It seems like the work item handler class appear in the wrong package but i am just using the source downloaded from jboss community directly, please help

    15:55:42,078 ERROR [stderr] (pool-36-thread-7) Exception in thread "pool-36-thread-7" java.lang.NoClassDefFoundError: target/classes/com/sample/HelloProcessExtension (wrong name: com/sample/HelloProcessExtension)

    15:55:42,078 ERROR [stderr] (pool-36-thread-7) at java.lang.ClassLoader.defineClass1(Native Method)

    15:55:42,078 ERROR [stderr] (pool-36-thread-7) at java.lang.ClassLoader.defineClass(ClassLoader.java:616)

    15:55:42,078 ERROR [stderr] (pool-36-thread-7) at java.lang.ClassLoader.defineClass(ClassLoader.java:462)

    DB:2.60:Build Failed In Jbpm 6 Console sc


    I am trying to build and deploy a sample jBPM process download from jBPM6 - Custom Work Item: Hello Process Example, but am getting error as below. It seems like the work item handler class appear in the wrong package but i am just using the source downloaded from jboss community directly, please help

    15:55:42,078 ERROR [stderr] (pool-36-thread-7) Exception in thread "pool-36-thread-7" java.lang.NoClassDefFoundError: target/classes/com/sample/HelloProcessExtension (wrong name: com/sample/HelloProcessExtension)

    15:55:42,078 ERROR [stderr] (pool-36-thread-7) at java.lang.ClassLoader.defineClass1(Native Method)

    15:55:42,078 ERROR [stderr] (pool-36-thread-7) at java.lang.ClassLoader.defineClass(ClassLoader.java:616)

    15:55:42,078 ERROR [stderr] (pool-36-thread-7) at java.lang.ClassLoader.defineClass(ClassLoader.java:462)

  • RELEVANCY SCORE 2.60

    DB:2.60:Rpc Error For Adal For Windows Phone 8.1 On Call Of xf


    Hi,
    I am hosted a Azure Mobile Service and I have used ADAL from Nuget . I am able to call and get response from Azure Mobile Service using ADAL for iOS and Android / Windows Store . however for Windows Phone 8.1 . I am getting below exception .
    I am debugging in emulator.
    public async Taskstring GetAuthenticationTokenAsync(string authority, string resourceUri, string clientId, string redirectUri)
    {
    string accessToken = string.Empty;
    try
    {
    AuthenticationContext ac = AuthenticationContext.CreateAsync(authority).GetResults();
    var tcs = new TaskCompletionSourcestring();
    //Fails here
    ac.AcquireTokenAndContinue(resourceUri, clientId, new Uri(redirectUri), result =
    {
    .....
    });
    accessToken = await tcs.Task;
    }
    catch(Exception ex)
    {
    accessToken = string.Empty;
    }
    return accessToken;
    }

    The remote procedure call failed. (Exception from HRESULT: 0x800706BE)
    at Windows.Security.Authentication.Web.WebAuthenticationBroker.AuthenticateAndContinue(Uri requestUri, Uri callbackUri, ValueSet continuationData, WebAuthenticationOptions options)
    at Microsoft.IdentityModel.Clients.ActiveDirectory.WebUI.Authenticate(Uri authorizationUri, Uri redirectUri, IDictionary`2 headersMap, CallState callState)
    at Microsoft.IdentityModel.Clients.ActiveDirectory.AcquireTokenInteractiveHandler.AcquireAuthorization()
    at Microsoft.IdentityModel.Clients.ActiveDirectory.AuthenticationContext.AcquireTokenAndContinueCommon(String resource, String clientId, Uri redirectUri, UserIdentifier userId, String extraQueryParameters, AuthenticationContextDelegate authDelegate)

    DB:2.60:Rpc Error For Adal For Windows Phone 8.1 On Call Of xf

    Duplicate ofhttp://social.msdn.microsoft.com/forums/windowsapps/en-us/6acc26f2-e357-479a-bff8-e7e703094bce/rpc-error-for-adal-for-windows-phone-81

  • RELEVANCY SCORE 2.60

    DB:2.60:Getting Login Failed Exception When Connecting To A Db With Multi Threading mz


    Hi,

    I get below exception when trying to run a DB query from a function that is invoked from a new thread:
    262386: System.Data.EntityException: The underlying provider failed on Open. --- System.Data.SqlClient.SqlException: Login failed for user 'ISCP\CREDSNA01VAPP26$'. at System.Data.SqlClient.SqlInternalConnection.OnError

    Below is my sample code, where ProcessRePriceRequest will eventually invoke DB code.

    If I call ProcessRePriceRequest() directly, without creating a new Task, it works fine.
    Task
    sendTask =
    new
    Task(() = ProcessRePriceRequest(request,
    rePriceID));
    sendTask.Start();

    Here is my db connection string:
    server=stage;database=production;Integrated Security=SSPI
    Please help.
    Thanks,
    Irena

    DB:2.60:Getting Login Failed Exception When Connecting To A Db With Multi Threading mz

    Irena,
    You are aware that you cannot have two DataBase connections to the same database open at the same time in a program (so also not in more threads).
    Or you should use a special feature for that.

    Success
    Cor

    It is not true. You can have multiple connection to a single database one time.

    Muthukrishnan Ramasamy
    net4.rmkrishnan.net
    Use only what you need, Reduce global warming

    Will you please quote correct if you tell that something is not true. I did not write that there cannot be more connections. I wrote that only one can be open at the same time.
    (Maybe I should then write also and used but for non dummies that seems to me obvious).
    Be aware I also wrote that there is a special feature to allow that (although that is since 2005)Success
    Cor

  • RELEVANCY SCORE 2.60

    DB:2.60:I Am Getting Ora-01008:Not All Variables Bound Error zd


    Hi all,
    i am getting ORA-01008:not all variables bound error while executing the following code...
    Could any one help me to find out the problem...i am very new to ODP.net and Oracle ..

    I am using VC++.net for run this code.

    Here is the code.....

    #include iostream

    using namespace std;
    using namespace System;
    using namespace Oracle::DataAccess::Client;

    class Sample
    {
    public:
    Sample();
    ~Sample();
    };

    Sample::Sample()
    {
    int num = 100;
    int sal = 200;
    //connect to Oracle
    OracleConnection ^con ;
    con = gcnew OracleConnection();
    con-ConnectionString = "User Id=test;Password=test;Data Source=test.local.com";
    //Oracle command part
    OracleCommand ^cmd;
    cmd = con-CreateCommand();
    cmd-CommandText = "insert into simple values (:num, :sal)";

    try
    {
    con-Open();
    cmd-ExecuteNonQuery();
    }
    catch (Exception ^e)
    {
    Console::WriteLine("Execution Failed:" + e-Message);
    }
    finally
    {
    con-Close();
    }
    }

    Sample::~Sample()
    {
    }

    int main()
    {
    Sample samp;
    return 0;
    }

    sorrry lack of comments.....

    plz help me out..

    thanks in advance..

    justin

    DB:2.60:I Am Getting Ora-01008:Not All Variables Bound Error zd

    Hello,

    You have 2 bind variables in your statement (:num and :sal) but you have not created parameters and bound them to the bind variables.

    - Mark

  • RELEVANCY SCORE 2.60

    DB:2.60:Failed To Create Sample Data In 8th Step While Configuring Sharepoint 2013 In Standalone Mode pf


    Hi All,
    I am getting Failed to create sample data error message while trying to configure Microsoft SharePoint 2013 in Standalone mode. it is getting failed in 8th step of configuration when it is creating sample data. please find the screenshot below

    Any hint on this issue??

    Thanks!

    DB:2.60:Failed To Create Sample Data In 8th Step While Configuring Sharepoint 2013 In Standalone Mode pf

    Please check the error logs for more information. In the above screenshot go to link specified in that and check for more information.

    or use powershell commands to run the PSconfig wizard,
    http://technet.microsoft.com/en-us/library/cc263093%28v=office.14%29.aspx

    Hope this helps.MCTS,MCPD Sharepoint 2010. My Blog-
    http://www.sharepoint-journey.com
    If a post answers your question, please click Mark As Answer on that post and Vote as Helpful

  • RELEVANCY SCORE 2.59

    DB:2.59:Android App Not Deploying On Bb Playbook. 9a



    Hello friends,

    I try to deploy android app into playbook simulator,

    I have successfully verify Apk.

    But getting bellow error:

    Please help me to resolve it.

    Failed to deploy project MersenFileListProjeBBInfo: Sending request: InstallInfo: Action: InstallInfo: File size: 955381Info: Installing ...Info: Processing 955381 bytesInfo: Progress 50%...Info: Progress 100%...actual_dname::com.android.mersen.testEAn0x_eMRASuvHfC54LzGTUactual_id::testEAn0x_eMRASuvHfC54LzGTUactual_version::1.0.1.0result::failure -9

    DB:2.59:Android App Not Deploying On Bb Playbook. 9a


    Hey milanvishal,

    That error message is displayed if the device is missing some shared library that you are using in you application. Typically, this is because you are referencing Google Maps (or at least have left the uses-library tag in your AndroidManifest.xml).

    Once you remove that dependency, you should be good

    Justin




    Justin Jasmann | Android Application Development ConsultantDeveloper Relationsdeveloper.blackberry.com

  • RELEVANCY SCORE 2.59

    DB:2.59:Audio Frequency Sample On Android xx



    I have this problem too anyone?

  • RELEVANCY SCORE 2.59

    DB:2.59:Jdeveloper Adf Mobile -- Unable To Deploy A Sample Application On Android 71


    Hi,

    I am new to Oracle ADF mobile. I tried to deploy one of the sample created to an android emulator. I am getting the following error.

    Deployment failed due to one or more errors returned by 'C:\Android\android-sdk-windows\platform-tools\dx.bat'. The following is a summary of the returned error(s):
    Command-line execution failed (Return code: 1)

    any help is greatly appreciated.

    Regards,
    Pavani

    DB:2.59:Jdeveloper Adf Mobile -- Unable To Deploy A Sample Application On Android 71

    Folder name should not contain spaces. space will not be escaped while generating output files.

  • RELEVANCY SCORE 2.59

    DB:2.59:No Data Source Found Error While Deploying J2ee Application cj


    hi

    i am new to Oracle9ias. I was going through the Oracle by Example tutorial available on the site. There i followed the steps to deploy a sample J2EE application. Acc to it i first created the datasource and then tried to deploy the application. But i am getting "datasource not found" error. I am totally unaware of the possible cause of this. The error in specific is as follows

    Deployment failed: Nested exception Root Cause: No DataSource found at jdbc/hrDS. No DataSource found at jdbc/hrDS

    Please help

    thanks
    nitin

    DB:2.59:No Data Source Found Error While Deploying J2ee Application cj

    hi

    i am new to Oracle9ias. I was going through the Oracle by Example tutorial available on the site. There i followed the steps to deploy a sample J2EE application. Acc to it i first created the datasource and then tried to deploy the application. But i am getting "datasource not found" error. I am totally unaware of the possible cause of this. The error in specific is as follows

    Deployment failed: Nested exception Root Cause: No DataSource found at jdbc/hrDS. No DataSource found at jdbc/hrDS

    Please help

    thanks
    nitin

  • RELEVANCY SCORE 2.59

    DB:2.59:Dynamic Assignment Of Value To A Dvm In Assign Activity Oracle Soa 11g mx


    Hi all,
    I am trying to fetch values dynamically from DVM and assign it a variable in BPEL in assign activity, i have tried all the below options, but none of them are working. This is stopping me from moving forward. Can you please help me ?

    option1:

    assign name="Assign1"
    copy
    from expression='dvm:lookupValue("sample.dvm","sample",$FromInput,"SAM","")'/
    to variable="FromInput"/
    /copy

    option2:

    assign name="Assign1"
    copy
    from expression='dvm:lookupValue("sample.dvm","sample",bpws:getVariableData(FromInput),"SAM","")'/
    to variable="FromInput"/
    /copy

    and i am getting the below exception

    exception class="com.collaxa.cube.xml.xpath.XPathException"XPath expression failed to execute.
    An error occurs while processing the XPath expression; the expression is dvm:lookupValue(apos;sample.dvmapos;,apos;sampleapos;,$FromInput,apos;CFAapos;,apos;apos;).
    The XPath expression failed to execute; the reason was: internal xpath error.
    Check the detailed root cause described in the exception message text and verify that the XPath query is correct.
    stackfcom.collaxa.cube.xml.xpath.BPELXPathUtil.evaluate#262/ffcom.collaxa.cube.engine.ext.bpel.common.BPELWMPHelper.evalFromValue#339/ffcom.collaxa.cube.engine.ext.bpel.v1.wmp.BPEL1AssignWMP.__executeStatements#137/ffcom.collaxa.cube.engine.ext.bpel.common.wmp.BaseBPELActivityWMP.perform#158/ffcom.collaxa.cube.engine.CubeEngine.performActivity#2543/ffcom.collaxa.cube.engine.CubeEngine._handleWorkItem#1166/ffcom.collaxa.cube.engine.CubeEngine.handleWorkItem#1071/ffcom.collaxa.cube.engine.dispatch.message.instance.PerformMessageHandler.handleLocal#73/ffcom.collaxa.cube.engine.dispatch.DispatchHelper.handleLocalMessage#220/ffcom.collaxa.cube.engine.dispatch.DispatchHelper.sendMemory#328/ffcom.collaxa.cube.engine.CubeEngine.endRequest#4430/ffcom.collaxa.cube.engine.CubeEngine.endRequest#4362/ffcom.collaxa.cube.engine.CubeEngine._createAndInvoke#698/ffcom.collaxa.cube.engine.CubeEngine.createAndInvoke#555/ffcom.collaxa.cube.engine.delivery.DeliveryService.handleInvoke#673/ffcom.collaxa.cube.engine.ejb.impl.CubeDeliveryBean.handleInvoke#293/ff.../f/stack/exception
    root class="javax.xml.xpath.XPathExpressionException"internal xpath errorstackforacle.xml.xpath.JXPathExpression.evaluate#242/ffcom.collaxa.cube.xml.xpath.BPELXPathUtil.evaluate#240/ffcom.collaxa.cube.engine.ext.bpel.common.BPELWMPHelper.evalFromValue#339/ffcom.collaxa.cube.engine.ext.bpel.v1.wmp.BPEL1AssignWMP.__executeStatements#137/ffcom.collaxa.cube.engine.ext.bpel.common.wmp.BaseBPELActivityWMP.perform#158/ffcom.collaxa.cube.engine.CubeEngine.performActivity#2543/ffcom.collaxa.cube.engine.CubeEngine._handleWorkItem#1165/ffcom.collaxa.cube.engine.CubeEngine.handleWorkItem#1071/ffcom.collaxa.cube.engine.dispatch.message.instance.PerformMessageHandler.handleLocal#73/ffcom.collaxa.cube.engine.dispatch.DispatchHelper.handleLocalMessage#220/ffcom.collaxa.cube.engine.dispatch.DispatchHelper.sendMemory#328/ffcom.collaxa.cube.engine.CubeEngine.endRequest#4430/ffcom.collaxa.cube.engine.CubeEngine.endRequest#4361/ffcom.collaxa.cube.engine.CubeEngine._createAndInvoke#698/ffcom.collaxa.cube.engine.CubeEngine.createAndInvoke#555/ffcom.collaxa.cube.engine.delivery.DeliveryService.handleInvoke#673/ff.../f/stack/root

    DB:2.59:Dynamic Assignment Of Value To A Dvm In Assign Activity Oracle Soa 11g mx

    Use the below URL for reference.

    http://docs.oracle.com/cd/E14571_01/integration.1111/e10224/med_dvm.htm

    Thanks,
    Vijay

  • RELEVANCY SCORE 2.58

    DB:2.58:Simplepropertysearchmanager : Failed To Init Sub-Manager x8


    Hi,Could anybody help on this?When I deploy a XYZPropertySearchManager along with sample implementation of repository manager, I am getting following exception eventhough I am not pointing to SimplePropertySearchManager anywhere. viz:Startup Error: Failed to init sub-manager: Exception loading and instanciating sub-manager: com.sapportals.wcm.repository.manager.generic.search.SimplePropertySearchManager (java.lang.NoSuchMethodException: null) Thanks for any help.John

    DB:2.58:Simplepropertysearchmanager : Failed To Init Sub-Manager x8

    Hi,Thanks for the reply. I set PropertySearchManager to XYZPropertySearchManager in co.xml file before uploading the par. However, as you posted, the value "com.sapportals.wcm.repository.manager.generic.search.SimplePropertySearchManager" is shown in the UI. I need to unset it. I didnt try with XYZPropertySearchManager furthur.thanks,John

  • RELEVANCY SCORE 2.58

    DB:2.58:How To Configure And Use Oracle's Jms Connector With Tibco Ems c9


    Jeff,

    I am getting the below exception while try to do the deployment of the sample provided on 'How to Configure and Use Oracle's JMS Connector with Tibco Enterprise for JMS'

    While deployment not able to get the 'TibcoJMSReference',

    As I understand in the 'orion-application.xml for the below, unable to get the instance. Could you adivce how I can enable the trace more?
    resource-provider class="com.evermind.server.deployment.ContextScanningResourceProvider" name="TibcoJMSReference"

    could you help to resolve the issue?

    Error
    Operation failed with error: No resource named 'TibcoJMSReference/TibcoXACF'found

    DB:2.58:How To Configure And Use Oracle's Jms Connector With Tibco Ems c9

    Need to configure foreign JMS to the sever . So that the server listen to that queue . I have configured IBM MQ Series . TIBCO too work the same way .

    Cheers ,
    -Shyam Ramath

  • RELEVANCY SCORE 2.58

    DB:2.58:Invalid Byte Array Conversion In Wcf Rest Service For Jpeg Image 8k



    Hi all,

    We are trying to implement the signature capture in Xamarin Android by using the Xamarin Signature capture component. We need to save the signature image in database by using WCF REST Service(POST Method). We have converted image(JPEG) into Byte array and sent
    the same as stream to WCF REST Service.

    In WCF REST Service, the stream is received and we tried to convert the Byte array from stream into Image. But it shows conversion failed error as Parameter is not valid. Kindly help me to resolve the issue. find below my sample code.

    Xamarin android (Client Side) coding part:
    async void btnSave_Click(object sender, EventArgs e)
    {
    try
    {
    if (signature.IsBlank)
    {
    AlertDialog.Builder alert = new AlertDialog.Builder(this);
    alert.SetMessage(No signature to save.);
    alert.SetNeutralButton(Okay, delegate { });
    alert.Create().Show();
    }
    BitmapImage = signature.GetImage(); //Here getting signature pad image
    using (var memstream = new MemoryStream())
    {
    BitmapImage.Compress(Bitmap.CompressFormat.Jpeg, 0, memstream);
    string test = await DataAccess.ImageUpload(task, Application_Server_Url, memstream);
    }
    }
    catch (Exception ex){ }
    }
    //Database class to send server with image
    public async TaskString ImageuploadFromClientT(T item, String ServiceAddress, MemoryStream stream) where T : BusinessLayer.Contracts.IBusinessEntity, new()
    {
    try
    {
    OutputString = string.Empty;
    byte[] fileToSend = new byte[16 * 1024];
    var request = HttpWebRequest.Create(ServiceAddress);
    request.Method = POST; request.ContentType = image/jpeg;
    Stream reqStream = request.GetRequestStream();
    for (int i = 0; i fileToSend.Length; i) { fileToSend[i] = (byte)('a' (i % 26)); }
    reqStream.Write(fileToSend, 0, fileToSend.Length); reqStream.Close();
    using (HttpWebResponse response = request.GetResponse() as HttpWebResponse)
    {
    using (StreamReader reader = new StreamReader(response.GetResponseStream()))
    { var content = reader.ReadToEnd(); if (content != ) { OutputString = (string)Newtonsoft.Json.JsonConvert.DeserializeObject(content); } }
    }
    }
    catch (Exception e) { OutputString = ErrorMsg; } return OutputString;
    }
    Sample WCF REST Service Function:
    [OperationContract]
    [WebInvoke(Method = POST, BodyStyle = WebMessageBodyStyle.WrappedRequest
    )]
    public String TestStream(Stream streamImg)
    {
    try
    {
    byte[] ds = ReadFully(streamImg);
    String loginBased = InsertImageInDatabaseServer(ds); //Here the Byte Array saved in database server. But the same byte array to image conversion shows error while retrieving
    // For this reason i have checked to save the image in local machine but shows conversion error.
    MemoryStream memStream = new MemoryStream(ds);
    Image img = Image.FromStream(memStream); // Here it shows error as Conversion failed
    img.Save(@d:\imgtest.jpg);
    }
    catch (Exception ex)
    { }
    return Success;
    }

    public static byte[] ReadFully(Stream input)
    {
    byte[] buffer = new byte[16 * 1024];
    using (MemoryStream ms = new MemoryStream())
    {
    int read;
    while ((read = input.Read(buffer, 0, buffer.Length)) 0)
    {
    ms.Write(buffer, 0, read);
    }
    return ms.ToArray();
    }
    }

    Thanks in Advance with regards Kathirvelu.M

    DB:2.58:Invalid Byte Array Conversion In Wcf Rest Service For Jpeg Image 8k

    Start by verifying the number of bytes recevied against the number of bytes from the original file and make sure the number of bytes are the same. You will get this error if you don't have the correct number of bytes. Often the number fo bytes
    are changed if you are using the incorrect encoding. Stream classes default to ASCII encoding which will alter the data. You need to make sure the encoding used is UTF8.

    I would make the following change
    from : byte[] buffer =
    new byte[16
    * 1024];
    To : byte[] buffer = new byte[input.Length];jdweng

  • RELEVANCY SCORE 2.58

    DB:2.58:Deploy Failed mz


    When I try to deploy an EAR to AS10gR1, I am getting following error

    Any help is highly appreciable.

    Thanks

    Deployment failed: Nested exception
    Root Cause: deploy failed!: ; nested exception is:
    oracle.oc4j.admin.internal.DeployerException: Unknown assembly root-tag attribute: xmlns:xsi
    Resolution: . deploy failed!: ; nested exception is:
    oracle.oc4j.admin.internal.DeployerException: Unknown assembly root-tag attribute: xmlns:xsi

    DB:2.58:Deploy Failed mz

    I fixed the issue by making changes in the web.xml.

    A few unwanted entries been removed.

  • RELEVANCY SCORE 2.58

    DB:2.58:S Pen Sdk Sample Problem xk


    Trying to run Example 1 from S Pen SDK examples and getting the following error:

    Could not find class 'com.samsung.sdraw.example1.MainActivity$3', referenced from method com.samsung.sdraw.example1.MainActivity.init

    Could not find class 'com.samsung.sdraw.CanvasView', referenced from method com.samsung.sdraw.example1.MainActivity.onCreate

    FATAL EXCEPTION: main

    java.lang.NoClassDefFoundError: com.samsung.sdraw.example1.MainActivity$3

    at com.samsung.sdraw.example1.MainActivity.init(MainActivity.java:239)

    What is the problem?

    I am using NetBeans 7.1.1 +android plugin + Galaxy Note. AVD gives the same error. Android applications which are not using any external SDK can be run and debug without any errors.

    DB:2.58:S Pen Sdk Sample Problem xk

    It was Android SDK Tools rev.17 bug. Rev.18 contains the fix.

  • RELEVANCY SCORE 2.58

    DB:2.58:Outgoing Tls Negotiation Failed; z8


    Hello guys,
    I ma working on an simple application o send IM to Office Communication Server Users, I am using BroadcastIM sample application of UCMA 1.0 SDK for reference…
    I am using  SipPeertpPeerEndpoint to create end point and TLS as transport type  to send IM.
    I am getting “target principal name is incorrect” and its inner exception is “outgoing TLS negotiation failed; HRESULT=-2146893022”
     
    Please help
     
    Thanks in advance…
     DMk

    DB:2.58:Outgoing Tls Negotiation Failed; z8

    It looks lik eyou have a certificate problem. Can you explain how you created your certificate?I am able to reproduce your problem but I have not found a solution yet.

  • RELEVANCY SCORE 2.58

    DB:2.58:Bad Exception Type az


    i am getting bad exception type in web.xml ClassNotFoundException in weblogic 6.1 while giving exception type in error page tag.
    this works fine in weblogic 6.0

    sample code
    error-page
    exception-type
    java.util.MissingResourceException
    java.io.FileNotFoundException
    java.io.IOException
    java.lang.ArrayIndexOutOfBoundsException
    java.lang.ClassCastException
    java.lang.ClassNotFoundException
    java.lang.IndexOutOfBoundsException
    java.lang.IllegalArgumentException
    java.lang.NullPointerException
    java.lang.NumberFormatException
    java.lang.StringIndexOutOfBoundsException
    java.util.MissingResourceException
    java.util.NoSuchElementException
    java.net.ConnectException
    javax.mail.MessagingException
    /exception-type

    location
    errorinpage.jsp
    /location
    /error-page
    thanks in advance

    DB:2.58:Bad Exception Type az

    i am getting bad exception type in web.xml ClassNotFoundException in weblogic 6.1 while giving exception type in error page tag.
    this works fine in weblogic 6.0

    sample code
    error-page
    exception-type
    java.util.MissingResourceException
    java.io.FileNotFoundException
    java.io.IOException
    java.lang.ArrayIndexOutOfBoundsException
    java.lang.ClassCastException
    java.lang.ClassNotFoundException
    java.lang.IndexOutOfBoundsException
    java.lang.IllegalArgumentException
    java.lang.NullPointerException
    java.lang.NumberFormatException
    java.lang.StringIndexOutOfBoundsException
    java.util.MissingResourceException
    java.util.NoSuchElementException
    java.net.ConnectException
    javax.mail.MessagingException
    /exception-type

    location
    errorinpage.jsp
    /location
    /error-page
    thanks in advance

  • RELEVANCY SCORE 2.58

    DB:2.58:Exception Reading Response; Nested Exception Is: Java.Net.Socketexception: md


    Hi

    Test failed with message: "Exception reading response; nested exception is: java.net.SocketException: Connection reset"

    Getting above error when trying to configure Notification email methods...
    OEM is 11g...

    any ideas?

    DB:2.58:Exception Reading Response; Nested Exception Is: Java.Net.Socketexception: md

    For the third time: were you able to send an email from the command prompt? If thats not possible, EMGC can't either.

    Eric

  • RELEVANCY SCORE 2.58

    DB:2.58:Ssis Package Failed After Test Connection Success sp


    , Test Connection succesfull, can preview the sample data, destination connection succesfull, but getting the following error on execution

    TITLE: Microsoft Visual Studio
    ------------------------------
    Error at Load Data from Oracle to SQL Server [SQL Srvr 2008 R2 DB Destination [1896]]:

    An error occurred due to no connection. A connection is required when requesting metadata.

    If you are working offline, uncheck Work Offline on the SSIS menu to enable the connection.

    ------------------------------
    ADDITIONAL INFORMATION:
    Exception from HRESULT: 0xC0202022 (Microsoft.SqlServer.DTSPipelineWrap)
    ------------------------------
    BUTTONS:
    OK
    ------------------------------

    DB:2.58:Ssis Package Failed After Test Connection Success sp

    Thanks everyone for the reply.

    Your replies helped me

  • RELEVANCY SCORE 2.58

    DB:2.58:Java Access Manager (Netpoint) Api Connection Error 11


    Hello all,

    Am I doing something that is obviously wrong? :-)

    Best,

    --J

    Error I'm getting:

    com.oblix.access.ObAccessException: The NetPoint AccessGate is unable to contact any NetPoint Access Servers.
    at com.oblix.access.ObConfig.jni_initialize(Native Method)
    at com.oblix.access.ObConfig.initialize(ObConfig.java:115)
    at AccessTester.main(AccessTester.java:51)

    Sample Code Snippet:

    try {
    if (configDir != null) {
    System.out.println("Called init with specified directory");
    ObConfig.initialize(configDir); // ---- this is the line that fails!
    System.out.println("Ok, called init with " + configDir);
    }
    else {
    System.out.println("Called init without specified directory");
    ObConfig.initialize();
    System.out.println("Ok, called init without specifying a directory...");
    }
    } catch (ObAccessException ie) {
    System.out.println("Initialize failed");
    ie.printStackTrace();
    return;
    }
    catch (Exception e) {

    System.out.println("Other exception occurred " + e.getMessage());
    e.printStackTrace();
    return;
    }

    DB:2.58:Java Access Manager (Netpoint) Api Connection Error 11

    Few pointers that you can check...

    a) Make sure you have registered your custom access gate using the Console and the password matches
    b) run/rerun accessgate configuration from the Access Server SDK
    c) Make sure the path variable is correct
    OBACCESS_INSTALL_DIR points to accessserverSDK
    Just to be sure you can also try appending \oblix; and \oblix\lib to the path.
    d) Make sure you have Java Run time installed.

    How are you running this code... is this a web service or web application or a console application?
    If its web application/web service, there are some dependecy dll that you need to copy to the working directory or to windows\system32

    send me an email if you have any questions.
    Thanks
    Ram

  • RELEVANCY SCORE 2.58

    DB:2.58:Bad Exception Type sp


    i am getting bad exception type in web.xml ClassNotFoundException in weblogic 6.1 while giving exception type in error page tag.
    this works fine in weblogic 6.0

    sample code
    error-page
    exception-type
    java.util.MissingResourceException
    java.io.FileNotFoundException
    java.io.IOException
    java.lang.ArrayIndexOutOfBoundsException
    java.lang.ClassCastException
    java.lang.ClassNotFoundException
    java.lang.IndexOutOfBoundsException
    java.lang.IllegalArgumentException
    java.lang.NullPointerException
    java.lang.NumberFormatException
    java.lang.StringIndexOutOfBoundsException
    java.util.MissingResourceException
    java.util.NoSuchElementException
    java.net.ConnectException
    javax.mail.MessagingException
    /exception-type

    location
    errorinpage.jsp
    /location
    /error-page
    thanks in advance

    DB:2.58:Bad Exception Type sp

    i am getting bad exception type in web.xml ClassNotFoundException in weblogic 6.1 while giving exception type in error page tag.
    this works fine in weblogic 6.0

    sample code
    error-page
    exception-type
    java.util.MissingResourceException
    java.io.FileNotFoundException
    java.io.IOException
    java.lang.ArrayIndexOutOfBoundsException
    java.lang.ClassCastException
    java.lang.ClassNotFoundException
    java.lang.IndexOutOfBoundsException
    java.lang.IllegalArgumentException
    java.lang.NullPointerException
    java.lang.NumberFormatException
    java.lang.StringIndexOutOfBoundsException
    java.util.MissingResourceException
    java.util.NoSuchElementException
    java.net.ConnectException
    javax.mail.MessagingException
    /exception-type

    location
    errorinpage.jsp
    /location
    /error-page
    thanks in advance

  • RELEVANCY SCORE 2.58

    DB:2.58:Jdeveloper And Hrapp Sample App ks


    Hi has anyone actually got the HrApp Sample to work..I followed the sample from
    http://otn.oracle.com/products/jdev/htdocs/handson/j2ee/j2ee13hos.html
    but I cannot get it to deploy on the 9iAS server.
    I keep getting the following error.
    Deployment failed: Nested exception Root Cause: Error loading web-app 'hrweb' at D:\ora9ias\j2ee\home\applications\message\hrweb: Unknown assembly tag in file:/D:/ora9ias/j2ee/home/applications/message/hrweb/: lt;ejb-local-refgt;;

    Any help is appreciated

    DB:2.58:Jdeveloper And Hrapp Sample App ks

    Hi has anyone actually got the HrApp Sample to work..I followed the sample from
    http://otn.oracle.com/products/jdev/htdocs/handson/j2ee/j2ee13hos.html
    but I cannot get it to deploy on the 9iAS server.
    I keep getting the following error.
    Deployment failed: Nested exception Root Cause: Error loading web-app 'hrweb' at D:\ora9ias\j2ee\home\applications\message\hrweb: Unknown assembly tag in file:/D:/ora9ias/j2ee/home/applications/message/hrweb/: lt;ejb-local-refgt;;

    Any help is appreciated

  • RELEVANCY SCORE 2.57

    DB:2.57:Error Binding Soap Fault k7


    Hi,

    We are using webservice control to consume a web service. Getting an exception during SOAP fault binding. The control generation was fine.

    Can you shed some light as to what the problem may be

    Thanks,
    - Shankar

    Here is the sample XML response:

    NS1:Envelope xmlns:NS1="http://schemas.xmlsoap.org/soap/envelope/"
    NS1:Body
    NS1:Fault
    faultcodeHHSC004/faultcode
    faultstringNo record is found./faultstring
    detail
    NS2:ApplicationError xmlns:NS2="http://test.com/wsdl/DataTypes_V1"
    faultNameNo record is found./faultName
    errorCode1234/errorCode
    /NS2:ApplicationError
    /detail
    /NS1:Fault
    /NS1:Body
    /NS1:Envelope

    The execption is listed below:

    com.bea.control.ServiceControlException: Unexpected exception raised invoking searchPr on control
    .......................
    Caused by: java.rmi.RemoteException: Failed to invoke; nested exception is:
    weblogic.wsee.handler.InvocationException: [Client CodecHandler]Failed to decode fault
    ........................

    Caused by: weblogic.wsee.handler.InvocationException: [Client CodecHandler]Failed to decode fault
    .........................
    Caused by: weblogic.xml.schema.types.IllegalLexicalValueException: unable to locate namespace URI for prefix ""

    DB:2.57:Error Binding Soap Fault k7

    Hi,

    I'm experiencing the same problem, but I didn't quite understood where and how you managed to change the faultcode.

    Thank you in advance
    Pedro

    Edited by: user10585097 on Jul 27, 2010 4:16 AM

  • RELEVANCY SCORE 2.57

    DB:2.57:Dcn With Payload Android Sample ca


    Hi ,Could you please help me finding DCN with payload android complete sample code.RegardsSrinivas

    DB:2.57:Dcn With Payload Android Sample ca

    Hi jitendra,sybase not providing complete sample. I am expecting procedure from some one who already worked or created some samples.sybase official docs are not that much clear.RegardsSrini

  • RELEVANCY SCORE 2.56

    DB:2.56:Details Of Xmlpost Utilty Code Please Sample Config,Sample Xml And Code To Run km


    I have gone through DEVELOPER GUIDE followed each and every step but I am not able to use XMLPost Utilty,In Command Prompt it is throwing following Exception "2013-07-25 21:09:49,798 [main] DEBUG (DynamicInjector.java:205) - Failed to access casInfo, Exception=java.io.FileNotFoundException: http://localhost:8280/servlet/Satellite?pagename=fatwire/wem/sso/casInfoCOM.FutureTense.XML.Post.XMLPost$XMLPostException: Post response indicates failure. Consult futuretense.txt xmlpost log file for details."From CSELemenet also I tried but same exception "Post response indicates failure. Consult futuretense.txt xmlpost log file for details."I am not getting enough info please if anyone who are able to use XMLPost Utility please send me details How exactly to use XMLPost Utility?

    DB:2.56:Details Of Xmlpost Utilty Code Please Sample Config,Sample Xml And Code To Run km

    You can configure batch file like this java -cp ./commons-codec-1.4.jar;./commons-lang-2.4.jar;./commons-collections-3.2.1.jar;./commons-io-1.4.jar;./cs-core.jar;./cs.jar;./MSXML.jar;./commons-logging-1.1.1.jar;./servlet-api.jar;./wem-sso-api-1.2.2.jar;./spring-2.5.5.jar;./httpclient-4.1.2.jar;./httpcore-4.1.2.jar;./httpmime-4.1.2.jar;./apache-mime4j-0.5.jar COM.FutureTense.XML.Post.XMLPostMain -sPage -cAviPage_config.iniPage --directoryAviPage_config.ini -- ini file.

  • RELEVANCY SCORE 2.56

    DB:2.56:Exception When Using Send Email Activity Sample And Persistence Service z1


    Hi,
     
    I have a workflow that is using sendemail activity (sample from wf samples), I have enabled tracking and persistance services.
     
    When I create the instance, I am getting following exception. Can someone tell me how to resolve it?
     

    Code Snippet

    DB:2.56:Exception When Using Send Email Activity Sample And Persistence Service z1

    Thanks Shelly,
     
    I dropped the attachments from the activity as I didn't needed it for the functionality. it worked after that.
     
    Thanks,
    Hiten
     

  • RELEVANCY SCORE 2.56

    DB:2.56:Hfm Sample App Deployment Failed jk


    Hi,

    I am trying to deploy hfm Sample application. At deployment time I am getting the following error:

    HTTP/1.1 550.

    Thank you
    Venky

  • RELEVANCY SCORE 2.56

    DB:2.56:Android Eclipse Giving Error : Failed To Read Sdk Values ??? m9



    Unexpectedly i am getting this error when i try to build an project in android as this error .. i need help as this Error seems to slow down my project 4 days. Every time this Error Appears Failed to read SDK Values Current file do not match the config, i need to start my project from beginning ... after deleting the present project kindly help me .. with Steps to folow to get rid of this Errors




    Hit Like if you find my post Use Full Thank You...

    DB:2.56:Android Eclipse Giving Error : Failed To Read Sdk Values ??? m9


    I'd also suggest to completely uninstall the old SDK and then make a new, clean installation of the Android SDK.




    --If you find this post useful please Like it.If it solves your problem please mark as solution.

  • RELEVANCY SCORE 2.56

    DB:2.56:Android Exception Eglswapbuffers Failed: Egl_Bad_Alloc dp



    I'm getting the same thing:


    java.lang.RuntimeException: eglSwapBuffers failed: EGL_BAD_ALLOC at android.opengl.GLSurfaceView$EglHelper.throwEglException(GLSurfaceView.java:1077) at android.opengl.GLSurfaceView$EglHelper.swap(GLSurfaceView.java:1035) at android.opengl.GLSurfaceView$GLThread.guardedRun(GLSurfaceView.java:1333) at android.opengl.GLSurfaceView$GLThread.run(GLSurfaceView.java:1116)

    DB:2.56:Android Exception Eglswapbuffers Failed: Egl_Bad_Alloc dp


    I'm getting the same error.


    According to the internets, it is caused by not calling GLSurfaceView.OnPause(), or by not using the Cupcake GLSurfaceView for all Android versions if GLES 1.x is requested.


    http://stackoverflow.com/questions/6039107/android-glsurfaceview-egl-bad-alloc http://www.badlogicgames.com/forum/viewtopic.php?f=11t=1418☆t=50


    These seem to be internal to the Unity Engine (as far as I can tell).

  • RELEVANCY SCORE 2.56

    DB:2.56:Kurio Download fs



    Can I download using Adobe DRM onto a Kurio (android) tablet? I keep getting Error: Failed to authorize device.

    DB:2.56:Kurio Download fs


    What app are you running on the tablet?

    Are you authorizing on the tablet, or trying the authorize the tablet from ADE on a PC?

    If you run the free Bluefire app on the tablet you should be able to authorize and read DRM books with it.

    For library books, the free Overdrive app lets you borrow, download and read DRM books.

  • RELEVANCY SCORE 2.55

    DB:2.55:Application Deployment cz


    i m new to j2ee and am unable to deploy an application on the default server that comes with j2ee1.4. i have tried the sample applications that comes with j2ee tutorial.
    i am getting the same error
    "Fatal Error from EJB Compiler -- [2] test(s) failed while verifying. Aborting deployment. Please check the domain server log for more details."

    and the log error is
    "[#|2004-10-11T11:40:57.218+0530|SEVERE|sun-appserver-pe8.1|javax.enterprise.system.container.web|_ThreadID=11;|StandardWrapperValve[RemoteJmxConnectorServlet]: Servlet.service() for servlet RemoteJmxConnectorServlet threw exception
    java.io.EOFException"

    please help......

    DB:2.55:Application Deployment cz

    R u talking abt j2ee reference server implementation provided by sun? if thats the case then the online tutorial provides how to set up and run the examples.

  • RELEVANCY SCORE 2.55

    DB:2.55:Spring Acegi's Sample Application On Weblogic 8.1 Sp4 ak


    Hi All,
    I am trying to deploy the Spring Acegi's sample contact application on weblogic 8.1 sp4, but getting the following deployment error

    weblogic.management.DeploymentException:
    Exception:weblogic.management.ApplicationException: start() failed.
    Module: acegi-security-sample-contacts-filter Error: weblogic.management.DeploymentException: Cannot set web app root system property when WAR file is not expanded - with nested exception:
    [java.lang.IllegalStateException: Cannot set web app root system property when WAR file is not expanded]

    at weblogic.management.deploy.slave.SlaveDeployer$ActivateTask.doCommit()V(SlaveDeployer.java:2423)
    at weblogic.management.deploy.slave.SlaveDeployer$Task.commit()V(SlaveDeployer.java:2138)
    at weblogic.management.deploy.slave.SlaveDeployer$Task.checkAutoCommit()V(SlaveDeployer.java:2237)
    at weblogic.management.deploy.slave.SlaveDeployer$Task.prepare()V(SlaveDeployer.java:2132)
    at weblogic.management.deploy.slave.SlaveDeployer$ActivateTask.prepare()V(SlaveDeployer.java:2384)
    at weblogic.management.deploy.slave.SlaveDeployer.processPrepareTask(Lweblogic.management.deploy.OamVersion;Lweblogic.management.runtime.DeploymentTaskRuntimeMBean;Z)V(SlaveDeployer.java:866)
    at weblogic.management.deploy.slave.SlaveDeployer.prepareDelta(Lweblogic.management.deploy.OamDelta;Lweblogic.management.deploy.OamVersion;ZLjava.lang.StringBuffer;)Z(SlaveDeployer.java:594)
    at weblogic.management.deploy.slave.SlaveDeployer.prepareUpdate(Ljava.util.ArrayList;Z)V(SlaveDeployer.java:508)
    at weblogic.drs.internal.SlaveCallbackHandler$1.execute(Lweblogic.kernel.ExecuteThread;)V(SlaveCallbackHandler.java:25)
    at weblogic.kernel.ExecuteThread.execute(Lweblogic.kernel.ExecuteRequest;)V(ExecuteThread.java:219)
    at weblogic.kernel.ExecuteThread.run()V(ExecuteThread.java:178)
    at java.lang.Thread.startThreadFromVM(Ljava.lang.Thread;)V(Unknown Source)

    What could be the reason?

    Thanks

    DB:2.55:Spring Acegi's Sample Application On Weblogic 8.1 Sp4 ak

    Hi,

    Did you try to deploy the Spring app in exploded format ?

    Regards
    Anilkumar kari

  • RELEVANCY SCORE 2.55

    DB:2.55:When Am Trying To Run A Sample App Of Android Through Porting Getting Errors 8j



    An internal error occurred during: "Launching NotePad".com.android.ide.eclipse.adt.internal.project.Andro​idManifestHelper.parseForData(Lorg/eclipse/core/re​sources/IProjectLcom/android/sdklib/xml/ManifestData;

    Pls could any one Rectify or any one got the similar errors and got solved ???




    Regards,Murugesan

    DB:2.55:When Am Trying To Run A Sample App Of Android Through Porting Getting Errors 8j


    The SDK has installed 4.0.1 packages these are all compatible with ADT 21 plugin only

    so try un-installing all those packgages keep android 2.3.3 alone




    Regards,Murugesan

  • RELEVANCY SCORE 2.54

    DB:2.54:Xfinity Connect Mobile App Android Caller Id x7


    I can not get the Caller ID to work on my Android with the Xfinity Connect Mobile App that updated on3/22/2013. I keep getting "Request failed. Please try again later.

    DB:2.54:Xfinity Connect Mobile App Android Caller Id x7

    I can not get the Caller ID to work on my Android with the Xfinity Connect Mobile App that updated on3/22/2013. I keep getting "Request failed. Please try again later.

  • RELEVANCY SCORE 2.54

    DB:2.54:Apk Builder Failed z8



    Unity 3D com AMRv6 with VFP s vai conseguir compilar games para androide se a verso do Android SDK for inferior a Revision 22. Tente baixar a Android SDK revision 20, nela existe o arquivo apkbuilder.bat, copie e cole toda pasta tools em seu diretrio do Android SDK. Qualquer dvida segue link tutorial http://eciosf.wordpress.com/2013/06/27/solucao-exception-error-building-player-win32exception-apkbuilder-bat/

    DB:2.54:Apk Builder Failed z8


    Look here: http://forum.unity3d.com/threads/107511-Problem-on-APK-Building


    maybe can help ya. -_^

  • RELEVANCY SCORE 2.54

    DB:2.54:Failed To Create Sample Data ! sx


    Hello,
    Kindly help me in this plz.
    SharePoint 2013 Installation Succeeded but when I run the configuration wizard I get this error !

    Configuration Failed. One or more configuration settings failed. Completed configuration settings will not be rolled back. resolve the problem and run the configuration wizard again. The following contains detailed information about the failure:
    Failed to create sample data.
    An exception of type System. ArguementException was thrown. Additional exception information: The SDDL string contains an invalid sid or a sid that cannot be translated.
    Parameter name : sddlForm
    Thanks in Advance.

    DB:2.54:Failed To Create Sample Data ! sx

    hi Asim,
    check following links, hope it will help to fix your issues,
    http://social.msdn.microsoft.com/Forums/sharepoint/en-US/ee9fc828-6d63-43b0-9bbc-76065182b1fd/sharepoint-2013-products-configuration-wizard-error-failed-to-create-sample-data
    http://squidpip.com/blog/sharepoint-2013-resolving-the-sddl-issue/
    Regards,
    karimPlease remember to mark your question as answered if this solves your problem.

  • RELEVANCY SCORE 2.54

    DB:2.54:Vsp 7008: Asp.Net Exception: The Web Site Could Not Be Configured Correctly; Getting Asp.Net Process Information Failed kz


    Hi Guys,
    Could you please help me check this issue below? thanks in advance!
    Run: vsperfaspnetcmd /sample /memory:lifetime /nowait
    http://localhost/
    Microsoft (R) VSPerf ASP.NET Command, Version 11.0.0.0
    Copyright (C) Microsoft Corporation. All rights reserved.
    Configuring and attaching to ASP.NET process. Please wait.
    Error
    VSP 7008: ASP.net exception: The web site could not be configured correctly; getting ASP.NET process information failed. The server may not be running a version of ASP.NET version 2.0 or greater. Requesting 'http://localhost/VSEnterpriseHelper.axd' returned
    an error: The remote server returned an error: (500) Internal Server Error.

    DB:2.54:Vsp 7008: Asp.Net Exception: The Web Site Could Not Be Configured Correctly; Getting Asp.Net Process Information Failed kz


    Glad to see this issue has been resolved.J
    Have a nice day,Jack Zhai [MSFT]
    MSDN Community Support | Feedback to us

  • RELEVANCY SCORE 2.54

    DB:2.54:Win8 Driver Build Issue d1


    Hi,
    I created a sample KMDF driver using VS2011 developer Preview.
    While Building the Sample, i am getting the below error.

    2
    ..\KMDF Driver1\KMDF Driver1.vcxproj Configuration='Windows 7 Debug' Platform='Win32'
    2
    2C:\Program Files (x86)\Windows Kits\8.0\build\WindowsDriver8.0.common.targets(1281,5):
    error MSB4062: The DPVerifierTask task could not be loaded from the assembly C:\Program Files (x86)\Windows Kits\8.0\\bin\Microsoft.DriverKit.Build.Tasks.PackageVerifier.dll. Could not load file or assembly 'Microsoft.DriverKit.Build.Tasks.PackageVerifier,
    Version=6.2.0.0, Culture=neutral, PublicKeyToken=31bf3856ad364e35' or one of its dependencies. Strong name validation failed. (Exception from HRESULT: 0x8013141A) Confirm that the UsingTask declaration is correct, that the assembly and all its dependencies
    are available, and that the task contains a public class that implements Microsoft.Build.Framework.ITask.
    22Build
    FAILED.

    Can anyone help me in resolving this.

    DB:2.54:Win8 Driver Build Issue d1

    are you using the developer preview WDK as well? what OS are you trying to use VS2011 on?d -- This posting is provided AS IS with no warranties, and confers no rights.

  • RELEVANCY SCORE 2.54

    DB:2.54:Calendar Weekofyear Calculation Issue ka


    Hi ,

    I am getting problem in calculating exact week of year from day month. I had posted my issue earlier also and
    got response which worked for a month but again it failed. I am not able to get actual answer for my issue.
    Someone please help. Sample code given below

    public static void main(String[] argc) throws Exception{
    String dateString = "26OCT";
    SimpleDateFormat sdf = new SimpleDateFormat ( "ddMMM" );
    Date parsedDate = sdf.parse( dateString );
    Calendar calendar = Calendar.getInstance();
    calendar.setFirstDayOfWeek( Calendar.MONDAY );
    calendar.setMinimalDaysInFirstWeek( 4 );
    calendar.setTime( parsedDate );
    int weekOfYear = calendar.get( Calendar.WEEK_OF_YEAR );
    System.out.println(" weekOfYear "+weekOfYear);
    }

    Output which I got is : weekOfYear 44
    which should be 43 instead.

    Thanks in advance

    DB:2.54:Calendar Weekofyear Calculation Issue ka

    For keeping up with the current year (and day/month), you could create a Date using System.currentTimeMillis() as the constructor parameter.

  • RELEVANCY SCORE 2.54

    DB:2.54:How To Catch Exceptions Caused By Streamsocket::Connectasync()? mx


    There is one StreamSocket sample from this link:
    http://code.msdn.microsoft.com/windowsapps/StreamSocket-Sample-8c573931
    If the host and port are both OK, the following code (from the example) works as expected.
    try
    {
    taskvoid(socket-ConnectAsync(hostName, ServiceNameForConnect-Text, SocketProtectionLevel::PlainSocket))
    .then([this] (taskvoid previousTask)
    {
    try
    {
    // Try getting all exceptions from the continuation chain above this point.
    previousTask.get();
    rootPage-NotifyUser(Connected, NotifyType::StatusMessage);

    }
    catch (Exception^ exception)
    {
    rootPage-NotifyUser(Connect failed with error: exception-Message, NotifyType::ErrorMessage);
    }
    catch(Platform::COMException^ ex)
    {
    rootPage-NotifyUser(COMException: ex-Message, NotifyType::ErrorMessage);
    }
    catch(...)
    {
    rootPage-NotifyUser(ex1, NotifyType::ErrorMessage);
    }
    });
    }
    catch (...)
    {
    rootPage-NotifyUser(ex2, NotifyType::ErrorMessage);
    }

    -------------------------------------
    But if we input an unavailable hostName, then the code crash without catching with the following exception:
    First-chance exception at 0x74B14B32 in StreamSocket.exe: Microsoft C exception: Platform::COMException ^ at memory location 0x02F0D88C. HRESULT:0x8007274D

    -------------------------------------
    If we input an unavailable port, then the code crash without catching with the following exception:
    First-chance exception at 0x74B14B32 in StreamSocket.exe: Microsoft C exception: Platform::COMException ^ at memory location 0x02DFDA0C. HRESULT:0x8007274C

    -------------------------------------

    My question is how to catch all the exceptions of StreamSocket::ConnectAsync()?

    DB:2.54:How To Catch Exceptions Caused By Streamsocket::Connectasync()? mx

    We do have previousTask.get() in the 1st then() block. I think when the code steps into the 1st then() block, the ConnectAsync task has finished.
    Why the 2nd then() block can cover the actual running of the ConnectAsync task? I tried this but no effect.

  • RELEVANCY SCORE 2.54

    DB:2.54:Trouble With Audiorecord Class In Android Version 2.3.6 In Comparison To 2.3.5 pc


    hello all,
    Is there a known issue related to the AudioRecord class in Android version 2.3.6 in comparison to 2.3.5?

    We have successfully tested an app for getting and streaming voice records (PCM) with 8.000 and 16.000 sample rates on Samsung Pocket and S6500 (Android 2.3.5).

    But we have trouble in testing Mini2 (Android 2.3.6) with the same application, we cannot initialize AudioRecord with 16.000 sample rate.

    Is there differences in initalizing the AudioRecord instance between android versions?

    We have also trouble in getting logs (logcat) and adb uploads of apk with the Mini2 devices.

    Can anybody help?

    DB:2.54:Trouble With Audiorecord Class In Android Version 2.3.6 In Comparison To 2.3.5 pc

    Hello,

    Thissupport channel is for Samsung specific issues only, so since your question is an Android generic one, I'm afraid it is outside of our scope.
    Please try Android developer support or a general forum like stackoverflow.
    http://developer.android.com/support.html
    http://stackoverflow.com/

    Regards,
    Ziemowit Pazderski
    Samsung Developers

    This content has been quoted from ugur.okumus@s thought. (Link to original post)
    hello all,

    Is there a known issue related to the AudioRecord class in Android version 2.3.6 in comparison to 2.3.5?

    We have successfully tested an app for getting and streaming voice records (PCM) with 8.000 and 16.000 sample rates on Samsung Pocket and S6500 (Android 2.3.5).

    But we have trouble in testing Mini2 (Android 2.3.6) with the same application, we cannot initialize AudioRecord with 16.000 sample rate.

    Is there differences in initalizing the AudioRecord instance between android versions?

    We have also trouble in getting logs (logcat) and adb uploads of apk with the Mini2 devices.

    Can anybody help?

  • RELEVANCY SCORE 2.54

    DB:2.54:Rfc_Error_System_Failure: Exception Condition "Failed" Raised On Publish Of cx



    Hi,

    When i preview my Bi query in potal i am getting following exception :

    RFC_ERROR_SYSTEM_FAILURE: Exception condition "FAILED" raised

    Earlier i had already published some query which is working properly, but the new one which i am publishing now is giving me above exception.

    Regards,

    Jigar Oza

  • RELEVANCY SCORE 2.53

    DB:2.53:Sample Weblogic-Ra.Xml jk



    Is there a sample web-logic-ra.xml available. I am trying to deploy a connector
    and it complains about the following ( I do not have a weblogic-ra.xml in the
    rar file )

    preparing application My Connector on localhost
    Exception caught for task Activate application My Connector on localhost: Prepare
    failed. Task Id = 4
    Module, myconn, reported error: weblogic.management.DeploymentException: Exception
    processing weblogic-ra.xml for: null: java.lang.NullPointerException
    failed application My Connector on localhost

    weblogic.management.ApplicationException: Prepare failed. Task Id = 4
    {
    Module Name: myconn, Error: weblogic.management.DeploymentException: Exception
    processing weblogic-ra.xml for: null: java.lang.NullPointerException
    }
    at weblogic.j2ee.J2EEApplicationContainer.prepare(J2EEApplicationContainer.java:661)
    at weblogic.j2ee.J2EEApplicationContainer.prepare(J2EEApplicationContainer.java:552)

    DB:2.53:Sample Weblogic-Ra.Xml jk

    Hi Madhav,

    I am attaching a sample weblogic-ra.xml. For more information, please
    see the following edocs:

    http://edocs.beasys.com/wls/docs70/jconnector/index.html

    Cheers,
    Chris

    Madhav Inamti wrote:
    Is there a sample web-logic-ra.xml available. I am trying to deploy a connector
    and it complains about the following ( I do not have a weblogic-ra.xml in the
    rar file )

    preparing application My Connector on localhost
    Exception caught for task Activate application My Connector on localhost: Prepare
    failed. Task Id = 4
    Module, myconn, reported error: weblogic.management.DeploymentException: Exception
    processing weblogic-ra.xml for: null: java.lang.NullPointerException
    failed application My Connector on localhost

    weblogic.management.ApplicationException: Prepare failed. Task Id = 4
    {
    Module Name: myconn, Error: weblogic.management.DeploymentException: Exception
    processing weblogic-ra.xml for: null: java.lang.NullPointerException
    }
    at weblogic.j2ee.J2EEApplicationContainer.prepare(J2EEApplicationContainer.java:661)
    at weblogic.j2ee.J2EEApplicationContainer.prepare(J2EEApplicationContainer.java:552)

    [weblogic-ra.xml]

  • RELEVANCY SCORE 2.53

    DB:2.53:Deploy Failed!: ; Nested Exception s7


    Hi,
    When i am trying to deploy the war in the OAS i am getting this error.
    Please help. Need is very urgent post me reply ASAp. :-)
    Error

    Failed to deploy web application "test". Failed to deploy web application "test". . Nested exception
    Resolution:

    Base Exception:
    java.rmi.RemoteException
    deploy failed!: ; nested exception is:
    oracle.oc4j.admin.internal.DeployerException: No space left on device. deploy failed!: ; nested exception is:
    oracle.oc4j.admin.internal.DeployerException: No space left on device

    DB:2.53:Deploy Failed!: ; Nested Exception s7

    the error clearly telle that this is a space issue..

    Thanks-Santosh Shetgar

  • RELEVANCY SCORE 2.53

    DB:2.53:Wcf - Protocol Exception j1


    Hello,While i am running my sample wcf application i am getting following exception

    system.servicemodel.protocolexception

    please suggest any solution

    DB:2.53:Wcf - Protocol Exception j1

    Hi,According to the msdn documenthttp://msdn.microsoft.com/en-us/library/bb907249.aspxThe possible reason would be wrong endpoint address ormismatched binding configuration, pleasecheck your client configuration file.For further help, please provide the service configuration system.servicemodel section and client configuration file, we'll try to find the root cause.Thanks,Mog Liang

  • RELEVANCY SCORE 2.53

    DB:2.53:Sample Program For Ssl (Altclient)Giving No Server Found Exception k3



    hai
    i am running the sample AltClient program that is in samples folder.
    my command is follows
    D:\bea\wlserver6.1\config\mydomainjava - DIgnoreHostNameVerifier=true examples.s
    ecurity.acl.AltClient t3s://localhost:7002 -user guest -pass guest -sslCert
    demokey.pem;democert.pem -servername myserver

    my server name that i created using admin consols is "myserver"
    when i am running this i am getting the following exception.

    javax.naming.CommunicationException. Root exception is java.net.ConnectExceptio
    n: No server found at T3S://localhost:7002
    at weblogic.rjvm.RJVMFinder.findOrCreate(RJVMFinder.java:155)
    at weblogic.rjvm.ServerURL.findOrCreateRJVM(ServerURL.java:207)
    at weblogic.jndi.WLInitialContextFactoryDelegate.getInitialContext(WLIni
    tialContextFactoryDelegate.java:261)
    at weblogic.jndi.Environment.getContext(Environment.java:155)
    at weblogic.jndi.Environment.getInitialContext(Environment.java:138)
    at examples.security.acl.AltClient.main(AltClient.java:160)
    Failed to frob

    DB:2.53:Sample Program For Ssl (Altclient)Giving No Server Found Exception k3

    Hello Nivas,

    You need to add the property

    -Dweblogic.security.SSL.hostnameVerifier=examples.security.sslclient.NulledH
    ostnameVerifier

    to the line that starts the client.

    This will allow the ssl handshake between the client and the server to take
    place.

    I hope this helps.
    Ludovic.
    Developer Relations Engineer
    BEA Support

    "nivas" nivas@india.com a crit dans le message news:
    3c2ad728$1@newsgroups.bea.com...

    hai
    i am running the sample AltClient program that is in samples folder.
    my command is follows
    D:\bea\wlserver6.1\config\mydomainjava - DIgnoreHostNameVerifier=trueexamples.s
    ecurity.acl.AltClient t3s://localhost:7002 -user guest -passguest -sslCert
    demokey.pem;democert.pem -servername myserver

    my server name that i created using admin consols is "myserver"
    when i am running this i am getting the following exception.

    javax.naming.CommunicationException. Root exception isjava.net.ConnectExceptio
    n: No server found at T3S://localhost:7002
    at weblogic.rjvm.RJVMFinder.findOrCreate(RJVMFinder.java:155)
    at weblogic.rjvm.ServerURL.findOrCreateRJVM(ServerURL.java:207)
    atweblogic.jndi.WLInitialContextFactoryDelegate.getInitialContext(WLIni
    tialContextFactoryDelegate.java:261)
    at weblogic.jndi.Environment.getContext(Environment.java:155)
    atweblogic.jndi.Environment.getInitialContext(Environment.java:138)
    at examples.security.acl.AltClient.main(AltClient.java:160)
    Failed to frob

  • RELEVANCY SCORE 2.53

    DB:2.53:Error While Running Samples 7k


    1) started the examples server through startWebLogicEx.sh
    2) set up the envoronment
    ./setExamplesEnv.sh
    but when running some security sample , i am getting the following exception
    suresh@xwss:~/bea/wlserver_10.3/samples/server/examples/src/examples/webservices/security_jws$ ant build
    Buildfile: build.xml

    BUILD FAILED
    /home/suresh/bea/wlserver_10.3/samples/server/examples/src/examples/webservices/security_jws/build.xml:19: taskdef class weblogic.wsee.tools.anttasks.JwscTask cannot be found

    DB:2.53:Error While Running Samples 7k

    tried .. but same exception
    taskdef class weblogic.wsee.tools.anttasks.JwscTask cannot be found
    how to select secuirty crentials from netbeans for securing a webservice?
    Thanks
    Suresh

  • RELEVANCY SCORE 2.53

    DB:2.53:Unable To Deploy Sample Hr J2ee App af


    i get the following error when i try to deploy the sample HR J2EE app provided by Oracle.

    Deployment failed: Nested exception
    Resolution:

    Base Exception:
    java.rmi.RemoteException
    deploy failed!: ; nested exception is:
    oracle.oc4j.admin.internal.DeployerException: Error initializing ejb-module; Exception No DataSource found at jdbc/hrDS. deploy failed!: ; nested exception is:
    oracle.oc4j.admin.internal.DeployerException: Error initializing ejb-module; Exception No DataSource found at jdbc/hrDS

    any kind of suggestion or help is apprceiated.

    I've Oracle InfraStructure and App Server installed.

    I also have J2SE 1.4.2 installed.

    DB:2.53:Unable To Deploy Sample Hr J2ee App af

    Can you confirm that you did you follow all the steps in the instructions as described, particularly step7: in this section:

    http://www.oracle.com/technology/obe/obe_as_10g/deploy/deployj2ee/j2ee.htm#ds

    Did you enter the all the details as specified in the instructions

    n the Create Data Source page, enter (or copy and paste) these values in the following fields (other fields should remain blank):
    Name: HRDS
    Data Source Class: com.evermind.sql.DriverManagerDataSource
    JDBC URL: jdbc:oracle:thin:@localhost:1521:orcl
    Note: You may need to replace localhost with the host name or IP address of the server where the Oracle database software is installed and running.
    JDBC Driver: oracle.jdbc.driver.OracleDriver
    Username: hr
    Password: hr
    JNDI Location: jdbc/hrCoreDS
    JNDI Transactional (XA) Location: jdbc/xa/hrXADS
    EJB Location: jdbc/hrDS (this is the Data Source you specified for the entity beans upon deploying the application)
    Connection Retry Interval (secs): 1
    Cached Connection Inactivity Timeout (secs): 30

    The error message is saying that it is unable to find the named datasource, so it's probable that it wasn't created, or created correctly.

    If you think you did it correctly, then I'd have a look at the datasources page in enterprise manager and verify that the datasource is exactly as the instructions specify.

    -steve-

  • RELEVANCY SCORE 2.53

    DB:2.53:Rpc Error For Adal For Windows Phone 8.1 km


    I have hosted a Azure Mobile Service and I have used ADAL from Nuget . I am able to call and get response from Azure Mobile Service using ADAL for iOS and Android / Windows Store . However
    for Windows Phone 8.1 . I am getting below exception . I am debugging in emulator.

    public async Taskstring GetAuthenticationTokenAsync(string authority, string resourceUri, string
    clientId, string redirectUri)
    {
    string accessToken = string.Empty;
    try
    {
    AuthenticationContext ac = AuthenticationContext.CreateAsync(authority).GetResults();
    var tcs = new TaskCompletionSourcestring();
    //Fails here

    ac.AcquireTokenAndContinue(resourceUri, clientId, new Uri(redirectUri), result =
    {
    .....
    });
    accessToken
    = await tcs.Task;
    }
    catch(Exception ex)
    {
    accessToken = string.Empty;
    }
    return accessToken;
    }
    The remote procedure call failed. (Exception from HRESULT: 0x800706BE)
    at Windows.Security.Authentication.Web.WebAuthenticationBroker.AuthenticateAndContinue(Uri requestUri, Uri callbackUri, ValueSet
    continuationData, WebAuthenticationOptions options)
    at Microsoft.IdentityModel.Clients.ActiveDirectory.WebUI.Authenticate(Uri authorizationUri, Uri redirectUri, IDictionary`2 headersMap, CallState callState)
    at Microsoft.IdentityModel.Clients.ActiveDirectory.AcquireTokenInteractiveHandler.AcquireAuthorization()
    at Microsoft.IdentityModel.Clients.ActiveDirectory.AuthenticationContext.AcquireTokenAndContinueCommon(String resource, String clientId, Uri redirectUri, UserIdentifier userId, String extraQueryParameters, AuthenticationContextDelegate authDelegate)

    DB:2.53:Rpc Error For Adal For Windows Phone 8.1 km

    This happens, if you call AcquireTokenAndContinuefromOnNavigatedTo orOnNavigatedFrom.
    It's the same forWebAuthenticationBroker.AuthenticateAndContinue.
    A workaround for the scenario, where you want that the login appears ASAP, without waiting for the user to press a button, etc on the UI, is this one:
    public MainPage()
    {
    InitializeComponent();

    Loaded = async (sender, args) =
    {
    await Dispatcher.RunAsync(CoreDispatcherPriority.Normal, GetToken);
    };
    }

  • RELEVANCY SCORE 2.53

    DB:2.53:Recently Getting Timeout On Android Vpn To Hamachi kf



    I have been using the Android VPN (PPTP) connection for a few months now and worked great.

    However, the past few days, when I try to connect from the Android, It states "connecting..." waits about 60 seconds and then says "Timeout".

    Nothing has changed anywhere. As a matter of fact, on the website, I can hover over the android device and it says "Offline for 1 minute" after the failed connect/timeout.

    It is like it is connecting, then dropping or something.

    And advice would be appreciated, Thanks.

    DB:2.53:Recently Getting Timeout On Android Vpn To Hamachi kf


    I have been using the Android VPN (PPTP) connection for a few months now and worked great.

    However, the past few days, when I try to connect from the Android, It states "connecting..." waits about 60 seconds and then says "Timeout".

    Nothing has changed anywhere. As a matter of fact, on the website, I can hover over the android device and it says "Offline for 1 minute" after the failed connect/timeout.

    It is like it is connecting, then dropping or something.

    And advice would be appreciated, Thanks.

  • RELEVANCY SCORE 2.53

    DB:2.53:Configration Failed z3


    Failed to create Sample Data

    An exception of type System.Data.SqlClient.SqlException was thrown. Addition Exceptional information:
    Cannot open database User Profile Service Application_ProfileDb_90a125----------------
    requested by the login. The login failed.
    Login failed for user 'WIN-90-----\Ashwin'.

    DB:2.53:Configration Failed z3

    Hello ashwinbalaguru,
    Like Alex already stated, can you give as some more information? Are you building a new SharePoint farm for instance?
    Btw. The errors look a lot like the ones in this thread:
    http://social.technet.microsoft.com/Forums/en-US/87474c68-ea9f-4523-85f1-c609419aa79c/sharedservices1-default-provisioning-failed-cannot-open-database-?forum=sharepointadminlegacy
    Hope this helps a bit.- Dennis | Netherlands | Blog |
    Twitter

  • RELEVANCY SCORE 2.53

    DB:2.53:Deployment Failed: Nested Exception sz


    while deploying ear i am getting this exception.

    Deployment failed: Nested exception
    Resolution:

    Base Exception:
    com.evermind.server.rmi.OrionRemoteException
    Disconnected: Connection reset. Disconnected: Connection reset

    DB:2.53:Deployment Failed: Nested Exception sz

    while deploying ear i am getting this exception.

    Deployment failed: Nested exception
    Resolution:

    Base Exception:
    com.evermind.server.rmi.OrionRemoteException
    Disconnected: Connection reset. Disconnected: Connection reset

  • RELEVANCY SCORE 2.53

    DB:2.53:When I Port Android 2.3.3 Sample App To The Bb Dev 10 Alpha Simulator I Face A Error sx



    The Eclipse Console Pops out this error message

    [2012-11-17 15:09:04 - AccelerometerPlay] Status ERROR: net.rim.ajde code=4 Connecting 192.168.176.128 to ADB failed! null children=[Status ERROR: net.rim.ajde code=0 Please check if the Android player was fully started when you got this error. If not, you can either increase the Android player launch timeout on the BlackBerry-BlackBerry Android Development Tools preference page or wait until the Android player is fully started and try again. null]




    Regards,Murugesan

    DB:2.53:When I Port Android 2.3.3 Sample App To The Bb Dev 10 Alpha Simulator I Face A Error sx


    I also faced this issue. I am not able to load any android application to my device.

    I tried to clean the project, restart the device but nothing helps.

    Please help me on this.

  • RELEVANCY SCORE 2.53

    DB:2.53:How To Get Android Sample Plugin To Compile 19



    Try this


    http://www.platoevolved.com/blog/programming/android/creating-an-android-plugin-for-unity/

    DB:2.53:How To Get Android Sample Plugin To Compile 19


    Try this


    http://www.platoevolved.com/blog/programming/android/creating-an-android-plugin-for-unity/

  • RELEVANCY SCORE 2.52

    DB:2.52:I Undeployes Some Applications From Portal (I Used Sdm To Undeploy) cx


    Hi,I undeployes some applications from portal (I used SDM to undeploy)But when I login to portal content management - web screenErrors below shown.How can I solve this problem?Thanks.Errors Exception while getting JCo Clients Failed to get list of defined JCO clients for deployable object 'local/TutWD_FlightList_Init'. Exception while getting JCo Clients Failed to get list of defined JCO clients for deployable object 'local/FirstWebdynpro'. Exception while getting JCo Clients Failed to get list of defined JCO clients for deployable object 'local/ZPRT_HR_DENEME'. Exception while getting JCo Clients Failed to get list of defined JCO clients for deployable object 'local/SAP_Kullanicisi_Sifre_Resetleme'. Exception while getting JCo Clients Failed to get list of defined JCO clients for deployable object 'local/EO_TelefonDefteri'. Exception while getting JCo Clients Failed to get list of defined JCO clients for deployable object 'local/AK_RFC'. Exception while getting JCo Clients Failed to get list of defined JCO clients for deployable object 'local/AK_TELDFT'. Exception while getting JCo Clients Failed to get list of defined JCO clients for deployable object 'local/Egitim3_ms'. Exception while getting JCo Clients Failed to get list of defined JCO clients for deployable object 'local/Tdefteri_ms'. Exception while getting JCo Clients Failed to get list of defined JCO clients for deployable object 'local/UIBinding'. Exception while getting JCo Clients Failed to get list of defined JCO clients for deployable object 'local/EO_RFC'. Exception while getting JCo Clients Failed to get list of defined JCO clients for deployable object 'local/Egitim4'. Exception while getting JCo Clients Failed to get list of defined JCO clients for deployable object 'local/Egitim3'. Exception while getting JCo Clients Failed to get list of defined JCO clients for deployable object 'local/Egitim2'. Exception while getting JCo Clients Failed to get list of defined JCO clients for deployable object 'local/Egitim1'. Exception while getting JCo Clients Failed to get list of defined JCO clients for deployable object 'local/SimpleValueHelp'. Exception while getting JCo Clients Failed to get list of defined JCO clients for deployable object 'local/SA_TelefonD'. Exception while getting JCo Clients Failed to get list of defined JCO clients for deployable object 'local/PortalLogonDetails'. Exception while getting JCo Clients Failed to get list of defined JCO clients for deployable object 'local/TableHandling'. Exception while getting JCo Clients Failed to get list of defined JCO clients for deployable object 'local/ks_TelefonRehberi'. Exception while getting JCo Clients Failed to get list of defined JCO clients for deployable object 'local/TutWD_FlightList_Init'.

  • RELEVANCY SCORE 2.52

    DB:2.52:Mqjms2005 - Ibm Wsad/Mq Pub/Sub Sample dx


    Has anyone had problems running the IBM pub-sub sample for wsad and wq.

    http://www-106.ibm.com/developerworks/ibm/library/i-jms2/

    I am running MQ5.3 and WIN2000.

    The P2P example works fine, getting the folowing error when trying to test client access:

    Exception: javax.jms.JMSException: MQJMS2005: failed to create MQQueueManager for 'localhost:QM1'

    Any help will be greatly appreciated.

    DB:2.52:Mqjms2005 - Ibm Wsad/Mq Pub/Sub Sample dx

    I actually skipped the client access section, since we are running of the same machine. Thanks for the help.

    Are you aware that Willy has a new article for WSAD5?

    http://www-106.ibm.com/developerworks/ibm/library/i-ad5mq53-2/

  • RELEVANCY SCORE 2.52

    DB:2.52:Sharepoint Products And Technologies Configuration Wizard Error : Failed To Create Sample Data c9


    Hi,

    I'm running the Sharepoint Products and Technology Configuration Wizard and its failing on step 9 giving me the following error:

    One or more configuration settings failed.
    Failed to create sample data
    An exception of type Microsoft.SharePoint.SPException was thrown. Additional exception information :User cannot be found.

    keerthi

    DB:2.52:Sharepoint Products And Technologies Configuration Wizard Error : Failed To Create Sample Data c9

    A little late but anyway:I encountered same problem and the reason was simple: my computer was not connected to domain at the time of installation (development laptop).User error hits because the installer could verifythelogon
    userfrom AD.

  • RELEVANCY SCORE 2.52

    DB:2.52:S Pen Sdk Sample Problem 1f


    Trying to run Example 1 from S Pen SDK examples and getting the following error:

    Could not find class 'com.samsung.sdraw.example1.MainActivity$3', referenced from method com.samsung.sdraw.example1.MainActivity.init

    Could not find class 'com.samsung.sdraw.CanvasView', referenced from method com.samsung.sdraw.example1.MainActivity.onCreate

    FATAL EXCEPTION: main

    java.lang.NoClassDefFoundError: com.samsung.sdraw.example1.MainActivity$3

    at com.samsung.sdraw.example1.MainActivity.init(MainActivity.java:239)

    What is the problem?

    I am using NetBeans 7.1.1 +android plugin + Galaxy Note. AVD gives the same error. Android applications which are not using any external SDK can be run and debug without any errors.

    DB:2.52:S Pen Sdk Sample Problem 1f

    It was Android SDK Tools rev.17 bug. Rev.18 contains the fix.

  • RELEVANCY SCORE 2.52

    DB:2.52:Not Able To Register User From Native Android App cf



    Hi,

    Created a user in SCC ex:midhun and activation code :123.

    SUP version 2.1.3

    From the android native application when I pass the credentials I am getting the error "MMS authentication failed".

    But I am able to login using the SCC login credentials (supAdmina and s3pAdmin) from the application

    Given below is the code I used;

    try {

    ConnectionProperties connProps = app.getConnectionProperties();
    connProps.setServerName(HOST);
    connProps.setPortNumber(PORT);
    //connProps.setActivationCode(PASSWORD);
    PurchaseOrderApprovalDB.setApplication(app);
    LoginCredentials loginCredentials = new LoginCredentials(
    USERNAME, PASSWORD);
    connProps.setLoginCredentials(loginCredentials);

    if (app.getRegistrationStatus() != RegistrationStatus.REGISTERED) {

    //Getting exception during the below code
    app.registerApplication(600);
    } else {
    app.startConnection(600);
    }
    } catch (Exception e) {
    returnMsg = e.getMessage();
    }

    I have redeployed the app several times and tested but didn't work.
    Please give a solution

    DB:2.52:Not Able To Register User From Native Android App cf


    David,

    Thanks for your inputs.

    I had overcome this by eliminating the fields activation code in coding.

    Now the device is getting registered through LDAP authentication.

    Regards,

    Sara