• RELEVANCY SCORE 4.48

    DB:4.48:Error Application Id Projectserverapplication From Secure Store Service dj





    Hello,
    I was finishing to install Project Server 2013 on Windows Server 2012 when I tested the
    Report capability : I got he following error message :
    An error occurred while accessing application id ProjectServerApplication from
    Secure Store Service. The following connections failed to refresh: Project Server – Simple Projects List.
    Any idea of what I'm missing?
    Thanks

    DB:4.48:Error Application Id Projectserverapplication From Secure Store Service dj

    Hi, it's also worth troubleshooting this using Brian's blog -http://blogs.msdn.com/b/brismith/archive/2010/09/16/project-server-2010-business-intelligence-center-common-errors.aspxBen Howard [MVP] blog |
    web

  • RELEVANCY SCORE 4.28

    DB:4.28:An Error Occurred While Accessing Application Id Projectserverapplication From Secure Store Service. 9z





    Hi,I've installed Project Server 2010 Beta and configured the Secure Store Service with the following steps:1. Created Encryption Key2. Created Target Application with ID ProjectServerApplication and Type Group, Defaults from Add Fields as well as Target Application Administrators FarmAdmin and Members Report Viewers3.  Set Credentials to FarmAdminWhen accessing a sample report from the BI Center however I receive:An error occurred while accessing application id ProjectServerApplication from Secure Store Service. The following connections failed to refresh: Project Server - Simple Projects List What was my mistake? What is missing?Thanks for any adviceJohnJohn

    DB:4.28:An Error Occurred While Accessing Application Id Projectserverapplication From Secure Store Service. 9z

    could you
    solve this problem?
    I did
    the same steps and
    gives me the same
    error!

    Greetings

  • RELEVANCY SCORE 4.00

    DB:4.00:Peoplesoft An Error Has Occurred While Accessing Record Definition fk





    All,

    Did you have an experience on when you modified a record and save, following error occurred.
    an error has occurred while accessing record definition (47,5)

    Thanks,

    DB:4.00:Peoplesoft An Error Has Occurred While Accessing Record Definition fk

    May I know what you are changing in the record and did you got any error while opening it through app designer.

  • RELEVANCY SCORE 3.88

    DB:3.88:Libreoffice Doesnt Start Anymore: General Error Access. Central Conf. 1k



    I just get a dialog with folowing content:
    The application cannot be started.
    A general error occurred while accessing your central configuration.

    DB:3.88:Libreoffice Doesnt Start Anymore: General Error Access. Central Conf. 1k


    I just get a dialog with folowing content:
    The application cannot be started.
    A general error occurred while accessing your central configuration.

  • RELEVANCY SCORE 3.74

    DB:3.74:Sql Error 600 Occurred When Accessing Program "Rsmw_Show_Topnerrors " Part dp



    Hi,

    The env details are

    oracle 10g; solaris 10 and for the CRM 2007.

    I have recently upgraded from CRM 4.0 to CRM 2007. The upgrade is successfully completed, but facing the following error.

    When ever I execute few transactions it is throwing a dump as

    SQL error 600 occurred when accessing program "RSMW_SHOW_TOPNERRORS

    and says an exceptional situation has occurred in the ORACLE software, possibly due to an error. This is not an error in an application program.

    Please do the needful.

    Best Regards

    M. Kumar

    DB:3.74:Sql Error 600 Occurred When Accessing Program "Rsmw_Show_Topnerrors " Part dp


    Hi,

    ORA-600 errors are generally preceeded by another ORA- error. Can you please check for ORA-error being reported earlier to the ORA-600 error. That would give some idea related to the error. You should get the error in System log SM21 and even in the Oracle alert log.

    Sorry repeating as mentioned earlier in the message by someone else as well. This ORA-error would give the idea to the real problem as ORA-600 can sometimes be very generic.

    Thanks and Best Regards,

    Sunil.

  • RELEVANCY SCORE 3.63

    DB:3.63:A Problem Occurred While Database Was Communicating With The Ole Server Or Activex Control pc


    Trying to determine the root cause of this error. I have multiple people accessing the database located on network drivethe database has not been split yet we have about 30 people accessing it at one time could this errorbedue to that reason?A
    problem occurred while database was communicating with the OLE server or ActiveX Control.

  • RELEVANCY SCORE 3.62

    DB:3.62:Error While Running Ssm Ui fm



    Hello all ,

    While running the SSM User Interface or administration UI , we are getting a error. The error is :

    500 Internal Server Error

    SAP NetWeaver Application Server 7.10 / AS Java 7.10

    "Application error occurred during the request procession."

    Error occured in invoking event "contextInitialized()" on listener class com.sap.cpm.sm.common.listeners.SMServletContextListener.

    Details: "The WebApplicationException log ID is [005056984B1200160000000000000D54014061C707863504]."

    We have removed the SSM application from the system and tried accessing the UI. Still the same error persists. If we remove the SSM application , then the URL should not be found. But , the same error is coming. Any idea as to where the error is and what is causing it ?

    Thanks

    Vijay

    DB:3.62:Error While Running Ssm Ui fm


    Raman,

    If you are using Oracle as your system database, the 32-bit client software for Oracle is installed on the Windows server where PAS is installed.

    If you are connecting to Oracle from the Access LSLink subsystem of PAS, you must have the Oracle client software installed on your machine.

    Also, please review the Server Configuration guide and check your Oracle settings.

    Regards,

    Bob

  • RELEVANCY SCORE 3.43

    DB:3.43:Error During Launching The Integration Builder xk



    Hi

    I installed XI3.0 SR1 as for the installation guide.When i am accessing the Integration builder during Java webstart ,i am getting the following error after launching during Java Web start

    bAn error occurred while launching/running the application.

    Title: Integration Builder

    Vendor: SAP AG

    Category: Launch File Error

    JAR resources in JNLP file are not signed by same certificate/b

    Can anyone figure out error urgently.

    regards

    DB:3.43:Error During Launching The Integration Builder xk


    There is a quick but dirty solution to get around this problem.

    On your XI homepage, go to Administration page, and then choose "repository" or "directory" tab depending on which you have problem with, and then click on link "Java Web Start Administration". On the right side, click on button "Re-initialization and force-signing". It takes a while to initialize and re-sign all the jar files. Then you will be able to launch the repository or directory.

    Regards,

    Hart

  • RELEVANCY SCORE 3.39

    DB:3.39:Exchange 2003 Databases Dismout 7a


    We had a failure last week, one of our disks in our raid array failed and we had to rebuild the array. Everything seemed to come back to life however for some reason when I backup our exchange 2003 server using backup nt or backup exec it fails and
    the database dismount. Any one have any ideas? I assume it cant find sometransactionsfiles or logs?
    Event logs on theexchangeserverdoesn'tgive much information however backup exec reports this...

    Backup- \\wexn06.BountyGroup.local\Microsoft Information Store\First Storage GroupV-79-57344-65146 - An error occurred while accessing Microsoft Exchange Server. Check the application event log on the Exchange Server for more details.

    V-79-57344-65146 - An error occurred while accessing Microsoft Exchange Server. Check the application event log on the Exchange Server for more details.

    V-79-57344-65146 - An error occurred while accessing Microsoft Exchange Server. Check the application event log on the Exchange Server for more details.

    V-79-57344-780 - Error, Exchange failed to return any log files when backing up \\wexn06.BountyGroup.local\Microsoft Information Store\First Storage Group

    Any help would be muchappreciatedor some way around this..

    Regards
    Alex.

    DB:3.39:Exchange 2003 Databases Dismout 7a

    No nt backup didn't fix it, seems as though by doing a copy and a committing the logs has fixed it. My full backup job now working.

  • RELEVANCY SCORE 3.33

    DB:3.33:Urgent: Error While Accessing The Transactions In Crmd_Bus2000126_F4 3f



    Hi Gurus,

    I am having Error while accessing the transactions in CRMD_BUS2000126_F4 (Activity Search) application.

    When I click on any of the activity created then it gives the error:

    SAP Note

    The following error text was processed in the system:

    An exception with the type CX_SY_CREATE_DATA_ERROR occurred, but was neither handled locally, nor declared in a RAISING clause

    Exception Class CX_SY_CREATE_DATA_ERROR

    Error Name CREATE_DATA_UNKNOWN_TYPE

    Program CL_CRM_BSP_DC_GENERIC=========CP

    Include CL_CRM_BSP_DC_GENERIC=========CM004

    ABAP Class CL_CRM_BSP_DC_GENERIC

    Method DO_INIT

    Line 9

    Long text The entered type '' is not a valid data type.

    PLEASE HELP,

    WILL SURELY GIVE REWARD POINTS FOR HELPFUL ANSWERS.

    JAI

    DB:3.33:Urgent: Error While Accessing The Transactions In Crmd_Bus2000126_F4 3f


    Hi,

    I have debugged the application, and came to know that

    at this location it is throwing dump

    CREATE DATA gr_structure TYPE (is_blueprint_attr-screenstructure).

    gr_strucuture -- Assosiated type is DATA, and is_blueprint_attr-screenstructure type is null.

    because of null it is throwing exception.

    As it is of standard class we cant modify the code, hope that you have to apply related SAP Note for this orelse we have to look for some other alternative solution.

    anil

  • RELEVANCY SCORE 3.05

    DB:3.05:Error Message...While Accessing The Bex Web Analyzer On Ep7 cm


    hi experts,i have deployed and configured BI java on portal server.and while accessing the roles from portal(ep7) ,for the BEx Web Analyzer getting the error message as shown below.but the other two i.e. planning wizard and planning modeller are running fine.is there is some problem while configuring or while deploying files on the portal server..please help me in this case.Portal Runtime ErrorAn exception occurred while processing a request for :iView : N/AComponent Name : N/ACould not find portal application com.sap.ip.bi.km.base.Exception id: 10:32_28/02/08_0069_19249950See the details for the exception ID in the log file

    DB:3.05:Error Message...While Accessing The Bex Web Analyzer On Ep7 cm

    hi experts,i have deployed and configured BI java on portal server.and while accessing the roles from portal(ep7) ,for the BEx Web Analyzer getting the error message as shown below.but the other two i.e. planning wizard and planning modeller are running fine.is there is some problem while configuring or while deploying files on the portal server..please help me in this case.Portal Runtime ErrorAn exception occurred while processing a request for :iView : N/AComponent Name : N/ACould not find portal application com.sap.ip.bi.km.base.Exception id: 10:32_28/02/08_0069_19249950See the details for the exception ID in the log file

  • RELEVANCY SCORE 3.03

    DB:3.03:Internal Application Error Has Occurred While Opening Windows Media Player 11. xp


    an internal application error has occurred
    Is what comes up when I try to open or use my windows media player 11 and wondering how to fix?

    OT: an inturnal appliacation error has occured

    DB:3.03:Internal Application Error Has Occurred While Opening Windows Media Player 11. xp

    Hi,

    Which operating system is installed on the computer?

    I would suggest you to try the steps from the following link:

    When I try to use Windows Media Player 11, the program does not start, or some UI elements are blank
    http://support.microsoft.com/kb/925704

  • RELEVANCY SCORE 2.85

    DB:2.85:An Error Occurred Accessing Your Windows Sharepoint Services Site Files km


    Hi,I'm getting following error while accessing the web folders and files using Sharepoint Designer 2007.An error occurred accessing your Windows SharePoint Services site files. Authors - if anuthoring against a Web server, please contact the Webmaster for this server's Web site. WebMasters - please see the server's application event log for moreI went through almost 50 sites to find the solution for this issue. No luck... Any help?Regards,- JL

    DB:2.85:An Error Occurred Accessing Your Windows Sharepoint Services Site Files km

    Hi,

    Did you install MOSS in a domain or a workgroup?

    If you installed MOSS into a workgroup and all your client machines with SharePoint Designer are a part of domain. SharePoint Designer is unable to authenticate the MOSS user because its a part of workgroup. If this were your case, try to move your MOSS to a member server in a domain, then check the effect.

    In addition, I found a workaround for you:

    1. Create a shadow account for Portal administrator in a local machine running SharePoint designer.
    2. Launch the SharePoint designer as a shadow user.
    3. Try to edit the portal and check the effect.

    Note: This is a temporary workaround and SharePoint portal installation in a workgroup is not recommended and supported by Microsoft Product Support.

    Hope this helps.

    Rock WangRock Wang– MSFT

  • RELEVANCY SCORE 2.84

    DB:2.84:Error When Using Tomcat And Javawebstart cm



    I got the following message:
    ========================================
    An error occurred while launching/running the application.

    Title: Notepad
    Vendor: Sun Microsystems, Inc.
    Category: Download Error

    Bad MIME type returned from server when accessing resource: http://c152:8080/test.jnlp - text/plain
    ========================================

    It worked fine for http://c152:8080/notepad.jnlp
    Could any one help me?

    DB:2.84:Error When Using Tomcat And Javawebstart cm

    This got solved from a previous post by izhidov :
    This person wrote:
    "Regarding Tomcat and JNLP/MIME conflict, I've read on Tomcat users list archive that the mime types should be specified in the APPLICATION web.xml file under WEB-INF dir. Seems to work great".
    Thanks.

  • RELEVANCY SCORE 2.81

    DB:2.81:Error Occurred While Packaging The Application (Ios - Standard Mode) p3



    When compiling for IOS in Standard mode an error ocurred:

    Error occurred while packaging the application:

    Exception in thread "main" com.adobe.air.ipa.ProcessError: Assembler failed

    at com.adobe.air.ipa.AOTCompiler.launchProcess(AOTCompiler.java:263)

    at com.adobe.air.ipa.AOTCompiler.compileBitcode(AOTCompiler.java:935)

    at com.adobe.air.ipa.AOTCompiler.trimAndCompileBitcode(AOTCompiler.java:763)

    at com.adobe.air.ipa.ASMGenerator.main(ASMGenerator.java:72)

    Compilation failed while executing : ADT

    Any idea?

    DB:2.81:Error Occurred While Packaging The Application (Ios - Standard Mode) p3


    In fact I resolved it, it was while using FlashDevelop IDE, one of my swc library, the assets, was included completely (not a dynamic library nor an external one). The packager didn't seem to like that so I changed it to dynamic and added a simple Array containing all my assets instance names. It worked, thanks anyways Neh

  • RELEVANCY SCORE 2.81

    DB:2.81:Error Occurred While Installing The Application: Invalid Device Specified c8



    Error occurred while installing the application: Invalid device specified i am getting this error on windows. How to solve that.

    DB:2.81:Error Occurred While Installing The Application: Invalid Device Specified c8


    Error occurred while installing the application: Invalid device specified i am getting this error on windows. How to solve that.

  • RELEVANCY SCORE 2.77

    DB:2.77:Service Unavailable - Dns Failure Errors When Accessing The Forum 8k



    Error messages like the following

    An error occurred while processing your request.

    Reference #99.7213e750.1194214807.11d9238

    DB:2.77:Service Unavailable - Dns Failure Errors When Accessing The Forum 8k


    Error messages like the following

    An error occurred while processing your request.

    Reference #99.7213e750.1194214807.11d9238

  • RELEVANCY SCORE 2.67

    DB:2.67:System Error While Accessing Characteristic Data 79



    Hi Experts,

    While copying the Settings for process management from plant 1 to plant 2, for the step "process instruction categories", I am facing an error as below:

    System error while accessing characteristic data

    Message no. 0C002

    Diagnosis

    An internal error occurred while accessing the characteristic data. The characteristic cannot be used.

    Procedure

    Contact your system administrator.

    I am using the transaction O20C.

    Can some one please through some light on this?

    Praveen

    DB:2.67:System Error While Accessing Characteristic Data 79


    Hi Praveen,

    check out this

    Note 507992 - Client adjustment of process instruction categories

  • RELEVANCY SCORE 2.67

    DB:2.67:An Unknown Error Occurred While Accessing Filename 7d


    This happens to me every time I try to open my Google Sketchup model I've made. It's bugging me because I have so much done on it and now I can't even open it. I just get "An unknown error occurred while accessing (then my file)". But then I can open every
    other sketchup model.. What's going on?

    DB:2.67:An Unknown Error Occurred While Accessing Filename 7d

    The problem is still there, I will try posting in the Sketchup forums, thanks for the help though.

  • RELEVANCY SCORE 2.66

    DB:2.66:An Error Occurred While Opening The Queue:The Remote Computer Is Not Available. (-1072824215, 0xc00e0069). fj


    Does any one I have to setup some special permission while accessing the queue using WCF over the internet.....I do have my bindings setup right as:
    endpoint name=OrderProcessorEndpoint
    address=net.msmq://development.abc.com/private/sms_service.svc
    bindingConfiguration=OrderProcessorBinding
    binding=netMsmqBinding
    contract=Simmons.Services.IOrderProcessor /
    /client
    bindings
    netMsmqBinding
    binding name=OrderProcessorBinding
    queueTransferProtocol=Srmp
    security mode=None /
    /binding
    /netMsmqBinding
    /bindingsbut I m still gettting  
    Server Error in '/myservice2' Application.

    An error occurred while opening the queue:The remote computer is not available. (-1072824215, 0xc00e0069). The  message cannot be sent or received from the queue. Ensure that MSMQ is installed and running. Also ensure that the queue is available to open with the required access mode and authorization.

    DB:2.66:An Error Occurred While Opening The Queue:The Remote Computer Is Not Available. (-1072824215, 0xc00e0069). fj

    Please join this thread for discussion:http://social.msdn.microsoft.com/Forums/en/wcf/thread/566a72f2-c620-427c-bdaa-a8824f62e9adCreating duplicate threads is a bad practice in forum discussion:http://blogs.msdn.com/ericlippert/archive/2008/02/20/how-to-not-get-a-question-answered.aspxBe a good citizen on the forum.Thanks Another Paradigm Shift
    http://shevaspace.blogspot.com

  • RELEVANCY SCORE 2.65

    DB:2.65:Sql Database Disk Space Limit Exceeded? a8


    I am getting these error messages:From Application Log in Event Viewer: "The following error occurred 60 times in the last 59 minutes: The eRoom Scheduler encountered errors.Errors occurred during incoming email: Unfortunately, the SQL database's disk space limit has been exceeded."From Application Log in Event Viewer: "An error (0x8004027b) occurred accessing database server EROOM"Our system drive has over 1GB of space available. It appears that it is not enough space, but it would be easier to point to another drive for more temp space than try to repartition the system drive.The bottom-line problem is that users cannot access eRoom while this condition persists, which is the first thing in the morning.

    DB:2.65:Sql Database Disk Space Limit Exceeded? a8

    Normally "SQL Enterprise Manager" refers to Microsoft's MS-SQL tool (included with the CD's but a separate install).It sounds like you are using the default Sybase sql database that comes included with eRoom.How big is your eRoom installation? 1 Gb should be enough for a lot of stuff in the eRoom. In my case I have a 100-to-1 ratio of disk usage files (word/excel etc) to Database size (i.e., database is tiny compared to file directory size)

  • RELEVANCY SCORE 2.65

    DB:2.65:Can't Run Demos 3a


    When I click on a demo I get the following error. It occurs with more than one demo. Anyone know what the problem is?

    An error occurred while launching/running the application.

    Title: SwingSet2
    Vendor: Sun Microsystems, Inc.
    Category: Download Error

    Missing version field in response from server when accessing resource: (http://dlres.java.sun.com/servlet/com.sun.jsc.javasoft.jaws.JNLPServlet/j2se/j2re-native-win.jar, 1.3.0_02)

    DB:2.65:Can't Run Demos 3a

    I have no problems running the SUN demo, eg Swing Set 2.

    Have you tried cleaning your cache? (file - preferences - advanced - ..)

    You also try using to run Web Start with a different VM, I had some problems with 1.3.0_02. (file - preferences - java - ..)

    If nothing helps, try a reinstalltion.

    Regards,
    Marc

  • RELEVANCY SCORE 2.64

    DB:2.64:What Caused An Unknowm Error Occurred While Accessing An Unknown File 7m


    In win7 What causes a dialog box to comeperiodically come up displying:an unknowm error occurred while accessing an unknown file?

    DB:2.64:What Caused An Unknowm Error Occurred While Accessing An Unknown File 7m

    It sounds like you could have a virus or other malware. Get your antivirus program up to date and boot into
    Safe Mode. Note that some viruses can hide themselves from your antivirus program in normal mode, so you really need to scan in
    Safe Mode. To get into Safe Mode when you first power up, hit F8 about once a second until you get the menu and select Safe Mode. Then run a full system scan.
    Microsoft has suggestions and offerings at
    http://windows.microsoft.com/en-US/windows7/how-do-I-remove-a-computer-virus
    Forum moderator Keith has some suggestions along this line at
    http://answers.microsoft.com/en-us/windows/forum/windows_7-performance/windows-explorer-has-stopped-working/6ab02526-5071-4dcc-895f-d90202bad8b3
    If that fixes it, fine. If not, use System Restore to go back to a date prior to the beginning of the problem. To run System Restore, click Start - Programs - Accessories - System Tools - System Restore. Click the box that says
    Show more restore points.
    You can check for corrupted system files. Open an administrator command prompt and run SFC if the above doesn't help. Click START, then type
    sfc in the search box, right-click SFC.EXE and click Run as administrator. Then from the command prompt type
    sfc /scannow.
    Finally if all else fails, you can check the rather cryptic system event log. To do so click Start - Control Panel - Administrative Tools - Event Viewer. Once in Event Viewer click on the system log and scroll through the entries looking for those flagged
    "error" to see if you can find hints as to where the problem could be.
    I hope this helps. Good luck.

  • RELEVANCY SCORE 2.63

    DB:2.63:Windows 2003 Terminal Server 9a


    I'm running Windows 2003 Terminal Server and Java Web Start. When trying to start any of the applications at: http://java.sun.com/products/javawebstart/demos.html
    I only get "Unable to launch xxxxx App"
    The user is a non administrator. The administrator somtimes get to launch the apps...
    More info:
    An error occurred while launching/running the application.

    Title: Notepad App
    Vendor: Sun Microsystems, Inc.
    Category: Download Error

    Bad MIME type returned from server when accessing resource: http://java.sun.com/products/javawebstart/apps/notepad.jnlp - null

    ---

    JNLPException[category: Download Error : Exception: null : LaunchDesc: null ]

    Please help.

    DB:2.63:Windows 2003 Terminal Server 9a

    Sun's Web Start sites have a problem. Don't use them for a while.

  • RELEVANCY SCORE 2.63

    DB:2.63:Everytime I Try To Execute A Bi Sample Report I Get An Error. Can You Help? 9p


    I tried refresh the connectionsin the report, but not change. I still get error:
    An error occurred while accessing application id ProjectServerApplication from Secure Store Service. The following connections failed to refresh:

    Project Server - Timesheet Data
    I click on data connections, but I could not find what I needed to update.
    Can you help and/orhave an articale on how to get started?

    DB:2.63:Everytime I Try To Execute A Bi Sample Report I Get An Error. Can You Help? 9p

    Hi,
    Have you followed all the steps outlined at
    http://technet.microsoft.com/en-us/library/ee662106.aspx, to configure the Secure Store and Excel Services trusted locations?Alex Burton
    www.epmsource.com |
    Twitter
    Project Server TechCenter |
    Project Developer Center |
    Project Server Help | Project Product Page

  • RELEVANCY SCORE 2.62

    DB:2.62:Need Help Configuring Excel Services xd


    I've configured both the Excel Serives and Secure Store Target applications and continually receive the following error message when trying to view the Simple Projects List sample report:
    An error occurred while accessing application id ProjectServerApplication from Secure Store Service. The following connections failed to refresh:

    Project Server - Simple Projects List
    The Server Logs show the following errors:

    Access Denied: Claimsstored in the credentials did not match with the group claim for a group app.

    DB:2.62:Need Help Configuring Excel Services xd


    Hello,

    I need help setting up excel services.

    Excel service is already running on sharepoint server.

    I have one reporting file which is generated by DBA with database connection. i want to upload that file under document library and i want whenever user open it through document library, it gets updated through database connection

    This is my first time, so pls guide me

    Reporting file has authentication set to -- None

    Do i require any specific settings for authentication? like unattended account ? which username should i use

    Connection String --

    Provider=SQLOLEDB.1;Integrated Security=SSPI;Persist Security Info=True;User ID=ExcelServices;Initial Catalog=SurveyData;Data Source=jdb1;Use Procedure for Prepare=1;Auto Translate=True;Packet Size=4096;Workstation ID=RSTKW7W-06709;Use Encryption for Data=False;Tag
    with column collation when possible=False

    http://../training/sptestsite/Medication_Audit_Report

    http://../training/sptestsite/Medication_Audit_Data_Connection_Library/

    Trusted File Location - is this place do i need to upload that reporting file?

    Trusted Data Connection Libraries - is this place do i need to save connection file .odc ?

    If i am not wrong, should i put

    Trusted File Location =http://../training/sptestsite/Medication_Audit_Report

    Trusted Data Connection Libraries =http://../training/sptestsite/Medication_Audit_Data_Connection_Library/

    http://../training/sptestsite/Medication_Audit_Report -- Here only reporting file will be uploaded right?

    http://../training/sptestsite/Medication_Audit_Data_Connection_Library/ -- Here only database connection .odc file will be uploaded?

    what other settings are required. please correct me

    my email address - smartboy_harsh@yahoo.co.in

  • RELEVANCY SCORE 2.60

    DB:2.60:Error While Accessing Easconsole kf


    Hi All,

    I am trying to access another mc's easconsole using http://mc name:portno/easconsole/console.html.But it is showing error

    An error occurred while launching/running the application.

    Title: Oracle Essbase Administration Services
    Vendor: Oracle Corporation
    Category: Unexpected Error

    The system cannot find the file specified.

    Can anybody say how to resolve this issue?

    Thanks in advance,

    DB:2.60:Error While Accessing Easconsole kf

    Hi John,
    Thanks for a reply.
    I installed jdk-1_5_0-windows-i586.exe.Then set the Classpath to C:\Program Files\Java\jdk1.5.0\bin.And it works fine.

    Regards,

  • RELEVANCY SCORE 2.59

    DB:2.59:An Error Occurred While Executing An Application [Edited] 3f



    Hey I have SONY VAIO VPCEB46FG laptop. Each time I try to custom recovery on my C Drive via both DVD and sysytem partion it gives me an error message

    "An error occurred while executing an application"

    Error 7

    Please help me. Here is a screenshot attached.

    [IMG]http://i60.tinypic.com/2akjy9c.jpg[/IMG]

    DB:2.59:An Error Occurred While Executing An Application [Edited] 3f

    tanmoy705

    Clean installation means you'll be removing the current OS then put the new one.

    For further assistance regarding this, please contact the Sony offices/Sony representative offices nearest to your place of residence in Asia Pacific region http://www.sony-asia.com/countryselector.html?hpid=countryselector:AsiaPacific. Due to proximity, they are in a better position to respond to your questions or concerns.

    Thanks,

    Yuri

    If my post answers your question, please mark it as "Accept as Solution"

  • RELEVANCY SCORE 2.59

    DB:2.59:Error While Accessing Any Web Page In Ie7 z3


    Hello,I am getting an error An unhandled exception (Object doesn't support this property or method)  occurred in iexplore.exe [6056]. while accessing any web page in IE7. I do not know what this error is for.
     
    Can anyone help me to get it resolved ?
     
    Regards,
     
    MehulG

    DB:2.59:Error While Accessing Any Web Page In Ie7 z3

    Hello,I am getting an error An unhandled exception (Object doesn't support this property or method)  occurred in iexplore.exe [6056]. while accessing any web page in IE7. I do not know what this error is for.
     
    Can anyone help me to get it resolved ?
     
    Regards,
     
    MehulG

  • RELEVANCY SCORE 2.58

    DB:2.58:How To Fix Acs20001 Error While Accessing Ms Dynamics Crm 2013 Online 8j


    Hi All,
    I have signed up for MS Dynamics CRM 2013 Online. When I am trying to access CRM application I am getting following error message in IE browser.
    An error occurred while processing your request.

    HTTP Error Code:
    400

    Message:
    ACS20001: An error occurred while processing a WS-Federation sign-in response.

    Trace ID:
    8635eea8-20ce-4239-b9c2-6a05889d8a52

    Timestamp:
    2014-04-05 04:50:19Z

    DB:2.58:How To Fix Acs20001 Error While Accessing Ms Dynamics Crm 2013 Online 8j

    Hi All,
    I am not sure about the solution but the issue got resolved with Chrome.
    Thanks...!!
    Thanks,
    Satish

  • RELEVANCY SCORE 2.58

    DB:2.58:An Error Occurred While Accessing A Web Service. For More Information, Contact The Site Administrator. aj


    Hi frnds,
    When I try to submit my InfoPath form's data from one sharepoint server to another Sharepoint server then I m getting this errr:

    An error occurred while accessing a Web Service. For more information, contact the site administrator.

    So please suggest me that why I am getting this error.
    Thanks
    Avanish

    Regards Avanish T

    DB:2.58:An Error Occurred While Accessing A Web Service. For More Information, Contact The Site Administrator. aj

    What was the specific error in the ULS logs?Planet Technologies ||
    SharePoint Task Force

  • RELEVANCY SCORE 2.58

    DB:2.58:Secure Store Refresh Problem In Ie When Using A Report Viewers Ad Group af


    Hi
    Something I cannot figure out has come up - I have been sitting down trying to get my head around this secure store. I have had this scenario before and am clearly missing something here.
    I have done a standard deployment, and get this error when trying to refresh the reports in Excel via IE;
    An error occurred while accessing application is ProjectServerApplication from Secure Store Service. The following connections failed to refresh:
    OLAP Portfolio Analyzer
    Now, I have done the following;

    Added the secure store target application for the ID 'ProjectServerApplication' which the reports SSS ID's match up too
    I have put the farm admin account as the Target Application Administrator, and the Members as the 'Project Report Viewers' AD Group (which has db_datareader access to the reporting database)
    Set the Target Application 'Credentials' using the Farm Admin account details

    Based on this state, I get the above error message I have quoted (the reportrefreshes fine in the Excel Program itself). However, if I do the following;

    Change the ProjectServerApplication Target Application Members from 'Project Report Viewers' to 'Domain Users'
    OR individually add the user names rather than go via the AD Group with the db_datareader access

    The report refreshes ok? It seems like the group is the problem.Unfortunately it refreshes for any one when adding domain users(so its like domain users get db_datareader access somehow?)
    I cannot figure out why I get this Access Denied message (thats what the event log says) when I have set the db_datareader permission for the AD Group in question?
    Looking at the steps, I think I have done it all correctly! Maybe there is something I am missing with my AD Group.
    Thanks
    RobRob Hardy

    DB:2.58:Secure Store Refresh Problem In Ie When Using A Report Viewers Ad Group af

    Hi
    In the end I recreated the groups and secure store itself.
    still had the same problem but we used domain users instead of a viewers AD Group, it works fine for what we need.
    ThanksRob Hardy

  • RELEVANCY SCORE 2.58

    DB:2.58:Use Of Non-Migratable Database Link Not Allowed In Osb xp


    Hi All,

    I have a procedure in which tables are invoked using Database links.

    Now I have created a business service which uses this procedure. However I am getting below error

    The invocation resulted in an error: Invoke JCA outbound service failed with application error, exception: com.bea.wli.sb.transports.jca.JCATransportException: oracle.tip.adapter.sa.api.JCABindingException: oracle.tip.adapter.sa.impl.fw.ext.org.collaxa.thirdparty.apache.wsif.WSIFException: servicebus:/WSDL/E2xInterface_V1/WSDL/GetEWOStatus [ GetEWOStatus_ptt::GetEWOStatus(InputParameters,OutputParameters) ] - WSIF JCA Execute of operation 'GetEWOStatus' failed due to: Stored procedure invocation error.
    Error while trying to prepare and execute the SP_GETEWOSTATUS API.
    An error occurred while preparing and executing the SP_GETEWOSTATUS API. Cause: java.sql.SQLException: ORA-00604: error occurred at recursive SQL level 1
    ORA-24777: use of non-migratable database link not allowed

    can we use dblink in procedure while accessing through business service. Please let me know.

    Thanks
    Chandana

    DB:2.58:Use Of Non-Migratable Database Link Not Allowed In Osb xp

    hello gurus . i have same problem on my stored procedure what is a non xa datasource. how can i create on my weblogic server

  • RELEVANCY SCORE 2.57

    DB:2.57:Sql2062n An Error Occurred While Accessing Media "Vendor". Reason Code: "18" dj



    Hello Experts,

    while taking backup of SAP system on IBM tivoli we get the below error

    SQL2062N an error occurred while accessing media "VENDOR". reason code: "18"

    not so expert in this

    please help us out.

    rathore

    DB:2.57:Sql2062n An Error Occurred While Accessing Media "Vendor". Reason Code: "18" dj


    Hi Rathore,

    can you paste an extract of the db2diag.log when the error happens here ?

    regards,Javier

  • RELEVANCY SCORE 2.56

    DB:2.56:Creative Cloud Error fs


    When I download creative cloud application for desktop , it completely downloads and then it says an error has occurred while downloading

    DB:2.56:Creative Cloud Error fs

    You have to provide system information and other details.Mylenium

  • RELEVANCY SCORE 2.56

    DB:2.56:Project Server 2010 Bi-Excel Report k3


    In project server I created excel reports using templates created by olap cubes. It is working fine.But using sample reports i am creating excel report , it is throwing the following error.
    An error ocurred while accessing application id ProjectServerApplication from Secure Store Service. The following connections failed to refresh

    DB:2.56:Project Server 2010 Bi-Excel Report k3

    You are welcome. Please close this threadHrishi Deshpande – Senior Consultant DeltaBahn

    Blog | |
    LinkedIn

    Please click Mark As Answer; if a post solves your problem or Vote As Helpful if a post has been useful to you.This can be beneficial to other community members reading the thread.

  • RELEVANCY SCORE 2.56

    DB:2.56:Project Server 2010 Reporting Issues cc


    Hello,
    I am having a heck of time trying to get Reporting Services working in my Project Server 2010. I am following the instructions listed here (http://technet.microsoft.com/en-us/library/ee662106.aspx) and am encountering 2 issues.
    The first issue is that I am unable to add the ProjectReportViewer group to the Members box in the Secure Store Service settings configuration. I can add the group to SQL through the Management Studio but I can't do even find them in SharePoint.
    I know the group exists on the domain but SharePoint seems to not be able to see it. Ultimately to move to the next step I am forced to add the Farm Administrator to both the Target Application Administrator and Members sections.
    The second issue, and I think it is related to the first issue, occurs when trying to open both Sample Reports and report Templates. The Sample Reports give me the following error:
    An error occurred while accessing application id ProjectServerApplication from Secure Store Service. The following connections failed to refresh:

    Project Server - Simple Projects List
    After this error, a blank report opens in the browser window. I also receive the following error when trying to open a report Template:
    [DBNETLIB][ConnectionOpen (Connect()).]SQL Server does not exist or access denied.
    Clicking OK opens the SQL server login window (within Excel 2010). Simply clicking OK again (with the correct SQL server machine name and the Trusted Connections option checked) gives me this error message:
    Connection failed:
    SQLState: '08001'
    SQL Server Error: 17
    [DBNETLIB][ConnectionOpen (Connect()).]SQL Server does not exist or access denied.
    Deselecting the Trusted Connection option and trying to login using the Farm Administrator account gives me the same error message.
    Both SQL Server 2008 R2 and SharePoint 2010 are installed on the same machine (which is running Server 2008 R2). I have successfully been able to build and access the OLAP cubes. I am just very confused and not sure where to go to fix this.
    This forum has been a phenomenal resource and I have no doubt you guys will once again point me in the right direction.
    I know this is a lot of information but thanks in advance for you help!
    -Bryan

    DB:2.56:Project Server 2010 Reporting Issues cc

    Hi Bryan, I've faced more issues with the BI centre than anything else! My gut feeling is that sharepoint MUST be able to see the reporting group within the secure store service, make sure you input it as doman\reportinggroupname. I faced
    an issue today regarding Excel Services not being associated with the correct web application which I hadn't seen before! The only way to troubleshoot this is to track the ULS logs. Turn up the monitoring on Excel Services and Secure Store, and
    then open the log into Excel, filter for Secure Store and Excel Services within the Excel sheet and you'll see some more useful messages.
    Another useful tip is to create another PS instance on the same machine, and see if the reporting works there. If so, it might be worth recreating the BI centre (Brian Smith has a blog on this). Let us know how you get on.
    For your 2nd error, opening up in Excel directly does not use the Secure store service, so make sure that the user you are logged on with has the rights to access the Reporting DB directly to read from it.

    Ben Howard [MVP] blog |
    web

  • RELEVANCY SCORE 2.55

    DB:2.55:An Error (0x80040245) Occurred zj


    We have eroom 7.33 and after restarting services. website is not working and getting error while open eroom snapin- "an error (0x80040245) occurred accessing database server".we also get IIS admin,NNTP, SMTP services stopped errors. does any one have clue????ThanksUD

    DB:2.55:An Error (0x80040245) Occurred zj

    I think two possibilities regarding this issue:1.- The client of sql server not installing or lacks in the system2.-The connection of database is not enable by permissions

  • RELEVANCY SCORE 2.55

    DB:2.55:Error Occurred After Logging In (An Internal Application Error Occurred. Please Check Log Files.) 18



    Hi everyone,

    This morning, I still can access our NSM. When I tried accessing this afternoon, this error occurred after I input my login credentials. However, I can access NSM gui when I am inside the windows server. Please help

    An internal application error occurred. Please check log files.

    DB:2.55:Error Occurred After Logging In (An Internal Application Error Occurred. Please Check Log Files.) 18


    Hi everyone,

    This morning, I still can access our NSM. When I tried accessing this afternoon, this error occurred after I input my login credentials. However, I can access NSM gui when I am inside the windows server. Please help

    An internal application error occurred. Please check log files.

  • RELEVANCY SCORE 2.54

    DB:2.54:An Error In Dashboard Project Server 2010 ma


    Hi,
    I created my first Dashboard in Excel 2010 but when I was asked to refresh its data in PWA, I got the error:
    An error occurred during the attempt to access the application ID ProjectServerApplication from the Secure Store. Failure of the refreshing
    of the following connections: Project Server Project Assignment data.
    What could be the cause of that error?
    Thanks

  • RELEVANCY SCORE 2.54

    DB:2.54:Error Occurred While Accessing The Safe Array !!! 1p


    Hi All,

    I have faced an issue today while accessing my grids in the workspace. An error message is displayed saying: "Metadata is no longer valid for this grid.Settings will revert to system default" followed my "Error occurred while accessing the safe array" message. I have no idea about this message. Do you think its because of the server down issue. (OR) Do I need to load my metadata to resolve this". Please help me on this. If incase its a server down issues let me know what servers need to be restarted.

    Thank you.

    DB:2.54:Error Occurred While Accessing The Safe Array !!! 1p

    Hi All,

    I have faced an issue today while accessing my grids in the workspace. An error message is displayed saying: "Metadata is no longer valid for this grid.Settings will revert to system default" followed my "Error occurred while accessing the safe array" message. I have no idea about this message. Do you think its because of the server down issue. (OR) Do I need to load my metadata to resolve this". Please help me on this. If incase its a server down issues let me know what servers need to be restarted.

    Thank you.

  • RELEVANCY SCORE 2.53

    DB:2.53:Urgent: An Exception Has Occurred While Accessing Dcm Repository c8


    Hello,

    I was trying to undeploy an application, and I received the following error:
    ADMN-202001
    An exception has occurred while accessing DCM repository. Please refer to the accompanying base exception for more details.
    Base Exception:
    java.lang.ClassCastException:null
    check the details of the base exception.
    java.lang.ClassCastException
    at oracle.ias.sysmgmt.persistence.PersistenceInstance.getIASAttributes(Unknown Source)
    at oracle.ias.sysmgmt.persistence.PersistenceInstance.getIASProperty(Unknown Source)
    at oracle.ias.sysmgmt.persistence.PersistenceInstance.getIASProperty(Unknown Source)
    at oracle.ias.sysmgmt.persistence.PersistenceInstance.getOnsHostName(Unknown Source)
    at oracle.ias.sysmgmt.persistence.PersistenceFarm.getOnsPorts(Unknown Source)
    at oracle.ias.sysmgmt.persistence.PersistenceManager.updateOnsConfig(Unknown Source)
    at oracle.ias.sysmgmt.persistence.PersistenceManager.updateOnsConfig(Unknown Source)
    at oracle.ias.sysmgmt.task.TaskMaster.initRepository(Unknown Source)
    at oracle.ias.sysmgmt.task.TaskMaster.init(Unknown Source)
    at oracle.ias.sysmgmt.task.InstanceManager.sysInit(Unknown Source)
    at oracle.ias.sysmgmt.task.InstanceManager.init(Unknown Source)
    at oracle.ias.sysmgmt.cmdline.DcmCmdLine.execute(Unknown Source)
    at oracle.ias.sysmgmt.cmdline.DcmCmdLine.main(Unknown Source)

    And now dcmctl is not even starting anymore.

    Thanks

    DB:2.53:Urgent: An Exception Has Occurred While Accessing Dcm Repository c8

    I had to:
    1. destroyinstance
    2. launch emctl
    3. clean conf files and remove ears from applications and application-deployments.

    It is working now, but BC4JManager and IsWebCacheWorking applications are no more listed once I try to listapplications (dcmctl).
    It is not a big deal, the folders still exist, bug I have no ears or wars for them to deploy. does deploy by folder supported in dcmctl ?

    Thanks

  • RELEVANCY SCORE 2.53

    DB:2.53:Configure Synchronization Connections An Error Has Occurred While Accessing The Sql Server Database d7


    Hi,
    i am getting following error message
    Central Administration -- Synchronization Connections
    An error has occurred while accessing the SQL Server database or the SharePoint Server Search service.

    If this is the first time you have seen this message, try again later. If this problem persists, contact your administrator.
    Central Administration -- Manage Profile Service: User Profile Service Application -- Manage User Properties
    Error
    An unexpected error has occurred.
    Troubleshoot issues with Microsoft SharePoint Foundation.
    Correlation ID: 3bce5a11-f2dc-4788
    Please tell how to fix it.

    iffi

    DB:2.53:Configure Synchronization Connections An Error Has Occurred While Accessing The Sql Server Database d7

    For me it was simply a case of starting the Forefront Identity Manager Service (Windows service). It had stopped for some reason.

    BrianBrian Lalancette | MCTS, MOSS 2007 / SharePoint 2010 | Twitter: @brianlala | Blog: http://spinsiders.com/brianlala

  • RELEVANCY SCORE 2.53

    DB:2.53:Msps 2010 - Bi And Sample Reporting Issue fc



    Hi All,
    I tried to search the forum already and it seems that it's a pain for some other people as well - thus re-posting same question as no definite answer was given..

    I have already re-configure the SSS and Excel services as per
    http://technet.microsoft.com/en-us/library/ee662106.aspx
    multiple times, checked that all the settings are correct, groups, locations etc. but I am still receiving error: An error occurred while accessing application id ProjectServerApplication from Secure Store Service. The following connections failed to refresh..
    whenever I try to view sample reports from BI.
    How I can set change the logs to debug for Excel and SSS as ULS does not report any issue at the moment? Did you ever managed to fix the problem and is the fix documented somewhere?
    Kind regards,
    Tomasz

    DB:2.53:Msps 2010 - Bi And Sample Reporting Issue fc

    Looks like, the ULS logs also point to SSS not being configured correctly.

    How about using a different account and see if it works? Atleast that will isolate the issue?
    If not, are you in a position to be able to delete the Secure Store and recreate it?
    Prasanna Adavi, PMP, MCTS http://thinkepm.blogspot.com

  • RELEVANCY SCORE 2.53

    DB:2.53:Error While Accessing The Application Server File jf



    Hi,

    I am getting an error in my SAP HANA system while loading flat file.

    Error detials "Error while accessing the application server file".

    Data load is till PSA. Chekced the directory AL11 and not able to locate the files.

    Any pointers will help

    Thanks in advance

    Suruchi

    DB:2.53:Error While Accessing The Application Server File jf


    Hi Suruchi,

    1. Is there created directory in Application server?

    2. Which format file your using? .CSV?

    3. Normally it should be available in Application Server AL11

    4. If not available in AL11? Go to info pack - external data tab - browse for the file - select AL11 file - select ur file - click on copy name

    5. Check you authorization.

    Regards,

    V Srinivasan

  • RELEVANCY SCORE 2.53

    DB:2.53:Server Error Only On Ajax Client While Accessing The Application Using Ipad k1



    Dear All,

    I am getting the error, using QVAJAX while accessing application from iPAD, I am getting error "Server error only on AJAX client".

    Thanks Regards,

    Santhosh Kumar G

    DB:2.53:Server Error Only On Ajax Client While Accessing The Application Using Ipad k1


    Dear All,

    I am getting the error, using QVAJAX while accessing application from iPAD, I am getting error "Server error only on AJAX client".

    Thanks Regards,

    Santhosh Kumar G

  • RELEVANCY SCORE 2.53

    DB:2.53:Outofmemory?? Urgent, Please xf


    Hello.

    while i was running my application, occurred a strange error...
    Exception occurred during event dispatching:
    java.lang.OutOfMemoryError
    no stack trace available

    does anybody knows this error?? how can i solve it??

    thanx

    DB:2.53:Outofmemory?? Urgent, Please xf

    If possible make that the scope of the variable be only the method, when the methos has exited they'll be Garbaged collected, so the memory is free.
    Abraham.

  • RELEVANCY SCORE 2.52

    DB:2.52:Cant Access Excel Reports In Bi Centre m9


    Hi, I have set up Excel Services and Secure store as required but am getting a An error occurred while accessing application id ProjectServerApplication from

    Secure Store Service. The following connections failed to refresh: warning message. Any ideas where I have fallen down on my configuration?

    thanks in advance.
    Steve

    DB:2.52:Cant Access Excel Reports In Bi Centre m9

    thanks Amit, very useful flowchart, its been a while since I had to set this up and I am now sorted thank you.

  • RELEVANCY SCORE 2.52

    DB:2.52:Eroom Database Error df


    I am getting the following error messages in the Microsoft Event ViewerEvent ID 159The following error occured x times in the last x minutes. An error (0x8004027c) occurred accessing database server SQL01Note sure if this is related but this error is occuring also.Event ID 158An error occurred while indexing facility xxxx. The error code is 8004027cHas anyone experienced these error messages, if yes, what do they mean? and can the errors be fixed?ThanksSCJ

    DB:2.52:Eroom Database Error df

    HiI can tell you about Event ID 159This is generated, when a user is logging into eRoom, using a wrong username or password. The two values are checked against the sql database containing the users, and a error message is generated. Unfortunately the error that gets logged in the eventwiever does not explicitly say that.Try logging in to eRoom using wrong credentials and check the eventlog afterwards. You'll see this message pop-up.As for ID 158 i don't know what the cause is. Maybe you'll find out in the KB.RegardsDominik

  • RELEVANCY SCORE 2.52

    DB:2.52:About Dump Error: Sql Error 376 Occurred When Accessing Table "Ikpf" fp



    Can anybody tell me about the below error.

    bSQL error 376 occurred when accessing table "IKPF"/b

    DB:2.52:About Dump Error: Sql Error 376 Occurred When Accessing Table "Ikpf" fp


    Seems like your database might be corrupted. Better report this to the DBAs.

    Rob

  • RELEVANCY SCORE 2.52

    DB:2.52:Error In Executing Reports 9x



    Hello Experts

    I am getting following erros in exectuing the BW reports.

    ORA-00600: internal error code, arguments: [kcbz_check_objd_typ_3], [0], [0], [1], [], [], [], []

    SQL Error: 600

    Error while reading data; navigation is possible

    As a result of which no data is being displayed in the report.

    Also there is a short dump which says:

    Runtime Errors DBIF_RSQL_SQL_ERROR
    Exception CX_SY_OPEN_SQL_DB
    Date and Time 07.10.2008 07:59:19
    Short text
    SQL error in the database when accessing a table.
    What happened?
    An exceptional situation has occurred in the ORACLE software,
    possibly due to an error.
    This is not an error in an application program.

    DB:2.52:Error In Executing Reports 9x


    for this problem basis people restored the BW enviornment to few days back when eveything was working fine then applied a oracle patch in BW .

  • RELEVANCY SCORE 2.52

    DB:2.52:An Error Occurred While Accessing Application Id Projectserverapplication From Secure Store Service c8


    Assalam Evrybody,
    When opening one of the Sample Reports from the BI Center an error occurs:

    An error occurred while accessing application id ProjectServerApplication from Secure Store Service. The following connections failed to refresh:

    Steps I've taken on my Blog : http://soussi-imed.over-blog.com/article-96740108.html

    I've followed all the steps from http://technet.microsoft.com/en-us/library/ee662106.aspx, repeated and reviewed all my settings more than a handful of times. I've also done a handful of successful installs/configs following the documentation here, http://technet.microsoft.com/en-us/library/cc197479.aspx,
    which includes the above.

    I'm missing something, I just don't know what. Any help will be greatly appreciated.

    Thanks!
    -------------------------------------
    Lors de l'ouverture l'un des
    exemples de rapports du Centre de BI
    une erreur se produit:

    Une erreur s'est produite lors de l'accs
    ProjectServerApplication ID d'application du
    service Banque d'informations scuris.
    Les connexions suivantes chou rafrachir:

    tapes j'ai pris sur mon Blog : http://soussi-imed.over-blog.com/article-96740108.html
    J'ai suivi toutes les tapes du
    http://technet.microsoft.com/en-us/library/ee662106.aspx, rpt et
    examin tous les paramtres de mon
    plus qu'une poigne de fois. J'ai aussi fait
    une poigne de succs installe
    / configs suivant la documentation ici,
    http://technet.microsoft.com/en-us/library/cc197479.aspx, qui comprend le
    plus haut.

    Il me manque quelque chose, je ne sais pas quoi.
    Toute aide sera grandement apprcie.

    Merci!

  • RELEVANCY SCORE 2.51

    DB:2.51:An Error Occured While Accessing The Windows Cardspace... sk


    So, I'm getting this error message whenever I clicked on Windows CardSpace in Control Panel. "An error occured while accessing the Windows CardSpace. Please view the Event Log for more details." I checked the event log and I read a bunch of messages that
    basically meant the same thing. "An error occurred when communicating with the Windows CardSpace service." "An unknown exception has caused the request to fail. For more information, please see the event log. Inner Exception: Attempted to perform an unauthorized
    operation." "An error occurrred while accessing the card collection. Either the store directory or the store file ACLs were found to be tampered. The ACLs have now been restored to their default settings." "An error occurrred while accessing the card collection.
    Failed to open store."
    WHAT DOES THIS MEAN???

    DB:2.51:An Error Occured While Accessing The Windows Cardspace... sk

    Hi,
    Thank you for sharing the information with us.
    We are glad that the issue is fixed.

  • RELEVANCY SCORE 2.51

    DB:2.51:Unable To Access Cms 7z



    Hi,

    while accessing CMS am getting below error

    Application error occurred during request processing.

    Details: com.sap.tc.webdynpro.services.sal.core.DispatcherException: The requested deployable object 'sap.com/tcSLCMS~WebUI' and application 'CMS' are not deployed on the server. Please check the used URL for typos.

    HELP

    Regards,

    C

    DB:2.51:Unable To Access Cms 7z


    Hi C,

    Please check the NWDI landscape componet deployed and configured on your Serevr or not.

    If deploed and configured, then try access CMS through netweaver administration http://host:port/devinf

    Also check the component 'sap.com/tcSLCMSWebUI' is green or not in Content Adminsitrator Web Dynpro Search tcSLCMSWebUI' under 'sap.com' in the portal.

    Hope it helps,

    Regards

    Arun

  • RELEVANCY SCORE 2.51

    DB:2.51:Dump On F1 Help 7m


    while pressing f1 on any abap kay word i m getting dump like SQL error 0 occurred when accessing program "CX_SY_OPEN_SQL_DB=============CPplss help me out frm this how to fix

    DB:2.51:Dump On F1 Help 7m

    What's the connection to this post? Dump on F1 help

  • RELEVANCY SCORE 2.51

    DB:2.51:Error Occurred While Accessing The Service ad



    can anyone help me

  • RELEVANCY SCORE 2.51

    DB:2.51:Sorry, An Error Occurred a1


    This error occurred while the application being updated
    automatically, we have used the same signature files, but still
    getting this error.

    "An error occurred while updating the application. Try
    updating it again. If the problem persists, contact the application
    author.

    Error # 0"

    Thanks,
    Srikanth.

    DB:2.51:Sorry, An Error Occurred a1

    This is a Windows Installer error.

    This page has a very detail info. on what could cause the
    error:

    http://kb.acresso.com/selfservice/microsites/search.do?cmd=displayKCdocType=kcexternalId =Q107182sliceId=

    -ted

  • RELEVANCY SCORE 2.51

    DB:2.51:Unhandled Win32 Exception While Accessing Iexplorer 7.0 a9


     
    Dear Friends,
     
    I received an below error while accessing a particular site i.e. www.irctc.co.in
     
    Unhandled win32 exception occurred in iexplorer.exe [5004]
     
    can anyone provide me the error solution.
     
    Regards,
     
    Lavesh Verma

    DB:2.51:Unhandled Win32 Exception While Accessing Iexplorer 7.0 a9

    Hi,
     
    The error message means the IE encounters fatal error while working with the page you request. Did you get this message via Just-In-Time Debugging?
     
    What version of IE are you using? You can try to upgrade it to latest version.
     
     
    I hope this helps.

  • RELEVANCY SCORE 2.50

    DB:2.50:[Rep_12014] An Error Occurred While Accessing The Repository aj



    [REP_12014] An error occurred while accessing the repository An error occurred while accessing the repository

    ORA-00932: Inconsistent datatypes

    Hi I am getting above error while running workflow. Session failed and in session i am getting above error.

    please find attached err.doc file for more information.

    I am able to connect to database and able to create relational database. Update the settings of SOURCE an TARGET in Workflow properties properly.

    If anyone knows the cause of this error please give me the solution.

    Regards

    Vinod

    DB:2.50:[Rep_12014] An Error Occurred While Accessing The Repository aj


    [REP_12014] An error occurred while accessing the repository An error occurred while accessing the repository

    ORA-00932: Inconsistent datatypes

    Hi I am getting above error while running workflow. Session failed and in session i am getting above error.

    please find attached err.doc file for more information.

    I am able to connect to database and able to create relational database. Update the settings of SOURCE an TARGET in Workflow properties properly.

    If anyone knows the cause of this error please give me the solution.

    Regards

    Vinod

  • RELEVANCY SCORE 2.50

    DB:2.50:Isolatedstorageexception On Application Exit aa


    Hi,
    My silverlight application's first page checks IsolatedStorageSettings to check if user login details are saved. if they are not then application navigates to login screen.
    On successful login I am saving a setting userLoggedIn to App.Current.Resources dictionary.
    When user returns to first page by using Back key of phone, I check the userLoggedIn value and if its set I dont navigate to login screen and when user presses the Back key the application exits.

    On exit my application is throwing the following exception:

    System.IO.IsolatedStorage.IsolatedStorageException occurred
    Message=An error occurred while accessing IsolatedStorage.
    StackTrace:
    at System.IO.IsolatedStorage.IsolatedStorageSecurityState.EnsureState()
    at System.IO.IsolatedStorage.IsolatedStorageFile.get_AvailableFreeSpace()
    at System.IO.IsolatedStorage.IsolatedStorageSettings.Save()
    at System.IO.IsolatedStorage.IsolatedStorageSettings.TrySave()
    at System.IO.IsolatedStorage.IsolatedStorageSettings.SaveAllSettings()
    at MS.Internal.FrameworkCallbacks.ShutdownAllPeers()

    Can anyone please point out what could be the reason for this exception?
    My application does download some image files but they small sized. (less than 1MB in total)

    Thanks for all the feedback.
    shoaib.

    DB:2.50:Isolatedstorageexception On Application Exit aa

    I'm experiencing the same behaviour. However I believe that's not an issue as this is a first chance exception which means (correct me if I'm wrong) that the exception is being catched inside ShutdownAllPeers().

  • RELEVANCY SCORE 2.49

    DB:2.49:Hfm Application Error zz


    Hi,
    i had made an application in HFm and was accessing it through workspace but it is now throwing this error after loading metadata and data.
    i AM NOT ABLE TO ACCESS MY DATAGRIDS.

    The following error is thrown.

    Error occurred while accessing the safe array.BRError occurred while accessing the safe array.BRError occurred while accessing the safe array.
    Error Reference Number: {A2912F11-7FDF-4104-BE18-93CC450549C5};User Name: admin@Native DirectoryBRNum: 0x80040211;Type: 1;DTime: 10/12/2010 10:04:53 AM;Svr: INBGMW-HYP-HFM;File: CHsvDSMemberLists.cpp;Line: 2224;Ver: 11.1.1.3.0.2413;BRNum: 0x80040211;Type: 0;DTime: 10/12/2010 10:04:53 AM;Svr: INBGMW-HYP-HFM;File: CommonMetadata.cpp;Line: 2844;Ver: 11.1.1.3.0.2413;BRNum: 0x80040211;Type: 1;DTime: 10/12/2010 10:04:53 AM;Svr: INBGMW-HYP-HFM;File: CHFMwDataGrid_Helpers.cpp;Line: 8431;Ver: 11.1.1.3.0.2413;BRNum: 0x80040211;Type: 1;DTime: 10/12/2010 10:04:53 AM;Svr: INBGMW-HYP-HFM;File: CHFMwDataGrid.cpp;Line: 9708;Ver: 11.1.1.3.0.2413;

    Help Required ASAP.

    Thanx in Advance

    DB:2.49:Hfm Application Error zz

    This is largely just a guess, but I assume that when you loaded your metadata you loaded on replace and that some member was removed from the application. This member was likely being used in either the rows or the columns for the current grid.

    Try creating a new data grid. If you have another application, you may be able to build one in there that you know will work with your metadata and then extract and load it to your new application.

  • RELEVANCY SCORE 2.49

    DB:2.49:Culture Not Supported Exception Occurred While Accessing The Webi Report From Asp.Net 3d


    Hi Professionals.

    i am facing with following error while accessing the webi report which is developed in the sap bo objects and my task is to integrate the sap webi report in asp.net web application. rest of the login procedure is working fine with the type if windows active directiory.

    "The type initializer for 'BusinessObjects.CELIB.Conversion.LocaleConversion' threw an exception."
    "Culture name 'en-cb' is not supported.\r\nParameter name: name"

    Is it issue with the .net framework update or something else ,please any guru help me.

    any help would be appriciated

    Thank in advance

    Nikhil waghmare.

    DB:2.49:Culture Not Supported Exception Occurred While Accessing The Webi Report From Asp.Net 3d


    What version of .NET framework are you using? I ran into this issue about a year ago when I upgrade my application to .NET 4.0.

    In a security patch to .NET 2.0, Microsoft removed a few cultures (en-cb being one of them). My guess is that the SAP component you're using is trying to access those obsolete cultures. My workaround was to implement this workaround from MS to recreate those cultures: http://support.microsoft.com/kb/939949

  • RELEVANCY SCORE 2.49

    DB:2.49:Error Accessing Da 3m


    Hi, I am getting an error while accessing the DA.It says "An error has occurred while invoking the UCF runtime" ...."Failed to connect to server"Can anyone help ?Regards,Neel.

    DB:2.49:Error Accessing Da 3m

    Verify that your JVM/JRE for your browser is the supported version that is specified in DA release notes. Also, for future references, you should post DA questions to "Administrator" forum.

  • RELEVANCY SCORE 2.49

    DB:2.49:Error While Accessing App Diagnostics j8


    Hi,
    We have App diagnostics console installed in our environment and when a user opens the link, he gets the following error at times.
    'An error has occurred.Additional information can be found in..'
    In the event viewer under windows log, we get this:

    Event code: 3005
    Event message: An unhandled exception has occurred.
    and under Operations manager log:

    An internal error occurred in the application performance monitoring (APM) Application Diagnostics console.

    Exception: User name: user who got this error

    Any help greatly appreciated..

    Thanks..

    DB:2.49:Error While Accessing App Diagnostics j8

    What exact URL's are you trying to open? The error says that you are trying to open the page that out of bound. In other words if you had 3 pages of events and kept the reference to third oneand than some of the events were groomed and you only have
    2 you may get this exception when trying to open the link.
    So it may be as easy as that.
    I also can imagine situation when you've applied some filtering on events that decrease number of pages from 3 to 1. And than trying to open link to the third page again and because of the filtering that was applied console throws this exception. However
    I wasn't able to repro this situation so more details on repro scenarios will be helpful.

  • RELEVANCY SCORE 2.49

    DB:2.49:Un Expected Error Occurred In .Net Compact Framework While Accessing Crmservice mz


     
    We are trying to access the CRMservice by adding the webreference in Windows Mobile 6 professional Emulator ie. using the .net Compact Framework.
     
    When I tried to access the CRM web service from the .net compact framework from a mobile application, the Crmservice throws an error in Sevice.Execute(), that   An Unexpected Error Occurred (SOAPEXCEPTION). When the code is run in ordinary Windows application using the .net framework, it is working fine.
     
    Can any one help me on this , and if there is any compatibility issues and let me know if any configuration has to be made.
     
    code is below :
      CrmAuthenticationToken token = new CrmAuthenticationToken();
                    token.AuthenticationType = 0;
                    token.OrganizationName = Orgcrm;
     
                    CrmService service = new CrmService();
                    service.CrmAuthenticationTokenValue = token;
                    service.Url = http://MachineName:5555/mscrmservices/2007/CrmService.asmx;
                    service.Credentials = System.Net.CredentialCache.DefaultCredentials;
                  
         WhoAmIRequest req = new WhoAmIRequest();
                    WhoAmIResponse res = (WhoAmIResponse)service.Execute(req);
     
    ERROR :
    An Unexpected error occurred - System.web.Services.protocols.SoapException

    DB:2.49:Un Expected Error Occurred In .Net Compact Framework While Accessing Crmservice mz

     
    We are trying to access the CRMservice by adding the webreference in Windows Mobile 6 professional Emulator ie. using the .net Compact Framework.
     
    When I tried to access the CRM web service from the .net compact framework from a mobile application, the Crmservice throws an error in Sevice.Execute(), that   An Unexpected Error Occurred (SOAPEXCEPTION). When the code is run in ordinary Windows application using the .net framework, it is working fine.
     
    Can any one help me on this , and if there is any compatibility issues and let me know if any configuration has to be made.
     
    code is below :
      CrmAuthenticationToken token = new CrmAuthenticationToken();
                    token.AuthenticationType = 0;
                    token.OrganizationName = Orgcrm;
     
                    CrmService service = new CrmService();
                    service.CrmAuthenticationTokenValue = token;
                    service.Url = http://MachineName:5555/mscrmservices/2007/CrmService.asmx;
                    service.Credentials = System.Net.CredentialCache.DefaultCredentials;
                  
         WhoAmIRequest req = new WhoAmIRequest();
                    WhoAmIResponse res = (WhoAmIResponse)service.Execute(req);
     
    ERROR :
    An Unexpected error occurred - System.web.Services.protocols.SoapException

  • RELEVANCY SCORE 2.49

    DB:2.49:Social Miner Problem c9



    Hi,

     

    I am receiving below error while accessing SocialMiner. Please suggest, if someone faced this issue and resolved.

     

    "A timeout occurred loading the application. Refresh your browser or try again later. If the problem persists, you may need to check your network connectivity."

     

    Regards,

    Mukesh Singh

    DB:2.49:Social Miner Problem c9


    Hi Srikanth,

     

    I am using the same version 10.x but still facing this issue.

    Application Software Version: 10.0(1)-49 Operating System Active Software Version: 10.0.1.10000-9 Operating System Inactive Software Version

     

    Regards,

    Mukesh Singh

  • RELEVANCY SCORE 2.48

    DB:2.48:Thread: Error (0) Occurred While Accessing The Ndps Manager Database 8m


    Does anyone know what this error means when unloading the NDPS Manager in a

    clustered environment

    Error (0) occurred while accessing the NDPS Manager database

    I have a 2 node NW6Sp4 cluster. This doesn\'t seem to affect NDPS printing

    but I\'d like to get rid of the error and can\'t find any TID\'s for error (0).

    Thank you

    Jim

    DB:2.48:Thread: Error (0) Occurred While Accessing The Ndps Manager Database 8m

    Jim,

    It appears that in the past few days you have not received a response to your posting. That concerns us, and has triggered this automated reply.

    Has your problem been resolved? If not, you might try one of the following options:

    - Do a search of our knowledgebase at http://support.novell.com/search/kb_index.jsp

    - Check all of the other support tools and options available at http://support.novell.com in both the free product support and paid product support drop down boxes.

    - You could also try posting your message again. Make sure it is posted in the correct newsgroup. (http://support.novell.com/forums)

    If this is a reply to a duplicate posting, please ignore and accept our apologies and rest assured we will issue a stern reprimand to our posting bot.

    Good luck!

    Your Novell Product Support Forums Team

    http://support.novell.com/forums/

  • RELEVANCY SCORE 2.48

    DB:2.48:Problem Launching Application With Webstart pm


    Hi,

    I am trying to launch an app from a local webserver. I set up the server to recognize the mime type, installed the client, etc. (followed the instructions on the web to the dot). However, I still ran into an error when lauching my application... Here's the error.

    An error occurred while launching/running the application

    Title: Test Application
    Vendor: Me
    Vategory: Download Error

    Bad MIME type returned from server when accessing resource: http://localhost/test/test.jnlp - text/html

    Any help you can provide is greatly appreciated! Thanks in advance!

    Juivette

    DB:2.48:Problem Launching Application With Webstart pm

    I had this same problem using IIS on w2k. My solution: installed tomcat. I never did find where iis had mapped this to text, even though I mapped it correctly in the webapp.

  • RELEVANCY SCORE 2.48

    DB:2.48:An Error Occurred While Generating Report: Object Reference Not Set To An Instance Of An Object ( Gpmc Settings Tab ) z3


    While accessing one GPO I am getting below mentioned error.
    An error occurred while generating report:
    Object reference not set to an instance of an object
    I am getting this error for all DCs ( 2003 /2008/ R2/ 2012 and R2 )

    DB:2.48:An Error Occurred While Generating Report: Object Reference Not Set To An Instance Of An Object ( Gpmc Settings Tab ) z3

    Hi Tech Olive,
    Is the GPOconfiguredsome settings aboutIE security? This may be caused there is something wrong with importing IE security settings. And the solution is shown as below:
    Edit install.ins inside: {GUID of Policy}\user\MICROSOFT\IEAK
    [Security Imports]
    ImportSecZones=1
    Set it back to “0″
    For your information, please refer to the following similar cases to get more help:
    Object reference not set to an instance of an object.
    http://social.technet.microsoft.com/Forums/en-US/5194bb45-723b-447c-8a36-8155da2f8972/object-reference-not-set-to-an-instance-of-an-object?forum=winserverGP
    Object reference not set to an instance of an object

    http://social.technet.microsoft.com/Forums/windowsserver/en-US/32c43f79-79f5-4744-afd3-3894f47c09a8/object-reference-not-set-to-an-instance-of-an-object?forum=winserverGP
    Regards,
    Lany Zhang

  • RELEVANCY SCORE 2.48

    DB:2.48:Bad Mime Type? dj


    I downloaded WebStart, and installed it. No problems.

    Tried running the demos from the demo page. Nothing works. Always get the error below. Can anyone help?

    Thanks,
    -JC

    -------------------------------------------------------------------------

    An error occurred while launching/running the application.

    Title: SwingSet2
    Vendor: Sun Microsystems, Inc.
    Category: Download Error

    Bad MIME type returned from server when accessing resource: http://java.sun.com/products/javawebstart/apps/SwingSet2.jnlp - text/html

    DB:2.48:Bad Mime Type? dj

    Problem solved. Finally found bug report indicating proxy server was the cause of this problem. Interesting twist, though. Locally installed program called AdSubtract which filters banner ads, etc. from web pages is implemented as a proxy server. When this was turned off, demos ran fine.

  • RELEVANCY SCORE 2.48

    DB:2.48:Error While Accessing Wsdl c3



    Hi Experts,

    I am accessing Webservice in my application. While executing the application i am getting this exception....

    javax.xml.rpc.soap.SOAPFaultException: System Error

    Can any one help me in getting out of this error...

    Regards,

    Arun.

    DB:2.48:Error While Accessing Wsdl c3


    Hi

    see the below link ,it will be helpful for u.

    [Re: web service - error|Re: web service - error]

    Regards

    Hazrath

    Edited by: Hazrath on Apr 1, 2008 12:13 PM

  • RELEVANCY SCORE 2.47

    DB:2.47:Ps2010 - Error Accessing Sample Reports cj


    Hello,
    I'm getting the following erro when trying to open any of the sample reports within the BI centre An error occurred while accessing application id ProjectServerApplication from Secure Store Service. - The following connections failed to refresh: Project
    Server - Rejected Projects List
    I can open the report directly in Excel without any issues.
    Anyone got any ideas?
    Regards, Ben.Ben Howard [MVP] http://appleparkltd.spaces.live.com/

    DB:2.47:Ps2010 - Error Accessing Sample Reports cj

    Okay, reboot resolvd it - don't ask my why, I've no idea!Ben Howard [MVP] http://appleparkltd.spaces.live.com/

  • RELEVANCY SCORE 2.47

    DB:2.47:Process Control - Error Occurred While Accessing The Safe Array 11


    Has anyone every seen this error before?

    The user is in Process Control and tries to consolidate. He gets the error message "Error Occurred While Accessing the Safe Array". It works fine for other users. Version is 11.1.1.3.

    DB:2.47:Process Control - Error Occurred While Accessing The Safe Array 11

    "Array" in this context usually has nothing to do with an array in rules. Instead it is a general error message that means something is beyond the bounds of what HFM expected. It could be a bug, or could be something the user is performing that makes a call beyond the bounds of the rule or what their security allows. Look at the System Messages and provide the details of the error here. Errors ususally happen in 3 or 4 subsequent, cascading messages, so be sure to include all the details of all 3 or 4. That will help determine the cause.

    --Chris

  • RELEVANCY SCORE 2.47

    DB:2.47:A Serious Error Occurred When Accessing This Virtual Machine Input/Output Error 9s



    Please help URGENT

    DB:2.47:A Serious Error Occurred When Accessing This Virtual Machine Input/Output Error 9s


    I ran the disk utility it finds NO errors on the drive only issue comes when trying to do something to that file I can View package contents but I can't start the VM - PLease I am begging anyone for some guidance

  • RELEVANCY SCORE 2.47

    DB:2.47:Error While Running Java Web Start In Jdk 1.5 c1


    I have been running an application using Jboss3.2 in JDK1.4.2_09. The Java Web Start application ran perfectly then.
    Now, I am running Jboss3.2 with JDK 1.5.0_11. While some applications (HTML client and some Java Web Start applications are working correctly) are working correctly, this particular Java Web Start application fails.

    General Tab:

    An error occurred while launching/running the application.

    Title: Server_Security
    Vendor: df
    Category: Download Error

    Bad MIME type returned from server when accessing resource: http://localhost:8080/webapp/SampDB1/Server_Security/application/javassist.jar - null

    Exception Tab:

    JNLPException[category: Download Error : Exception: null : LaunchDesc: null ]
    at com.sun.javaws.cache.DownloadProtocol.doDownload(DownloadProtocol.java:617)
    at com.sun.javaws.cache.DownloadProtocol.getDownloadSize(DownloadProtocol.java:884)
    at com.sun.javaws.LaunchDownload.downloadJarFiles(LaunchDownload.java:698)
    at com.sun.javaws.LaunchDownload.downloadEagerorAll(LaunchDownload.java:662)
    at com.sun.javaws.Launcher.downloadResources(Launcher.java:1032)
    at com.sun.javaws.Launcher.handleApplicationDesc(Launcher.java:375)
    at com.sun.javaws.Launcher.handleLaunchFile(Launcher.java:218)
    at com.sun.javaws.Launcher.run(Launcher.java:165)
    at java.lang.Thread.run(Thread.java:595)

    DB:2.47:Error While Running Java Web Start In Jdk 1.5 c1

    I have been running an application using Jboss3.2 in JDK1.4.2_09. The Java Web Start application ran perfectly then.
    Now, I am running Jboss3.2 with JDK 1.5.0_11. While some applications (HTML client and some Java Web Start applications are working correctly) are working correctly, this particular Java Web Start application fails.

    General Tab:

    An error occurred while launching/running the application.

    Title: Server_Security
    Vendor: df
    Category: Download Error

    Bad MIME type returned from server when accessing resource: http://localhost:8080/webapp/SampDB1/Server_Security/application/javassist.jar - null

    Exception Tab:

    JNLPException[category: Download Error : Exception: null : LaunchDesc: null ]
    at com.sun.javaws.cache.DownloadProtocol.doDownload(DownloadProtocol.java:617)
    at com.sun.javaws.cache.DownloadProtocol.getDownloadSize(DownloadProtocol.java:884)
    at com.sun.javaws.LaunchDownload.downloadJarFiles(LaunchDownload.java:698)
    at com.sun.javaws.LaunchDownload.downloadEagerorAll(LaunchDownload.java:662)
    at com.sun.javaws.Launcher.downloadResources(Launcher.java:1032)
    at com.sun.javaws.Launcher.handleApplicationDesc(Launcher.java:375)
    at com.sun.javaws.Launcher.handleLaunchFile(Launcher.java:218)
    at com.sun.javaws.Launcher.run(Launcher.java:165)
    at java.lang.Thread.run(Thread.java:595)

  • RELEVANCY SCORE 2.47

    DB:2.47:Error Occurred While Accessing Application Id Excel Services Application Unattended Service Account From Secure Store Service z9


    Hi,
    I follow up the book Professional SharePoint 2013 Administration to build the SharePoint 2013 BI include Excel Services. and created the Secure Store services to save the user SP_Install for member.
    For Now, I can upload the worksheet and open it in browser, but when I tried to refresh it, the SP 2013 show error Error occurred while accessing application id Excel services application unattended service account from secure store service.
    does anybody can help ? and do I need to turn on C2WTS ?

    Thanks

    James Liang

    DB:2.47:Error Occurred While Accessing Application Id Excel Services Application Unattended Service Account From Secure Store Service z9

    Hi James,
    Excel Services can be used with Secure Store in three primary scenarios:

    Unattended Service AccountEmbedded ConnectionsExternal Data Connections

    If you haven't configure unattended service account yet, you could refer to the article below:
    http://technet.microsoft.com/en-us/library/hh525344(v=office.15).aspx
    More information:
    http://technet.microsoft.com/en-us/library/ff191191(v=office.15).aspx
    Regards,
    Rebecca Tu
    TechNet Community Support

  • RELEVANCY SCORE 2.47

    DB:2.47:Error When Accessing Server Configuration Properties p7


    Has anyone had this issue pop up when trying to access properties of your server configuration: (PID 7424, Thread 28) Task Get-AntispamUpdates writing error when processing record of index 0. Error: System.InvalidOperationException: An error occurred while accessing the registry on the server RIVERMAIL-1. The error that occurred is: The network path was not found. . ? I have not been able to find a solution.

    DB:2.47:Error When Accessing Server Configuration Properties p7

    Ok fixed it! :-) Thanks to this post...
    http://social.technet.microsoft.com/Forums/en/exchangesvradmin/thread/c30a0872-b7f9-4d89-8f6c-0a1571059ce7
    The first time I installed RU3 it didnt install correctly and disabled alot of my services. It went in fine the second time I installed it, and I thought I had re-enabled all of my services but turns out I missed one, the Remote Registry service. Re-enabling
    and starting this one fixes the issue. :-)

  • RELEVANCY SCORE 2.47

    DB:2.47:Re: Error Occurred While Launching/Running The Application. ka


    I'm receiving the same error regardless of JRE version. Any solutions?

    DB:2.47:Re: Error Occurred While Launching/Running The Application. ka

    It could be a permission issue. I had the same problem and fingured out the /tmp folder doesn't have required permissions.
    I set the permissions to 777 and recylced the servers to resolve the issue.

    Hope this helps!

    Cheers,
    Suresh

  • RELEVANCY SCORE 2.46

    DB:2.46:Re: Install Of Jdk1.5.0 Didn't Install Plug-In Or Jws j8


    Here are the messages I'm getting using Netscape 7.2:

    =========================

    An error occurred while launching/running the application.

    Title: Draw 4 App
    Vendor: Sun Microsystems, Inc.
    Category: Download Error

    Bad MIME type returned from server when accessing resource: http://java.sun.com/products/javawebstart/apps/draw.jnlp - null

    =========================

    JNLPException[category: Download Error : Exception: null : LaunchDesc: null ]

    at com.sun.javaws.cache.DownloadProtocol.doDownload(Unknown Source)

    at com.sun.javaws.cache.DownloadProtocol.isLaunchFileUpdateAvailable(Unknown Source)

    at com.sun.javaws.LaunchDownload.getUpdatedLaunchDesc(Unknown Source)

    at com.sun.javaws.Launcher.downloadResources(Unknown Source)

    at com.sun.javaws.Launcher.handleApplicationDesc(Unknown Source)

    at com.sun.javaws.Launcher.handleLaunchFile(Unknown Source)

    at com.sun.javaws.Launcher.run(Unknown Source)

    at java.lang.Thread.run(Unknown Source)

    DB:2.46:Re: Install Of Jdk1.5.0 Didn't Install Plug-In Or Jws j8

    I was running local copies of the test apps. When I made the following registry change the test apps all started working:

    HKEY_LOCAL_MACHINE\SOFTWARE\JavaSoft\Java Runtime Environment\1.4
    JavaHome FROM C:\Languages\Java\j2sdk1.4.2_05 TO C:\Languages\Java\j2sdk1.4.2_05\jre

  • RELEVANCY SCORE 2.46

    DB:2.46:Abap Error While Generating Copa Datasource 8m



    Dear team,

    while generating copa datasource in ECC system, received below error.

    SQL error "SQL code: 403" occurred while accessing table "DD02L".

    Category Installation ErrorsRuntime Errors DBSQL_SQL_ERRORExcept. CX_SY_OPEN_SQL_DB

    Short Text SQL error "SQL code: 403" occurred while accessing table "DD02L".

    What happened? Database error text: "SQL message: internal error: Exception CompileServerNotFoundException: No details while compiling trigger

    I am working on solution provided by Jagadish Sanker from the below scn link.

    COPA Datasource

    Could someone please help on this.

    Regards,

    Khader

    DB:2.46:Abap Error While Generating Copa Datasource 8m


    Dear team,

    while generating copa datasource in ECC system, received below error.

    SQL error "SQL code: 403" occurred while accessing table "DD02L".

    Category Installation ErrorsRuntime Errors DBSQL_SQL_ERRORExcept. CX_SY_OPEN_SQL_DB

    Short Text SQL error "SQL code: 403" occurred while accessing table "DD02L".

    What happened? Database error text: "SQL message: internal error: Exception CompileServerNotFoundException: No details while compiling trigger

    I am working on solution provided by Jagadish Sanker from the below scn link.

    COPA Datasource

    Could someone please help on this.

    Regards,

    Khader

  • RELEVANCY SCORE 2.46

    DB:2.46:Receving Error While Accessing Validate Version Functionality kc


    Hi
    Despite of having access to 'Version management' I am receiving following error while accessing 'Validate Version' functionality in version management for Master data Services.
    An error occurred while processing message request type 'ValidationGetRequest'. See exception details for more information.
    Can anybody guide me in case any settings or access rights are missing which may cause this error.
    Thanks.
    Anagha P

    DB:2.46:Receving Error While Accessing Validate Version Functionality kc

    Hi Anagha,
    Cool ! the issue is resolved .As business rule is limited to one model so if mdm is working by granting access to all model worked seems weird to me !

  • RELEVANCY SCORE 2.46

    DB:2.46:Unable To Connect To Ucm From Jdeveloper 98


    Hello,

    I'm using Jdeveloper Studio Edition Version 11.1.1.5.0
    I created Content Repository conection, following:

    RIDC Socket Type: socket
    Server hostname: localhost
    Content Server Listener Port: 4444

    Executing "Teste Connection" result "Success!"

    But, trying connect, I receive:
    oracle.webcenter.content.internal.model.rc.AbstractRepositoryLogic listFolder
    An error occurred while accessing the content repository.

    and when I try to run Portal application from JDeveloper it says "An unexpected error has occurred in JDeveloper........ "
    and application do not run.
    I am trying to resolve this Issue from one week but still there. Basically I want to make Oracle WebCenter Application and want to use content from UCM.
    I have Installed the following things
    1) Oracle Database 11g release 2 Enterprise Edition
    2) Oracle JDeveloper 11.1.1.5.0 Including Web logic server.
    3) Then I installed RCU 11.1.1.6
    4) Then I installed UCM 11.1.1.6
    But why am I getting this error? Please help me.

    Thank you,
    Muhammad Nasir

    DB:2.46:Unable To Connect To Ucm From Jdeveloper 98

    Thanks Srinath
    I will post on JDeveloper Forum.

    Muhammad Nasir

  • RELEVANCY SCORE 2.46

    DB:2.46:Error While Loading Member List j8


    Hi,

    I'm using Financial Management 9.3.1.

    When opening a Member List file (*.lst) I'm getting the following error:

    Unexpected error: 80042380 occurred.

    However, the file seems to open and, when clicking on "Explore Data", I get the following error message:

    Error occurred while accessing the safe array.

    Any help will be appreciated.

    DB:2.46:Error While Loading Member List j8

    Hi,
    I have the same problem. But while I load a empty *.lst file it's work. So I'm sure that my service is ok.
    Do you have any other suggestions? thanks.

  • RELEVANCY SCORE 2.46

    DB:2.46:Bsp Error Accessing From Portal 93



    When we try to access access a BSP Iview from Portal we are getting an error

    bPortal Runtime Error

    An exception occurred while processing your request

    Exception id: 03:30_19/10/07_0011_5733250

    See the details for the exception ID in the log file./b

    In the server.log file we see the following error

    bContent pass of Application Integrator failed.

    Component Name: com.sap.portal.appintegrator.sap.BSP,

    Context Name (iView): pcd:portal_content/com.sap.pct/specialist/com.sap.pct.erp.sls/Roles/com.sap.pct.erp.sls.sales_assistant_erp_only/com.sap.pct.erp.sls.sa_sales_overview/com.sap.pct.erp.sls.sa_soverview/com.sap.pct.erp.sls.so_todo,

    Top Layer: BSP/TopLayer,

    Producer ID (FPN): null,

    System Alias: SAP_R3_SalesService,/b

    can anyone help

    DB:2.46:Bsp Error Accessing From Portal 93


    try running this service from sicf is there any issue you are facing from R/3 ?

  • RELEVANCY SCORE 2.46

    DB:2.46:Bad Mime Type On The Sun Demo Site 8f


    Hi,

    I am evaluating java web start for a project. I am running IE5.5 on win2K workstation. When I click on the demos I get the following error.
    ------------------------------------------------------
    An error occurred while launching/running the application.

    Title: Draw 4
    Vendor: Sun Microsystems, Inc.
    Category: Download Error

    Bad MIME type returned from server when accessing resource: http://java.sun.com/products/javawebstart/apps/draw.jnlp - null
    -------------------------------------------------------

    I was able to get this working on win98. Is there an issue
    of JAVA Web Start on win2k.

    Any help is appreciated.

    Thanks,
    Chamal.

    DB:2.46:Bad Mime Type On The Sun Demo Site 8f


    I was able to run the samples with a connection to the internet that did not go throghy a proxy server. Is there a bug when going through a proxy?

    Try with a non proxied connection.

    Thanks,
    Chamal.

  • RELEVANCY SCORE 2.46

    DB:2.46:Ai Control Gives Error: 10452 Occurred At Ai Control. Possible Reasons: Ni-Daq Lv No Interrupt Level Is Available For Use. fd


    How can I run out of interrupts while accessing my DAQPad? Doesthe community have troubleshooting suggestions?

    DB:2.46:Ai Control Gives Error: 10452 Occurred At Ai Control. Possible Reasons: Ni-Daq Lv No Interrupt Level Is Available For Use. fd

    You don't say which DAQpad. If this is a device on your parallel port thenyou will need to make sure that the parallel port has an interrupt assignedand not just a base address.Check out the following from the NI Knowledgebase:http://digital.ni.com/public.nsf/3efedde4322fef198​62567740067f3cc/bf7960eb90ef882a8625654e007d8b1a?OpenDocumentIan"Riverside Consulting, LLC" wrote in messagenews:506500000008000000643E0000-1012609683000@exch​ange.ni.com... AI Control gives error: 10452 occurred at AI control. Possible reasons: NI-DAQ LV no interrupt level is available for use. How can I run out of interrupts while accessing my DAQPad? Does the community have troubleshooting suggestions?

  • RELEVANCY SCORE 2.45

    DB:2.45:Unknown Error Occurred While Accessing This Contact m3


    Original Title: copy vista contact list of friends after recovering damaged hard drive form recovery program (easy recovery)
    copy vista contact list of friends ( every .contact file ) after recovering damaged hard drive form recovery program (easy recovery). then reinstalled the same version of windows vista . paste all contacts back in but it will have the list of names ,but
    no numbers . try to access it will not let me . message: unknown error occurred while accessing this contact :
    is there a solution , please help

    DB:2.45:Unknown Error Occurred While Accessing This Contact m3

    Did you find a resolution to this? I'm having the same issue.

    thanks,

  • RELEVANCY SCORE 2.45

    DB:2.45:Javawebstart 1.0.1/Weblogic 6.0 --Download Error sd


    Hi,
    I'm using Weblogic 6.0 sp3 to deploy a test application on my system with JavaWebStart 1.0.1(JWS1.0.1).
    After I have clicked the link pointing to the jnlp file the JWS1.0.1 is getting started but its showing the following error

    ***********************************
    An error occurred while launching/running the application.

    Title: Sample
    Vendor: ABC Systems
    Category: Download Error

    Bad MIME type returned from server when accessing resource: http://host:7001/example.jar - application/x-java-archive

    ************************************

    I even tried the examples in jnlpexamples.zip provided by BEA(http://developer.bea.com/code/sampleswls.jsp)

    I'm getting the same error.

    Can anybody tell how to overcome this problem

    Thanks in Advance

    DB:2.45:Javawebstart 1.0.1/Weblogic 6.0 --Download Error sd

    Hi All,

    I have cleared the error, I have given href attribute linking to jar file instead of jnlp..

    Thanks

  • RELEVANCY SCORE 2.45

    DB:2.45:Sql Error Msg 845 Time-Out Occurred While Waiting For Buffer Latch Type 3 For Page (6:401831), Database Id 8. dm


    I amgetting below error while accessing the database.we are not able perform any backup ,shrinkfile, detach operation on database.also same error occured while accessing database front end.
    Msg 845, Level 17, State 1, Line 1
    Time-out occurred while waiting for buffer latch type 3 for page (6:401831), database ID 8.

  • RELEVANCY SCORE 2.45

    DB:2.45:Bi Content Installation Error "Occurred While Accessing Table '/Bi0/Xxxx' " 73


    Hi Experts,When I am trying to install in BI Content , like ODS,Cube,InfoObjects , I get error as follows:SQL error "SQL code: -602" occurred while accessing table "/BI0/XXXXXXX".Some objects get installed and some remain inactive.Can someone suggest we what is wrong and the solution for it.Regards.Vivek

  • RELEVANCY SCORE 2.45

    DB:2.45:Sap Treasury Tpm1 Error ms



    Hi,

    I got following error message while i run TPM1

    category: Installation Errors

    Short Text: SQL Error: 106 occurred while accessing table "TRDT_TRDBUSTRANS""

    Please guide me

    with regards

    raju

    DB:2.45:Sap Treasury Tpm1 Error ms


    Hello, Krishna.

    Ask your Basis to check this problem.

    This might help (also ask your Basis to check it): SQL error in the database when accessing a table.

  • RELEVANCY SCORE 2.45

    DB:2.45:Cgi Error While Accessing Webmail xm





    Am getting the following error while trying to access webmailCGI Error:
    The specified CGI application misbehaved by not returning a complete set of HTTP headers
    Does anyone know how to fix this?

    DB:2.45:Cgi Error While Accessing Webmail xm




    Same error... Same problem... Anyone solve this problem?

    It occurs when I update the plesk 7.6 to 8.1.1

  • RELEVANCY SCORE 2.45

    DB:2.45:A Severe Error (Exception /Sca/Cx_Svrewo Occurred (Program: /Scmb/) Has Occurred 18



    Hi All,

    In ECC - PI - SNC integration

    While creating the Sub - Contracting Purchase order with work order from the message PORDCR1, the message is failing in SNC with application Error:

    A severe error (Exception /SCA/CX_SVREWO occurred (program: /SCMB/) has occurred.

    Regards,

    Aditi

    DB:2.45:A Severe Error (Exception /Sca/Cx_Svrewo Occurred (Program: /Scmb/) Has Occurred 18


    Hi All,

    In ECC - PI - SNC integration

    While creating the Sub - Contracting Purchase order with work order from the message PORDCR1, the message is failing in SNC with application Error:

    A severe error (Exception /SCA/CX_SVREWO occurred (program: /SCMB/) has occurred.

    Regards,

    Aditi

  • RELEVANCY SCORE 2.44

    DB:2.44:Jnlp Demo Fails With Bad Mime Type dp


    The Mime info for the jnlp extension is defined in my Netscape preferences:
    Mime Type : application/x-java-jnlp-file
    Extension: jnlp
    Application: "C:\Program Files\Java Web Start\javaws.exe"

    but I keep getting the following error:

    An error occurred while launching/running the application.

    Title: SwingSet2
    Vendor: Sun Microsystems, Inc.
    Category: Download Error

    Bad MIME type returned from server when accessing resource: http://java.sun.com/products/javawebstart/apps/SwingSet2.jnlp - unknown/unknown

    What do I need to do?

    DB:2.44:Jnlp Demo Fails With Bad Mime Type dp

    My problem was that since I am within a firewall, I had to socksify my machine.
    Also, the javaws config was specifying a socks server as an http proxy server.
    Setting proxies to none ( in the preferences ) and socksifying my machine fixed the problem.

  • RELEVANCY SCORE 2.44

    DB:2.44:Http Error Message 1m



    Hi All,

    We are trying to acess a url from web report through RRI. The RRI report is working fine while accessing from bex report. But the same while accessing from Web report it displays the following error message. Please adivice.

    The following error text was processed in the system : Error occurred while sending data through the HTTP protocol.

    The error occurred on the application server bwdbi_ and in the work process 0 .

    The termination type was: RABAX_STATE

    Please let me know if you have any idea on this

    Regs

    Sudha

  • RELEVANCY SCORE 2.44

    DB:2.44:Exchange2003 Jtab_Base zp


    Hi,

    On Application Events Log of my Exchange server i have This Error ( Event
    ID:1160 Source: MSExchangeIS)

    Database resource failure error 0xfffffae1 occurred in function
    JTAB_BASE::EcConfig while accessing the database First Storage Group\Mailbox
    Store for NAME OF MAIL BOX STORE (ServerName).

    Some one can help me to interprat or to debug this error?!!!!

    Thx

    Merci

    DB:2.44:Exchange2003 Jtab_Base zp

    In the tech Event and Error message center web site got this information
    http://www.microsoft.com/technet/support/ee/transform.aspx?ProdName=ExchangeProdVer=6.5.6940.0EvtID=1160EvtSrc=MSExchangeISLCID=1033

  • RELEVANCY SCORE 2.44

    DB:2.44:Unable To Launch Application From My Machine:Bad Mime Type 3c


    Hi,
    The following error message was printed when I tried to access the SwingSet2 demo from the Java Web Start site.
    An error occurred while launching/running the application.

    Title: SwingSet2
    Vendor: Sun Microsystems, Inc.
    Category: Download Error

    Bad MIME type returned from server when accessing resource: http://java.sun.com/products/javawebstart/apps/SwingSet2.jnlp - text/html

    Can you please suggest what is to be done to rectufy this problem?
    Regards,
    Satish

    DB:2.44:Unable To Launch Application From My Machine:Bad Mime Type 3c

    Bad MIME type returned from server when accessing
    resource:
    http://java.sun.com/products/javawebstart/apps/SwingSet
    .jnlp - text/htmlit should return application/x-java-jnlp-file.

    My guess is that you use proxy which messes up headers.

    Otherwise try to reinstall Web Start, then enable the console and log output in Web Start's advanced preferences to get more clues what's going on.

    Regards,
    Marc

  • RELEVANCY SCORE 2.44

    DB:2.44:I Can't Install Lion xj


    "An error occurred while preparing the installation. try running this application again"

    DB:2.44:I Can't Install Lion xj

    A better solution could be thishttp://macosx.com/forums/mac-os-x-system-mac-software/317916-osx-installation-fa ils-mysteriously.html

  • RELEVANCY SCORE 2.44

    DB:2.44:Security Stored Service Issue For Projectserverapplication p9


    Hi there,
    I followed the guides from MSDN to set my Security Stored Service, have create a Target Application for ProjectServerApplication, but it still complaints about can't find the Target Application with the build-in excel examples..
    The account I'm using for the SSS has the db_datereader permission of the reportin_db.
    Here some info from ULS logs:
    SQL command failed: Sproc name: dbo.proc_sss_GetCredentials, Application Id: ProjectServerApplication, Error code: 80630490, Error message: Target application not found (application id: ProjectServerApplication).
    The Microsoft Secure Store Service application KL_EPM_SecureStore_Application failed to retrieve credentials. The error returned was 'Target application not found (application id: ProjectServerApplication).

    Any advice?

    Thank you,Joe

    DB:2.44:Security Stored Service Issue For Projectserverapplication p9

    This sound stupid, but here is how I solved it..
    Delete the original ProjectServerApplication,
    Restart the Security Stored Service,
    Recreated the ProjectServerApplication...

    And everything work now...

    Make me feel like a fool to debugging from ULS logs.. :)

    Joe

  • RELEVANCY SCORE 2.44

    DB:2.44:An Internal Error Has Occurred- Error #1034 m1



    Every time I am getting this error while accessing the webclient.

    I have restarted teh webclient services but still happens,

    Has anyone faced this issue?

    Thanks

    DB:2.44:An Internal Error Has Occurred- Error #1034 m1


    I Have seen this issue to occur if the C: or the primary drive of the server is running very low on free space. Try increasing the drive space.

    Thanks,Avinash

  • RELEVANCY SCORE 2.44

    DB:2.44:Project Server 2010 Simple Projects Error az


    I have configured the Excel Services and the Secure Store service.
    I have actually created 2 global groups, RepAuthors and RepViewers.
    RepAuthors has a login in SQL server and db_datareader permission. RepAuthors is also a member of RepViewers in AD. I have another account SecStore which I used configuring the Secure Store and I used RepViewers as the members.
    Yesterday when I logged on with farmadmin account or my personal account (administrators in project server) I got the following error while accessing Simple project list.
    An error occured while accessing application id ProjectServerApplication from Secure Store Service. The following connections failed to refresh: Project Server - Simple Projects List
    Today when I tried again with my personal name, I didn't get that error message and I could see the project list without problem. Then I added a regular user who is project manager to RepViewers group. I logged with his login account and still I had that
    same error message. I am getting the same also when I login with farmadmin account.
    What am I missing here?
    Thanks,
    Haim Beyhan

    DB:2.44:Project Server 2010 Simple Projects Error az

    Even I do not prefer to add users directly.
    Its a bit confusion here and to solve this I am sharing below procedure. You can think of deleting your secure store application and using below steps to do the configuration. This procedure uses ReportViewers group which can be used to add users to whom
    you want to give reporting access.
    To create a Secure Store Service service application
    1.On the SharePoint Central Administration Web site, in the Application Management section, click Manage service applications.
    2. On the Service Applications tab, click New, and then click Secure Store Service.
    3. In the Name box, type Secure Store Service Application.
    4. In the Application pool name box, type SecureStoreAppPool.
    5. Choose a managed account from the Configurable list.
    6. Click OK.

    When the service application has been successfully created, click OK.

    When the Secure Store Service Application has been created, you must generate a Secure Store Service key before the Secure Store service can be used. Perform the following procedure to generate a key.
    To generate a Secure Store Service key
    1. On the SharePoint Central Administration Web site, in the Application Management section, click Manage service applications.
    2. Click the Secure Store service application.
    3. On the Edit tab, click Generate New Key.
    4. Type and confirm a Pass Phrase, and then click OK.
    5. Once Secure Store is configured, you must create a Secure Store target application.

    To create a Secure Store target application
    1. On the SharePoint Central Administration Home page, in the Application Management section, click Manage Services Applications.
    2. Click the Secure Store Service.
    3. On the Secure Store Service page, select the Edit tab.
    4. Click New.
    5. On the Create New Secure Store Target Application page:
    6. In the Target Application ID box, type ProjectServerApplication.
    7. In the Display Name box, type ProjectServerApplication.
    8. In the Contact Email box, type an e-mail address.
    9. From the Target Application Type drop-down list, select Group.
    10. Click Next.
    11. On the Specify the credential fields for your Secure Store Target Application page, click Next.
    12. On the Specify the membership settings page: In the Target Application Administrators box, type Farm Admin. In the Members box, type Report Viewers. (you should add users to whom you want to give reporting access to this group)
    13. Click OK.
    14. On the Secure Store Service Application page, select the check box for the target application that you just created.
    15. On the ribbon, click Set Credentials.
    16. On the Set Credentials for Secure Store Target Application (Group) dialog box, type the user name and password of the Farm Admin account. In your case you can use any account which had permissions over Reporting Database.
    17. Click OK.

    Once you complete above steps, go to Excel Service Application Global Settings and settingProjectServerApplication as Unattended Service Account in the External Data Section.

    Abhijeet M. Mohite
    Please Mark As Answer if my post solves your problem or Vote As Helpful if a post has been helpful for you.

  • RELEVANCY SCORE 2.44

    DB:2.44:Error In Accessing Application On Windows 2003 Server 9z


    error on accessing the application on windows 2003 server R12

    500 Internal Server Error
    Servlet error: An exception occurred. The current application deployment descriptors do not allow for including it in this response. Please consult the application log for details.

    First time i login sucessfully but now its not working.