• RELEVANCY SCORE 3.74

    DB:3.74:Successfully Applied Rup6 (6728000) On Ebs R12 Linux Rhel4.6 p9





    Hi All,

    I have successuflly applied RUP6 on our EBS R12.

    The pre-reqs patch I applied is:
    7305220
    The post-reqs patches I applied are:
    7109200
    7653364
    8222387
    ===================
    The above patches went on smoothly and successfully.
    Then here comes again the part I hated most ....to run autoconfig
    on the apps and dbtiers.

    You know I always encounter 90% error in autoconfig in all my installation even if they are successful. I can not understand why I always failed in autoconfig runs :(

    autoconfig error
    ==========
    [AutoConfig Error Report]
    The following report lists errors AutoConfig encountered during each
    phase of its execution. Errors are grouped by directory and phase.
    The report format is:
    filename phase return code where appropriate

    [INSTANTIATE PHASE]
    AutoConfig could not successfully instantiate the following files:
    Directory: /u02/appldev/DEV/inst/apps/DEV_orafin/ora/10.1.2/reports
    Tk2Motif_AL32UTF8.rgb INSTE8

    AutoConfig is exiting with status 1Thanks

    DB:3.74:Successfully Applied Rup6 (6728000) On Ebs R12 Linux Rhel4.6 p9

    Check your other thread ...

    Http 404 The page cannot be found on EBS 11i (11.5.10.2) AIX
    Re: Http 404 The page cannot be found on EBS 11i (11.5.10.2) AIX

  • RELEVANCY SCORE 3.72

    DB:3.72:Re: R12 Installation: Autoconfig Is Exiting With Status 30 d1





    Hi,

    If you cannot locate the packages, you can download it from:

    gcc-3.4.6-3.x86_64.rpm
    http://rpm.pbone.net/index.php3/stat/4/idpl/5186725/com/gcc-3.4.6-3.x86_64.rpm.html

    gcc-c++-3.4.6-3.x86_64.rpm
    http://rpm.pbone.net/index.php3/stat/4/idpl/5186726/com/gcc-c++-3.4.6-3.x86_64.rpm.html

    Regards,
    Hussein

    DB:3.72:Re: R12 Installation: Autoconfig Is Exiting With Status 30 d1

    Hi,

    I would suggest you install the same packages version mentioned in the installation document.

    Thanks,
    Hussein

  • RELEVANCY SCORE 3.67

    DB:3.67:Re: Autoconfig.Cmd pc





    hi .. thanks for reply i got this " AutoConfig is exiting with error status 29 " when i run AutoConfig

    this is the log file http://www.mediafire.com/?nzr69r1snp95svx

    i think it has error : ORA-12518

    thank you

    kareem

    DB:3.67:Re: Autoconfig.Cmd pc

    Please upload AutoConfig log file.

    Thanks,
    Hussein

  • RELEVANCY SCORE 3.49

    DB:3.49:Re: Autoconfig Is Exiting With Status 2 m9


    After setting correct vip reduced the Autoconfig status with 1

    [AutoConfig Error Report]
    The following report lists errors AutoConfig encountered during each
    phase of its execution. Errors are grouped by directory and phase.
    The report format is:
    filename phase return code where appropriate

    [SETUP PHASE]
    AutoConfig could not successfully execute the following scripts:
    Directory: /usr/bin/perl -I /usr/perl5/5.8.4/lib/sun4-solaris-64int -I /usr/perl5/5.8.4/lib -I /usr/perl5/
    site_perl/5.8.4/sun4-solaris-64int -I /usr/perl5/site_perl/5.8.4 -I /usr/perl5/site_perl -I /usr/perl5/vendor_
    perl/5.8.4/sun4-solaris-64int -I /usr/perl5/vendor_perl/5.8.4 -I /usr/perl5/vendor_perl -I . -I /u01/mmapps/mm
    appsdb/10.2.0/appsutil/perl -I /u01/mmapps/mmappsdb/10.2.0/appsutil/perl /u01/mmapps/mmappsdb/10.2.0/appsutil/
    scripts/MMAPPS_RAC1_sawadi
    adchknls.pl INSTE8_SETUP 1

    AutoConfig is exiting with status 1

    DB:3.49:Re: Autoconfig Is Exiting With Status 2 m9

    issue solved after Create nls/data/9idata directory

    Thank u very much ....for u r support

    Anil Pinto

  • RELEVANCY SCORE 3.34

    DB:3.34:Re: Autoconfig Error fc


    Hi;

    What is your DB version?

    Did you check below notes:
    adcrobj.sh fails on 9.2.0.8 Database version [ID 415335.1]
    Autoconfig Error On Dbtier After Upgrade - afdbprf.sh and adcrobj.sh fail with ORA-27101: shared memory realm does not exist [ID 422709.1]
    Autoconfig fails on adcrobj.sh with ORA-01031: insufficient privileges [ID 779371.1]
    Autoconfig Fails on adcrobj.sh When Run On Database Tier with O/S Message: Permission denied [ID 401536.1]
    Autoconfig Fail Loading Libraries: Libc.So.6 And Librt.So.1 [ID 730128.1]
    Autoconfig Db Tier Failing After 10g Upgrade [ID 787119.1]

    Regard
    Helios

    DB:3.34:Re: Autoconfig Error fc

    Hi;

    Nice to hear issue solved and thanks for points ;)

    Regard
    Helios

  • RELEVANCY SCORE 3.31

    DB:3.31:Adcrobj.Sh Fails With Connected To An Idle Instance. p1


    Hi Guru's,Am doing an upgrade from 11i to R12.I have a single node installation 32bit running EBS 11.5.10.2 with an 11.2.0.3 database (upgrade from 9.2.0.6 to 9.2.0.8) on RHEL 4.I followed all the steps on the upgrade document, am now running autoconfig on DB Tier and its failing with:--adcrobj.sh started at Mon Jun 24 14:38:02 GMT 2013Parameters passed are : The environment settings are as follows ... ORACLE_HOME : /home/oracle/selfdb/11.2.0 ORACLE_SID : self TWO_TASK : PATH : /usr/bin:/home/oracle/selfdb/11.2.0/bin:/usr/kerberos/bin:/usr/local/bin:/bin:/usr/bin:/usr/X11R6/bin:/home/oracle/bin:. LD_LIBRARY_PATH : /home/oracle/selfdb/11.2.0/lib:/usr/X11R6/lib:/usr/openwin/lib:/home/oracle/selfdb/11.2.0/ctx/libSQLPLUS Executable : /home/oracle/selfdb/11.2.0/bin/sqlplusEnter the APPS username: appsEnter the APPS password: SQL*Plus: Release 11.2.0.3.0 Production on Mon Jun 24 14:38:10 2013Copyright (c) 1982, 2011, Oracle. All rights reserved.Connected to an idle instance.begin*ERROR at line 1:ORA-01034: ORACLE not availableProcess ID: 0Session ID: 0 Serial number: 0ERROR:ORA-01012: not logged onProcess ID: 0Session ID: 0 Serial number: 0Disconnectedadcrobj.sh exiting with status 1The database is up and running thats for sure. sqlplus / as sysdbaSQL*Plus: Release 11.2.0.3.0 Production on Mon Jun 24 14:42:48 2013Copyright (c) 1982, 2011, Oracle. All rights reserved.SQL select status from v$instance;STATUS------------OPENSTEPS I TOOK TO TRY AND RESOLVE THE PROBLEM BUT UNFORTUNATELY NONE OF THEM WORKED:-1)Connected to:Oracle Database 11g Enterprise Edition Release 11.2.0.3.0 - ProductionWith the Partitioning, OLAP, Data Mining and Real Application Testing optionsSELECT * FROM v$timezone_file;FILENAME VERSION -timezlrg_14.dat 142) Applied autoconfig patches3) replaced /nolog with sqlplus "/ as sysdba" @/ORACLE_RDBMS_HOME/appsutil/install/CONTEXT_NAME/adcrobj.sql "$user" 4) The s_global_database_name ,s_systemname, s_dbSid, s_dbSidLower, s_dbGlnam, s_InstName, and s_dbService variables all have the same value.Am attaching the adconfig.log file.Thanks,Rajab

    DB:3.31:Adcrobj.Sh Fails With Connected To An Idle Instance. p1

    Hi Alvaro,Yes the listener is up and running.[oracle@self bin]$ lsnrctl status selfLSNRCTL for Linux: Version 11.2.0.3.0 - Production on 25-JUN-2013 10:26:18Copyright (c) 1991, 2011, Oracle. All rights reserved.Connecting to (ADDRESS=(PROTOCOL=IPC)(KEY=EXTPROCself))STATUS of the LISTENER------------------------Alias selfVersion TNSLSNR for Linux: Version 11.2.0.3.0 - ProductionStart Date 24-JUN-2013 10:45:53Uptime 0 days 17 hr. 40 min. 25 secTrace Level offSecurity ON: Local OS AuthenticationSNMP OFFListener Parameter File /home/oracle/selfdb/11.2.0/network/admin/self_self/listener.oraListener Log File /home/oracle/selfdb/11.2.0/log/diag/tnslsnr/self/self/alert/log.xmlListening Endpoints Summary... (DESCRIPTION=(ADDRESS=(PROTOCOL=ipc)(KEY=EXTPROCself))) (DESCRIPTION=(ADDRESS=(PROTOCOL=tcp)(HOST=self.vesltech.com)(PORT=1521)))Services Summary...Service "PLSExtProc" has 1 instance(s). Instance "PLSExtProc", status UNKNOWN, has 1 handler(s) for this service...Service "self" has 2 instance(s). Instance "self", status UNKNOWN, has 1 handler(s) for this service... Instance "self", status READY, has 1 handler(s) for this service...The command completed successfully.Let me try and edit the file and see if apps/apps will work.

  • RELEVANCY SCORE 3.25

    DB:3.25:Re: R12 Installation On Windows 2003 Error 89


    Run 'adctrl' and pick option 1, what is the status of the workers?

    DB:3.25:Re: R12 Installation On Windows 2003 Error 89

    Check the AutoConfig log file for the error please.

  • RELEVANCY SCORE 3.24

    DB:3.24:11.5.10.1 To R12 Upgrade Path x1


    Thanks in Advance for reviewing my posting.

    We are in the initial investigation of an R12 upgrade.
    From a 30,000 foot perspective, can

    Install R12 on new servers with same Operating System
    Upgrade the database in the existing 11i environment to 10.2.0.4
    Remove the database installed with R12 installation
    Replace database with the upgraded 11i database.
    Run the database upgrade scripts
    Run AutoConfig

    I know there is a lot more to it than that, but is that a good starting point to develop a plan ??

    DB:3.24:11.5.10.1 To R12 Upgrade Path x1

    Hi user;

    In addition to Hussein Sawwan's great post please follow previous thread for take help

    R11 to R12 upgrade

    R12.1 upgrade from 11.5.10CU2 with 11g
    http://forums.oracle.com/forums/ann.jspa?annID=772
    12.0.6 to 12.1.1 (or 12.1.2 or Fusion) upgrade
    Re: R12.0.4 Upgrade from 11i(11.5.10.2 cu2)

    Hope it helps

    Regard
    Helios

  • RELEVANCY SCORE 3.22

    DB:3.22:Re: Adopmnctl.Sh: Exiting With Status 2 da


    Felix,

    Did you try to run AutoConfig and see if it generates any errors?

    Regards,
    Hussein

    Edited by: hsawwan on Mar 16, 2009 5:59 PM

    DB:3.22:Re: Adopmnctl.Sh: Exiting With Status 2 da

    Felix,

    You're welcome!

    You too, have a nice day.

    Regards,
    Hussein

  • RELEVANCY SCORE 3.21

    DB:3.21:Re: Adapcctl.Sh: Exiting With Status 3 Error 3j


    Thanks Hsawwan again for your quick replay; its soo nice to have you here for us which is looking answers,thanks alot your kind answers.
    Here is the status:

    hsawwan wrote:
    What changes have been done recently?

    Please check the log file for more details about the error (get the log file from Apache script).I just made chacarter convertion my application node to UTF8 to P9 from adadmin utulity.

    Did you try to run AutoConfig and see if it helps in resolving the issue?autoconfig gives error,error is:

    Autoconfig exsist status 1;

    Have no idea why i get error on autoconfig, and i still have adapcctl.sh: exiting with status 3 error

    thanks

    DB:3.21:Re: Adapcctl.Sh: Exiting With Status 3 Error 3j

    Thanks for your polite and good,correct answers hsawwan..

    Its soo nice what u ar doing here for us...

    Thanks alot

    Helios

  • RELEVANCY SCORE 3.16

    DB:3.16:Autoconfig Is Exiting With Status 2 9s


    Hi

    We are using oracle11i(11.5.10.2) on windows 2000 server

    autoconfig failed on application server

    please find below error

    ==========================================================================

    [AutoConfig Error Report]
    The following report lists errors AutoConfig encountered during each
    phase of its execution. Errors are grouped by directory and phase.
    The report format is:
    filename phase return code where appropriate

    [SETUP PHASE]
    AutoConfig could not successfully execute the following scripts:
    Directory: e:\oracle\prodora\8.0.6
    orainf.cmd INSTE8_SETUP 1007

    [APPLY PHASE]
    AutoConfig could not successfully execute the following scripts:
    Directory: e:\oracle\prodcomn\admin\install\PROD_dpqeaps01clone
    adsvalsn.cmd INSTE8_APPLY -1

    AutoConfig is exiting with status 2

    Thanks
    With Regards
    A-Z

    DB:3.16:Autoconfig Is Exiting With Status 2 9s

    Hi Hussein,

    i didn't find any log related to both files in autoconfig log.

    i executed autoconfig using remote desktop.

    can i follow below doc Quest 54?

    Autoconfig FAQ [ID 218089.1]

    Thanks
    With Regards
    A-Z

    Edited by: user3308982 on Dec 13, 2010 10:45 AM

  • RELEVANCY SCORE 3.14

    DB:3.14:Error While Running Autoconfig In Dbtier pa


    Hi ,

    While running a autoconfig on DBTier we got the following errror :

    The following report lists errors AutoConfig encountered during each
    phase of its execution. Errors are grouped by directory and phase.
    The report format is:
    filename phase return code where appropriate

    [PROFILE PHASE]
    AutoConfig could not successfully execute the following scripts:
    Directory: /u02/11i/CES/cesdb/9.2.0/appsutil/install/CES_ceserp
    afdbprf.sh INSTE8_PRF 1

    [APPLY PHASE]
    AutoConfig could not successfully execute the following scripts:
    Directory: /u02/11i/CES/cesdb/9.2.0/appsutil/install/CES_ceserp
    adcrobj.sh INSTE8_APPLY 1

    AutoConfig is exiting with status 2

    please advise what to do

    Thanks,
    Vinay

    DB:3.14:Error While Running Autoconfig In Dbtier pa

    Hi,

    Did you run the command "mv $ORACLE_HOME/sqlplus/lib/sqlplus $ORACLE_HOME/bin/sqlplus" after applying the patch?

    Regards,
    Hussein

  • RELEVANCY SCORE 3.12

    DB:3.12:Autoconfig z1


    when running autoconfig i got the below error

    for 11.5.10.2
    [AutoConfig Error Report]
    The following report lists errors AutoConfig encountered during each
    phase of its execution. Errors are grouped by directory and phase.
    The report format is:
    filename phase return code where appropriate

    [PROFILE PHASE]
    AutoConfig could not successfully execute the following scripts:
    Directory: /u03/appldev/devcomn/admin/install/DEV_grp-erp-dev-db
    afcpctx.sh INSTE8_PRF 1

    AutoConfig is exiting with status 1

    DB:3.12:Autoconfig z1

    Search AutoConfig log file for afcpctx.sh and you should find more details about the error.

    You may also search MOS website for "afcpctx.sh" and go through the docs after checking the error message.

    Thanks,
    Hussein

  • RELEVANCY SCORE 3.08

    DB:3.08:Autoconfig Error 9m


    Hi,

    I am running autoconfig on application tier (1206), I am getting below error

    [AutoConfig Error Report]
    The following report lists errors AutoConfig encountered during each
    phase of its execution. Errors are grouped by directory and phase.
    The report format is:
    filename phase return code where appropriate

    [APPLY PHASE]
    AutoConfig could not successfully execute the following scripts:
    Directory: C:\oracle\VIS\inst\apps\VIS_erptest\admin\install
    adsvalsn.cmd INSTE8_APPLY -1

    AutoConfig is exiting with status 1

    Please suggest

    DB:3.08:Autoconfig Error 9m

    Hi;

    Did you review:Windows Autoconifg on dbTier fails on adcrobj.cmd adsvdlsn.cmd [ID 356927.1]?

    Regard
    Helios

  • RELEVANCY SCORE 3.06

    DB:3.06:Autoconfig Could Not Successfully Execute Jtfictx.Sh zk


    Hi,

    After upgrading 12.0.6 to 12.1.1, while running autoconfig on apps tier,

    AutoConfig could not successfully execute the following scripts:
    Directory: /u01/appakupg/inst/apps/PAKUPG_cantorebs10/admin/install
    jtfictx.sh INSTE8_PRF 1

    AutoConfig is exiting with status 1

    Running jtfictx.sh manually giving below error:

    ERROR at line 1:
    ORA-29874: warning in the execution of ODCIINDEXALTER routine
    ORA-29960: line 1,
    DRG-10595: ALTER INDEX JTF_AMV_ITEMS_URL_CTX failed
    DRG-00100: internal error, arguments : [51021],[drwaf.c],[1615],[],[]
    ORA-06512: at "SYS.DBMS_SQL", line 1199
    ORA-06512: at line 96

    I tried ID 1357760.1, but no use.
    Thanks,
    Kavitha

    DB:3.06:Autoconfig Could Not Successfully Execute Jtfictx.Sh zk

    Hi,

    I followed below notes and then the autoconfig was successful

    Several Scripts Failing With A ORA-29855 Executing ODCIINDEXCREATE Routine
    During Upgrade To 12.1.1 (u6678700.drv) [ID 1286033.1]

    "Jtfictx.sh" Failed During Autoconfig On Application Tier,
    ORA-29874, DRG-10595 [ID 1271186.1]

    Thank you all for your help.

    Thanks,
    Kavitha

  • RELEVANCY SCORE 3.06

    DB:3.06:Re: Front End Page Not Opening For R12 On Windows 8d


    Caused by: java.io.FileNotFoundException: E:oracleORADBinstappsORADB_server1 fnd12.0.0secure\E:oracleORADBinstappsORADB_server1 fnd12.0.0secureORADB.dbc (The filename, directory name, or volume label syntax is incorrect)Your DBC seems to be missing to corrupted, so please run AutoConfig to recreate the file, bounce the services and check then.Thanks,Hussein

    DB:3.06:Re: Front End Page Not Opening For R12 On Windows 8d

    Hi Hussein,As mentioned earlier all the scripts were errored out with error Timed out( 3750000 ): Interrupted Exception during autoconfig.The issue got resolved as i forget to mention there was resource contention on apps server in which grep.exe (almost 10/12 processes) were consuming most of the cpu and memory. Had to reboot the server to get rid of that processes. Once done there was no contention and autoconfig completed successfully. Thereafter compiled jsp's and started the services. Got the login page and working fine now. Thanks for your help. Good day . . .

  • RELEVANCY SCORE 3.04

    DB:3.04:Re: Adformsctl.Sh: Exiting With Status 204 c1


    Hi,

    Please run AutoConfig and see if it completes successfully.

    Regards,
    Hussein

    DB:3.04:Re: Adformsctl.Sh: Exiting With Status 204 c1

    Hi,

    Hi, I don't have metalink account. What were the solutions for 09/10/18 12:44:41 Error: connector name="OracleASjms" path="OracleASjms.rar" / will not be bootstrapped since corresponding module declaration was not found in application.xml.This message can be ignored as per (Note: 454432.1).

    Regards,
    Hussein

  • RELEVANCY SCORE 3.00

    DB:3.00:Re: Autoconfig Is Exiting With Status 1 And Oracle Error 6502 In Afpodbinit sa


    Hi Priya,I can't check my personal email at this moment (it's no longer attached to this account).Meanwhile, can you please apply (Patch 5890966: INTERMITTENT ORA-06502 DURING PEAK LOADING) and see if it helps?Thanks,Hussein

    DB:3.00:Re: Autoconfig Is Exiting With Status 1 And Oracle Error 6502 In Afpodbinit sa

    HI priya, Please see the read me of the Patch 16177705 which says the required code levels for the patch

    R12.AD.B.delta.3
    R12.ATG_PF.B.delta.3

    you need to be on the above patch level to apply the patch successfully please apply above patches then apply the Patch 16177705 AppsMasti Sharing is Caring

  • RELEVANCY SCORE 2.99

    DB:2.99:Autoconfig Is Not Running On Appstier (11.5.9 Version) f8


    After cloning from source to target i am running autoconfig on AppsTier thronging an error:
    No problem in DbTier

    Error is:

    [AutoConfig Error Report]
    The following report lists errors AutoConfig encountered during each
    phase of its execution. Errors are grouped by directory and phase.
    The report format is:
    filename phase return code where appropriate

    [PROFILE PHASE]
    AutoConfig could not successfully execute the following scripts:
    Directory: /home/applmgr/prodcomn/admin/install/PROD_hari
    afcpctx.sh INSTE8_PRF 1

    AutoConfig is exiting with status 1

  • RELEVANCY SCORE 2.99

    DB:2.99:11gr2 Upgrade 8a


    Hi guys

    I upgraded my db from 11.1.0 to 11.2.0. Ran catupgrd.sql with no errors. Then ran the utlrp.sql. Now I would like to run autoconfig bit it completes with errors.

    Starting AutoConfig at Fri Aug 26 10:54:57 2011
    Using adconfig.pl version 120.26

    Classpath : :/u01/oracle/R12/db/tech_st/11.2.0/jdbc/lib/ojdbc6.jar:/u01/oracle/R12/db/tech_st/11.2.0/appsutil/java/xmlparserv2.jar:/u01/oracle/R12/db/tech_st/11.2.0/appsutil/java:/u01/oracle/R12/db/tech_st/11.2.0/jlib/netcfg.jar

    ===========================================================================
    Starting Utility to Report Version Conflicts at Fri Aug 26 10:54:59 SAST 2011
    Using VersionConflictListGenerator.java version 120.3

    All driver files processed.

    No version conflict encountered.
    ===========================================================================

    Using Context file : /u01/oracle/R12/db/tech_st/11.2.0/appsutil/R12_db12.xml

    Attempting to create a back up of the Context file
    Created back up file of name :
    /u01/oracle/R12/db/tech_st/11.2.0/appsutil/out/R12_db12/08261054/R12_db12.xml
    ===========================================================================
    Starting synchronization of file system Context file and its templates with those in the database

    Database connection : Established

    ---------------------------------------------------------------
    ADX Database Utility
    ---------------------------------------------------------------

    getConnectionUsingAppsJDBCConnector() --
    APPS_JDBC_URL='null'
    Trying to get connection using SID based connect descriptor
    getConnection() --
    sDbHost : db12.tigerbrands.net
    sDbDomain : tigerbrands.net
    sDbPort : 1521
    sDbSid : R12
    sDbUser : apps
    Trying to connect using SID...
    getConnectionUsingSID() --
    JDBC URL: jdbc:oracle:thin:@db12.tigerbrands.net.tigerbrands.net:1521:R12
    Exception occurred: java.sql.SQLException: The Network Adapter could not establish the connection
    Trying to connect using SID as ServiceName
    getConnectionUsingServiceName() --

    JDBC URL: jdbc:oracle:thin:@(DESCRIPTION=(ADDRESS=(PROTOCOL=tcp)(HOST=db12.tigerbrands.net.tigerbrands.net)(PORT=1521))(CONNECT_DATA=(SERVICE_NAME=R12)))
    Exception occurred: java.sql.SQLException: The Network Adapter could not establish the connection
    Trying to connect using SID as ServiceName.DomainName
    getConnectionUsingServiceName() --
    JDBC URL: jdbc:oracle:thin:@(DESCRIPTION=(ADDRESS=(PROTOCOL=tcp)(HOST=db12.tigerbrands.net.tigerbrands.net)(PORT=1521))(CONNECT_DATA=(SERVICE_NAME=R12.tigerbrands.net)))
    Exception occurred: java.sql.SQLException: The Network Adapter could not establish the connection
    Connection could not be obtained; returning null

    -------------------ADX Database Utility Finished---------------

    Connection could not be obtained using s_dbhost
    Trying to connect using s_hostname
    getConnection() --
    sDbHost : db12
    sDbDomain : tigerbrands.net
    sDbPort : 1521
    sDbSid : R12
    sDbUser : apps
    Trying to connect using SID...
    getConnectionUsingSID() --
    JDBC URL: jdbc:oracle:thin:@db12.tigerbrands.net:1521:R12
    Connection obtained

    -------------------ADX Database Utility Finished---------------

    OAM Context editing support feature: Enabled
    OAM Customization support feature : Enabled

    File system template : /u01/oracle/R12/db/tech_st/11.2.0/appsutil/template/adxdbctx.tmp

    Checking for customizations to Context template
    Customizations found : None
    ----------------------------------------------------------------
    File system Context file :/u01/oracle/R12/db/tech_st/11.2.0/appsutil/R12_db12.xml

    Checking the Context file for possible updates from the Database
    Comparing the Context file stored in database with the Context file in the file system

    Result : The two Context files are in sync

    ===========================================================================
    Starting Updates of Context file Fri Aug 26 10:55:02 SAST 2011

    found context version : 120.34.12010000.2
    available update version : 120.34.12010000.2

    No updates to apply

    Ending Updates of Context file
    ===========================================================================

    ===========================================================================
    Config Tool CVMHelper started at Fri Aug 26 10:55:02 SAST 2011
    ===========================================================================

    Updating local context file variables for Database Tier
    Getting listener port from /u01/oracle/R12/db/tech_st/11.2.0/network/admin/R12_db12/listener.ora
    Exception occurred while preseeding variables in the context file: java.lang.reflect.InvocationTargetException

    StackTrace:
    java.lang.reflect.InvocationTargetException
    at sun.reflect.NativeConstructorAccessorImpl.newInstance0(Native Method)
    at sun.reflect.NativeConstructorAccessorImpl.newInstance(Unknown Source)
    at sun.reflect.DelegatingConstructorAccessorImpl.newInstance(Unknown Source)
    at java.lang.reflect.Constructor.newInstance(Unknown Source)
    at oracle.apps.ad.tools.configuration.CVMHelper.getCurrentPort(CVMHelper.java:601)
    at oracle.apps.ad.tools.configuration.CVMHelper.processDBTierListener(CVMHelper.java:488)
    at oracle.apps.ad.tools.configuration.CVMHelper.processLocalConfig(CVMHelper.java:771)
    at oracle.apps.ad.context.CtxValueMgt.preSeed2Ctx(CtxValueMgt.java:1813)
    at oracle.apps.ad.context.CtxValueMgt.processCtxFile(CtxValueMgt.java:1610)
    at oracle.apps.ad.context.CtxValueMgt.main(CtxValueMgt.java:755)
    Caused by: java.lang.UnsatisfiedLinkError: oracle.net.common.NetGetEnv.get(Ljava/lang/String;)Ljava/lang/String;
    at oracle.net.common.NetGetEnv.get(Native Method)
    at oracle.net.config.Config.getNetDir(Unknown Source)
    at oracle.net.config.Config.initConfig(Unknown Source)
    at oracle.net.config.Config.init(Unknown Source)
    ... 10 more

    ===========================================================================
    Starting Context Value Management System at Fri Aug 26 10:55:02 SAST 2011
    Using version 120.13
    Options:
    -------------------ADX Database Utility Finished---------------

    Verifying connection to the Database : Established
    Restore Profile Feature : Enabled

    Restore Profile file created at : /u01/oracle/R12/db/tech_st/11.2.0/appsutil/out/R12_db12/08261054/restore.sql

    Purging the table ADX_PRE_AUTOCONFIG of rows containing attribute R12_db12
    Purging completed

    Restore Profile utility ran successfully

    ===========================================================================

    adcvmlog.xml renamed to /u01/oracle/R12/db/tech_st/11.2.0/appsutil/log/R12_db12/08261054/adcvmlog.xml.08261055

    [AutoConfig Error Report]
    The following report lists errors AutoConfig encountered during each
    phase of its execution. Errors are grouped by directory and phase.
    The report format is:
    filename phase return code where appropriate

    [PROFILE PHASE]
    AutoConfig could not successfully execute the following scripts:
    Directory: /u01/oracle/R12/db/tech_st/11.2.0/appsutil/install/R12_db12
    afdbprf.sh INSTE8_PRF 1

    [APPLY PHASE]
    AutoConfig could not successfully execute the following scripts:
    Directory: /u01/oracle/R12/db/tech_st/11.2.0/appsutil/install/R12_db12
    adcrobj.sh INSTE8_APPLY 1

    AutoConfig is exiting with status 2

    Please can someone shed some light. I don't know where to start :(

    Regards

    DB:2.99:11gr2 Upgrade 8a

    Good day

    I loaded patch 7651166 - Oracle Techstack Release Update Pack 2 for 12.1 (R12.TXK.B.DELTA.2)

    After loading the patch, you need to recreate the appsutil.zip and copy it over to the db and rerun autoconfig.

    Regards

  • RELEVANCY SCORE 2.96

    DB:2.96:R12 Vs 11i sj


    Hi,

    I need answers to the following queries,

    1.) Is there any concept of Report Server in R12? If, yes where is the report server located?

    2.) Difference between 11i and R12 with respect to Autoconfig

    Rgds,

    DB:2.96:R12 Vs 11i sj

    I am not sure of the changes in 11i and R12 wrt to Autoconfig.It will be appreciable if you can point out the differences between the both.The concept of AutoConfig is the same in 11i/R12 releases.

    If you want to get more technical details, check the patches mentioned in both docs and go through the README file files as well as the bug numbers (if available for public access) and you should get more details about the new enhancements/features.

    Thanks,
    Hussein

  • RELEVANCY SCORE 2.95

    DB:2.95:Re: Change Hostname Of 11.5.9 Installation mf


    Hi,

    It is possible, please refer to the following documents for details.

    Note: 338003.1 How to change the hostname and/or port of the Database Tier using AutoConfig
    Note: 341322.1 How to change the hostname of an Applications Tier using AutoConfig

    Regards,
    Hussein

    DB:2.95:Re: Change Hostname Of 11.5.9 Installation mf

    I'll do this over the weekend and I'll let you know how it goes.

    Thanks,
    Don

  • RELEVANCY SCORE 2.95

    DB:2.95:Re: 11i/R12 Upgrade Project - No Configure Button ca


    From your description below, it sounds like you used AutoConfig to configure the 11i node types, which is fine. You don't mention configuring the R12 node types. (It is doubtful that this can be done via AutoConfig, as you typically do not have this implemented on the R12 side or you wouldn't be trying to upgrade!)
    P
    This "missing Configure button" issue is covered in the FAQ (note 405263.1) under Projects, Configuration. bALL/b node types must be defined before the button will appear.
    P
    Hope this helps!
    P
    -VikkiBR
    Product Manager for the Maintenance Wizard

    DB:2.95:Re: 11i/R12 Upgrade Project - No Configure Button ca

    I continue to read those R12 upgrade foundation documents, and thus far only Maintenance Wizard makes it immediately clear that one may have show-stopper upgrade issues with certain installed components.

    Thus even if one doesn't plan to use it in practice, imho it would be simply imprudent not to run it.

    Also my problems negotiating the MW interface been minor (and easily fixed with minor 2000' wordsmithing).

    Thanks again for this excellence.

  • RELEVANCY SCORE 2.95

    DB:2.95:Adoacorectl.Sh Exiting With Status 152 77


    Dear Members:

    Having trying time with R12 installation on oel4.8 running on VMware with NAT configuration (keeping vmnet8 and loopback adapter enabled on host XP)
    Installation ends with 2 errors: jsp page not responding and login page. Found all processes down except HTTP_SERVER, tried to start manually; starting with adopmnctl (exit with 0), adapcctl (exit with 0) and then adoacorectl(exit with 152). Tried autoconfig, flushing of *.lock/*.state, no good. Following are log details:

    ================================================================================
    adoacorectl.txt

    08/21/10-22:18:09 :: adoacorectl.sh version 120.13

    08/21/10-22:18:09 :: adoacorectl.sh: starting OPMN if it is not running

    opmnctl: opmn is already running.

    08/21/10-22:18:09 :: adoacorectl.sh: Starting OPMN managed OACORE OC4J instance

    opmnctl: starting opmn managed processes...
    ================================================================================
    opmn id=ebs12.localdomain:6200
    0 of 1 processes started.

    ias-instance id=VIS_ebs12.ebs12.localdomain
    ++++++++++++++++++++++++++++++++++++++++++++++++++++++++++++++++++++++++++++++++
    --------------------------------------------------------------------------------
    ias-component/process-type/process-set:
    default_group/oacore/default_group/

    Error
    -- Process (index=1,uid=179852925,pid=18090)
    time out while waiting for a managed process to start
    Log:
    /u01/oracle/VIS/inst/apps/VIS_ebs12/logs/ora/10.1.3/opmn/default_group~oacore~default_group~1.log

    08/21/10-22:28:11 :: adoacorectl.sh: exiting with status 152

    ================================================================================

    tail -100 default_group~oacore~default_group~1.log
    --------
    10/08/21 22:04:57 Start process
    --------
    3.069: [GC 32768K-3399K(125632K), 0.0280340 secs]
    5.798: [GC 36167K-5624K(125632K), 0.0456930 secs]
    37.555: [GC 38392K-9691K(125632K), 0.0564620 secs]
    39.595: [GC 42459K-10339K(125632K), 0.0169660 secs]
    40.093: [GC 43107K-10436K(125632K), 0.0211150 secs]
    43.757: [GC 43204K-10284K(161344K), 0.0829130 secs]

    --------
    10/08/21 22:18:09 Start process
    --------
    3.205: [GC 32768K-3392K(125632K), 0.0241880 secs]
    6.605: [GC 36160K-5646K(125632K), 0.0381650 secs]
    12.224: [GC 38414K-9681K(125632K), 0.0545510 secs]
    14.125: [GC 42449K-10694K(125632K), 0.0441780 secs]
    14.663: [GC 43462K-10783K(125632K), 0.0279530 secs]
    17.985: [GC 43551K-11721K(161536K), 0.0992910 secs]

    This issue is not for the first time, I am facing, as posted earlier without any resolution. But that time I successfully installed R12 on oel5.3, issue was OACORE will not start, unless connected to internet. Could someone please suggest some remedy. This is the third time, tried to install with my internet connection off.

    Thanks very much in advance.
    Atanu

    DB:2.95:Adoacorectl.Sh Exiting With Status 152 77

    Hussein :

    When connected :
    Service Provider's IP: 124.123.137.16
    Subnet : 255.255.192.0
    Gateway : 124.123.128.1

    VMware Virtual Ethernet Adapter IP: 192.168.140.1 [VMnet8 - NAT]
    Subnet Mask : 255.255.255.0

    Linux IP : 192.168.140.129
    Gateway : 192.168.140.2
    Subnet IP : 192.168.140.0

    I tried configuring VMware network as Bridged/NAT (VNnet0/VMnet8) - I am yet to try Host (VMnet1). While Bridging I purposely chose MS Loopback and disabling default adapter of laptop (not connected, that time). I mean from VMWare workstation's virtual network editor, where one can choose either the default adapter or MS Loopback if it is active, to bridge with; with a hope that guest linux IP will exchange packet with MS Loopback's IP (the same way it is doing with default adapter's IP, when connected, I guess and which is why OACORE components of Apps are starting properly, if at all that's the reason that I am able to start apps in that case!! )

    Also to let you know, after googling, I found few such cases as mine, where they find their apps up and running when they are connected.

    Thanks.
    Atanu

  • RELEVANCY SCORE 2.94

    DB:2.94:Re: Autoconfig Is Exiting With Status 31 3a


    Hi,Please post the contents of:/u01/E-BIZ/inst/apps/VIS_ebsapp/admin/log/ApplyAppsTier_08010202.logBest Regards,

    DB:2.94:Re: Autoconfig Is Exiting With Status 31 3a

    Hi,
    # unlink /usr/lib/libXtst.so.6
    # ln -s /usr/X11R6/lib/libXtst.so.6.1 /usr/lib/libXtst.so.6

    Did you follow the instruction as root user:Please also confirm your installation userIf you are facing a different error, please upload to file upload site and provide the link here.Have a look at :http://docs.oracle.com/cd/E16538_01/ovm/acrobat/EBusinessSuiteOVMDeploymentGuide.pdfIntroduction to Oracle VM, Oracle VM Manager and EBS template deployment (Doc ID 1355641.1) MOS NOTEBest Regards,

  • RELEVANCY SCORE 2.94

    DB:2.94:Autoconfig Db Tier Error On Win2k3 R12(12.1.1) s8


    hi,

    [PROFILE PHASE]
    AutoConfig could not successfully execute the following scripts:
    Directory: D:\oracle\VIS\db\tech_st\11.1.0\appsutil\install\VIS_murli
    afdbprf.cmd INSTE8_PRF 1

    [APPLY PHASE]
    AutoConfig could not successfully execute the following scripts:
    Directory: D:\oracle\VIS\db\tech_st\11.1.0\appsutil\install\VIS_murli
    adcrobj.cmd INSTE8_APPLY 1

    AutoConfig is exiting with status 2

    Got the error while running autoconfig on dbtier.

    I am not having any source, how to resolve the given error.

    regards,
    sandeep.

    DB:2.94:Autoconfig Db Tier Error On Win2k3 R12(12.1.1) s8

    Hi,

    Try the solution in (Note: 555214.1 - Oacore Processes Won't Start After Increasing Their Number In Oracle Applications Release 12 In Context.xml) and see if it helps.

    Regards,
    Hussein

  • RELEVANCY SCORE 2.94

    DB:2.94:Cloning_11.5.10.2_Rapidclone 7z


    Iam performing the cloning of oracle applications 11.5.10.2

    Clone got failed with the below error in appln tier

    [AutoConfig Error Report]
    The following report lists errors AutoConfig encountered during each
    phase of its execution. Errors are grouped by directory and phase.
    The report format is:
    filename phase return code where appropriate

    [APPLY PHASE]
    AutoConfig could not successfully execute the following scripts:
    Directory: /u01/app/applmgr/sasora/iAS/Apache/perl/bin/perl -I /u01/app/applmgr/sasora/iAS/Apache/perl/lib/5.00503 -I /u01/app/applmgr/sasora/iAS/Apache/perl/lib/site_perl/5.005 -I /u01/app/applmgr/sas/au/11.5.0/perl /u01/app/applmgr/sascomn/admin/install/sas_apsas
    txkGenExtSecConf.pl INSTE8_APPLY 1

    AutoConfig is exiting with status 1

    RC-50014: Fatal: Execution of AutoConfig was failed
    Raised by oracle.apps.ad.clone.ApplyApplTop

    Completed ApplyApplTop.
    ERROR: AutoConfig completed with errors. Check logfile at /u01/app/applmgr/sasappl/admin/sas_apsas/log/ApplyAppsTier_02211407.log for details.
    # Checking the status of AutoConfig run of ApplyApplTop
    Warning : AutoConfig has completed with errors .
    Please review the AutoConfig section in the logfile. If required, you can re-run AutoConfig from command line after fixing the problem

    Please help me on this

    Aram

    DB:2.94:Cloning_11.5.10.2_Rapidclone 7z

    Aram,

    txkGenExtSecConf.pl INSTE8_APPLY 1

    AutoConfig is exiting with status 1

    RC-50014: Fatal: Execution of AutoConfig was failed
    Raised by oracle.apps.ad.clone.ApplyApplTop

    Completed ApplyApplTop.
    ERROR: AutoConfig completed with errors. Check logfile at /u01/app/applmgr/sasappl/admin/sas_apsas/log/ApplyAppsTier_02211407.log for details.
    # Checking the status of AutoConfig run of ApplyApplTop
    Warning : AutoConfig has completed with errors .
    Please review the AutoConfig section in the logfile. If required, you can re-run AutoConfig from command line after fixing the problemPlease check AutoConfig log file for details about the error -- Search for "txkGenExtSecConf.pl".

    Please also see these docs.

    AUTOCONFIG FAILED WITH 2 ERRORS: ADADMAT.PL - TXKGENEXTSECCONF.PL [ID 372714.1]
    11i: 'adcfgclone.pl appsTier' fails with ERROR: 'txkGenExtSecConf.pl' - ORACLE_HOME env. variable must be set to validate sqlplus connection [ID 1186394.1]
    Autoconfig fails with : Function: Txk::Techstack::_getiaspatchset [ Level 1 ] --ERRORMSG: No create access for /ohs_ver.txt [ID 388632.1]

    Thanks,
    Hussein

  • RELEVANCY SCORE 2.93

    DB:2.93:Re: Upgrading Oracle Apps R12 From 12.0.0 To 12.0.4? 7x


    Oracle E-Business Suite 12.0.4 Release Update Pack Readme
    http://metalink.oracle.com/metalink/plsql/ml2_documents.showDocument?p_database_id=NOTp_id=465776.1

    6510214 R12.AD.A.DELTA.4

    sqlplus "/as sysdba" @$APPL_TOP/admin/adgrants.sql APPLSYS

    6435000 ORACLE E-BUSINESS SUITE 12.0.4 RELEASE UPDATE PACK (RUP4)
    6400100 CONSOLIDATED ONLINE HELP FOR 12.0.4
    6742236 FORMS FAILS TO LAUNCH USING FIREFOX AND MOZILLA
    6116405 AS11 CLASSIC - REPORTS MATS RUN HANGS
    6145693 R12 RAPIDCLONE CONSOLIDATED FIXES JAN/2008

    The following Oracle Forms objects did not generate successfully:

    igc forms/US IGCBDAQF.fmx
    igi forms/US IGIPDETU.fmx
    igi forms/US IGIRRMSC.fmx

    12.0.4 : Several Invalid Objects After Applying Rup4.
    https://metalink.oracle.com/metalink/plsql/ml2_documents.showDocument?p_database_id=NOTp_id=554096.1

    Cause
    The synonym HX_PARTY_RELAIONSHIPS does not exist.

    Solution
    -- To implement the solution, please execute the following steps::
    Run adadmin option Recreate Grants and Synonyms.
    Verify that the synonym HZ_PARTY_RELATIONSHIPS is created.
    Run adadmin to compile invalid objects.
    Run adadmin to regenerate the forms.

    After you have updated to Release 12.0.4, perform the following post-update steps to update all database tier nodes with the code level provided by RUP4:

    Application tier:

    * As the APPLMGR user, run the environment (UNIX) or the command (WINDOWS) file for the current APPL_TOP.

    UNIX
    . ./APPL_TOP/APPSCONTEXT_NAME.env

    Windows
    APPL_TOP\envshellCONTEXT_NAME.cmd

    * Run AutoConfig on the APPL_TOP.
    * Run the admkappsutil.pl utility to create the file appsutil.zip in the INST_TOP/admin/out directory.

    perl AD_TOP/bin/admkappsutil.pl

    Note: For details on how to run AutoConfig and create appsutil.zip, refer to Using AutoConfig to Manage System Configurations in Oracle Applications Release 12 (Doc ID: 387859.1).

    * Copy or FTP the appsutil.zip file to the RDBMS ORACLE_HOME.
    * Uncompress appsutil.zip under the RDBMS ORACLE_HOME.

    cd ORACLE_HOME unzip -o appsutil.zip

    * Run AutoConfig on the RDBMS ORACLE_HOME.

    Note: For details on how to run AutoConfig on the database tier and how to transfer the AutoConfig updates from the APPL_TOP to the RDBMS ORACLE_HOME, refer to Using AutoConfig to Manage System Configurations in Oracle Applications Release 12 (Doc ID: 387859.1), Section 2, Step 3, Patching AutoConfig.

    Database tier and application tier:

    Re-run adpreclone.pl on the database tier and the applications tier. Since updates included in RUP4 were applied to the system, adpreclone must be run again in order to apply the updates to the clone directory structures used during cloning.

    perl adpreclone.pl dbTier
    perl adpreclone.pl appsTier

    DB:2.93:Re: Upgrading Oracle Apps R12 From 12.0.0 To 12.0.4? 7x

    Oh, ok. Thanks for the confirmation because I tried to find in metalink but couldn't found it. Thx again

  • RELEVANCY SCORE 2.93

    DB:2.93:Adsvdlsn Error 1060 During Clone. R12, Windows 2008 R2 8a


    During a cloneing of our PROD environment to DEV, a process we've done many times, I'm now getting "The specified service does not exist as an installed service". The error happens at the the addlnctl.cmd during the dbTier cloning process.

    The Listener gets created and is up and running, but it seems that right after is when the error appears?

    Partial excerpt from error log:
    -----------------------------------------------------------------------------------------------------------------------
    [AutoConfig Error Report]
    The following report lists errors AutoConfig encountered during each
    phase of its execution. Errors are grouped by directory and phase.
    The report format is:
    filename phase return code where appropriate

    [SETUP PHASE]
    AutoConfig could not successfully execute the following scripts:
    Directory: E:\ORACLE\DEV\db\tech_st\11.2.0\appsutil\install\DEV_us001st1801
    adsvdlsn.cmd INSTE8_SETUP 1060

    AutoConfig is exiting with status 1

    RC-50014: Fatal: Execution of AutoConfig was failed
    Raised by oracle.apps.ad.clone.ApplyDBTechStack
    -----------------------------------------------------------------------------------------------------------------------

    When I manuall run adsvdlsn.cmd I get:

    LSNRCTL for 32-bit Windows: Version 11.2.0.1.0 - Production on 17-OCT-2011 08:17
    :50

    Copyright (c) 1991, 2010, Oracle. All rights reserved.

    Connecting to (DESCRIPTION=(ADDRESS=(PROTOCOL=TCP)(HOST=us001st1801.tp.tpnet.int
    ra)(PORT=1521)))
    The command completed successfully
    ECHO is off.
    Listener DEV has already been started.
    ECHO is off.
    addlnctl.cmd exiting with status 0
    [SC] OpenService FAILED 1060:

    The specified service does not exist as an installed service.

    adsvdlsn.cmd exiting with status 1060
    ERRORCODE = 1060 ERRORCODE_END
    E:\Oracle\DEV\db\tech_st\11.2.0\appsutil\install\DEV_us001st1801
    ------------------------------------------------------------------------------------------------------------

    I've stopped and removed the Listener service and same error, I've cleaned out the target server of all Oracle files (per metalink document 567507.1), as I always have, and have repeated the cloning process from scratch (clean, preclone, copy source to target) and the same error appears.

    We're running on Windows 2008 Rel 2 32-bit. As I said, we've done this several times before with no problems. No patches/updates have been done since the last cloning. Any help, advise would be GREATLY appreciated.

    Best Regards,

    Fernando.

    DB:2.93:Adsvdlsn Error 1060 During Clone. R12, Windows 2008 R2 8a

    Fernando,

    Thanks for the update and sharing the solution!

    Hussein

  • RELEVANCY SCORE 2.92

    DB:2.92:Re: Adstrtal.Sh:Exiting With Status 1 z1


    Hi, i have the same problem, i execute the autoconfig, and AutoConfig completed with errors.

    You are running adstrtal.sh version 120.13.12000000.4

    Enter the APPS username: apps

    Enter the APPS password:

    adstrtal.sh: Database connection could not be established. Either the database is down or the APPS credentials supplied are wrong.

    USAGE: adstrtal.sh appsusername/appspassword

    adstrtal.sh: exiting with status 1

    what can i do?

    DB:2.92:Re: Adstrtal.Sh:Exiting With Status 1 z1

    Hi Vinayak,

    In case you are connecting db from server(where database exsisits) then listener will not come in picture.

    Try to connect database from outside using some tool like sqlplus or toad etc....

    Thanks,

  • RELEVANCY SCORE 2.92

    DB:2.92:Oracle Ebs R12 For Windows Installation Error pp


    Hi,

    I tried to install Oracle EBS R12 for Windows. My installation had failed. Listed below is the log information. On the Second log file (further down below) it is saying "TNS:no listener". Please help.

    FIRST LOG FILE:Log Path: C:\Orale\VIS\db\tech_st\11.1.0\appsutil\log\VIS_bing-pc\06132024

    C:\Users\Bing\AppData\Local\Tempif 0 == 0 goto :TCFG_OK

    C:\Users\Bing\AppData\Local\Tempecho "runProcess_4"

    "runProcess_4"

    C:\Users\Bing\AppData\Local\TempREM

    C:\Users\Bing\AppData\Local\TempREM Perform the instance configuration

    C:\Users\Bing\AppData\Local\TempREM

    C:\Users\Bing\AppData\Local\Tempecho "Statusstring Configuring Database Technology Stack"

    "Statusstring Configuring Database Technology Stack"

    C:\Users\Bing\AppData\Local\Temp(echo APPS echo APPS ) | J:\StageR12\startCD\Disk1\rapidwiz\jre\NT\1.6.0\bin\java -DCONTEXT_VALIDATED=true -mx512M -classpath .;J:\StageR12\startCD\Disk1\rapidwiz\jlib\java;J:\StageR12\startCD\Disk1\rapidwiz\jlib\xmlparserv2.jar;J:\StageR12\startCD\Disk1\rapidwiz\jlib\ojdbc14.jar;J:\StageR12\startCD\Disk1\rapidwiz\jlib\oui\OraInstaller.jar;J:\StageR12\startCD\Disk1\rapidwiz\jlib\oui\ewt3.jar;J:\StageR12\startCD\Disk1\rapidwiz\jlib\oui\share.jar;J:\StageR12\startCD\Disk1\rapidwiz\jlib\oui\srvm.jar oracle.apps.ad.clone.ApplyDBTechStack -e C:\oracle\VIS\db\tech_st\11.1.0\appsutil\VIS_bing-pc.xml -stage J:\StageR12\startCD\Disk1\rapidwiz -showProgress -phase cfg -nopromptmsg

    Log file located at C:\oracle\VIS\db\tech_st\11.1.0\appsutil\log\VIS_bing-pc\ApplyDBTechStack_06132042.log

    | 0% completed

    / 0% completed

    - 0% completed

    \ 0% completed

    | 0% completed

    / 0% completed

    - 0% completed

    \ 0% completed RC-00110: Fatal: Error occurred while relinking of ApplyDBTechStack

    C:\Users\Bing\AppData\Local\Tempif 1 == 0 goto :ICFG_OK

    C:\Users\Bing\AppData\Local\Tempecho "Cannot execute configure of database ORACLE_HOME using RapidClone\n";

    "Cannot execute configure of database ORACLE_HOME using RapidClone\n";

    C:\Users\Bing\AppData\Local\Tempif "" == "TRUE" goto :ICFG_OK

    RW-50010: Error: - script has returned an error: 1
    RW-50004: Error code received when running external process. Check log file for details.
    Running Database Install Driver for VIS instance

    SECOND LOG FILEC::\oracle\VIS\db\tech_st\11.1.0\appsutil\log\VIS_bing-pc\ApplyDBTechStack_06132042.log

    LOCAL : VIS
    ORACLE_SID :
    PATH : C:\Oracle\VIS\db\tech_st\11.1.0\perl\5.8.3\bin\MSWin32-x86-multi-thread\;C:\oracle\VIS\db\tech_st\11.1.0\bin;C:\oracle\VIS\db\tech_st\11.1.0\appsutil\jre\bin;C:\oracle\VIS\db\tech_st\11.1.0\appsutil\jre\bin;J:\StageR12\startCD\Disk1\rapidwiz\unzip\NT;C:\oracle\VIS\db\tech_st\11.1.0\bin;C:\Program Files (x86)\Oracle\jre\1.3.1\bin;C:\Perl\bin\;C:\Windows\system32;C:\Windows;C:\Windows\System32\Wbem;C:\hp\bin\Python
    LD_LIBRARY_PATH : C:\oracle\VIS\db\tech_st\11.1.0\lib
    ECHO is off.
    ECHO is off.
    The log information will be written to
    "C:\oracle\VIS\db\tech_st\11.1.0\appsutil\log\VIS_bing-pc\addlnctl.txt"
    ECHO is off.
    ECHO is off.
    Starting listener process VIS ...
    ECHO is off.

    LSNRCTL for 32-bit Windows: Version 11.1.0.7.0 - Production on 13-JUN-2009 20:43:12

    Copyright (c) 1991, 2008, Oracle. All rights reserved.

    Connecting to (DESCRIPTION=(ADDRESS=(PROTOCOL=TCP)(HOST=bing-pc.horse.com)(PORT=1521)))
    TNS-12541: TNS:no listener
    TNS-12560: TNS:protocol adapter error
    TNS-00511: No listener
    32-bit Windows Error: 61: Unknown error

    LSNRCTL for 32-bit Windows: Version 11.1.0.7.0 - Production on 13-JUN-2009 20:43:14

    Copyright (c) 1991, 2008, Oracle. All rights reserved.

    Starting tnslsnr: please wait...

    TNS-12560: TNS:protocol adapter error
    TNS-00530: Protocol adapter error

    addlnctl.cmd exiting with status 1
    OpenSCManager failed
    adsvdlsn.cmd exiting with status 1002
    ERRORCODE = 1002 ERRORCODE_END
    .end std out.

    .end err out.
    ****************************************************

    AutoConfig Setup Phase
    Running Setup Process 5 of 6 for AppsUtil
    Executing script in InstantiateFile:
    C:\oracle\VIS\db\tech_st\11.1.0\appsutil\install\VIS_bing-pc\afmkinit_inst.cmd

    script returned:
    ****************************************************
    Sat 06/13/2009
    08:43 PM
    "afmkinit_inst.cmd exiting with status 0"
    ERRORCODE = 0 ERRORCODE_END
    .end std out.

    .end err out.
    ****************************************************

    AutoConfig Setup Phase
    Running Setup Process 6 of 6 for AppsUtil
    Executing script in InstantiateFile:
    C:\oracle\VIS\db\tech_st\11.1.0\appsutil\install\VIS_bing-pc\afmkinit.cmd

    script returned:
    ****************************************************
    Sat 06/13/2009
    08:43 PM
    1 file(s) copied.
    1 file(s) copied.
    1 file(s) copied.
    "afmkinit.cmd exiting with status 0"
    ERRORCODE = 0 ERRORCODE_END
    .end std out.

    .end err out.
    ****************************************************

    Skipping Profile Phase
    Skipping Apply Phase
    adcvmlog.xml renamed to C:\oracle\VIS\db\tech_st\11.1.0\appsutil\log\VIS_bing-pc\adcvmlog.xml.06132042

    [AutoConfig Error Report]
    The following report lists errors AutoConfig encountered during each
    phase of its execution. Errors are grouped by directory and phase.
    The report format is:
    filename phase return code where appropriate

    [SETUP PHASE]
    AutoConfig could not successfully execute the following scripts:
    Directory: C:\oracle\VIS\db\tech_st\11.1.0\appsutil\install\VIS_bing-pc
    adsvdlsn.cmd INSTE8_SETUP 1002

    AutoConfig is exiting with status 1

    RC-50014: Fatal: Execution of AutoConfig was failed
    Raised by oracle.apps.ad.clone.ApplyDBTechStack

    Thanks in advanced,

    Edited by: amorsolo on Jun 15, 2009 9:12 PM

    DB:2.92:Oracle Ebs R12 For Windows Installation Error pp

    EBS R12 is not certified for Windows Vista 64 bit nor any Windows Vista.

  • RELEVANCY SCORE 2.92

    DB:2.92:Output Post Processeor Is Down After Installing R12 kx


    Sawwan,

    This is continuation from my previous post,

    Re: Login Page not Displying After Multi node installation.

    After running autoconfig, all concurrent manager is up and running, but when i tried to bring up OPP its not comming up at all,

    DB:2.92:Output Post Processeor Is Down After Installing R12 kx

    Sawwan,

    After changing Concurrent:GSM Enabled" profile option is set to Y now OPP is working fine now,

    Thanks

  • RELEVANCY SCORE 2.91

    DB:2.91:Re: Autoconfig Completed With Errors On Application Tier. Successful On Db Tier zj


    Do I need to apply the patch as the document 260887.1 says. It is for 11i and mine is 12.1.1 and it is a fresh installation and not a clone.
    I did clean all the nodes by running the script and then autoconfig. The db tier is succesful but then apps tier fails on autoconfig.

    The application and database works fine but the concurrent managers are down except for internal manager.

    Edited by: user4466072 on May 1, 2011 12:17 AM

    DB:2.91:Re: Autoconfig Completed With Errors On Application Tier. Successful On Db Tier zj

    With a fresh installation you should never have any error in running AutoConfig and/or starting the CM as both should work as expected if the installation completed successfully.

    I would suggest you apply the latest AutoConfig patches and see if this helps.

    Please share the installation log files. Also, verify you have proper entry in the hosts file.

    Thanks,
    Hussein

  • RELEVANCY SCORE 2.90

    DB:2.90:Adformsctl.Sh: Exiting With Status 204 ka


    Hi,

    PROD
    R12
    AIX 5.2

    Forms services is not opening. As i have already performed to delete as below action plan but the issue is same. Please suggest me.

    rm -fr $INST_TOP/ora/10.1.3/j2ee/oacore/persistence/*
    rm -fr $INST_TOP/ora/10.1.3/j2ee/oafm/persistence/*
    rm -fr $INST_TOP/ora/10.1.3/j2ee/forms/persistence/*

    FYI I did not run autoconfig

    Thanks

    DB:2.90:Adformsctl.Sh: Exiting With Status 204 ka

    Issue is resolved Now it is opening form and everything is fine. Autoconfig completed sucessfully.I followed as below

    shutdown all appication services
    run autoconfig
    start all application services

    As you last updated that running autoconfig is just to check there is no issue with application configuration perspective There is not associated with issue?

    Many Thanks Hussein

  • RELEVANCY SCORE 2.90

    DB:2.90:Re: Unable To Start ./Adopmnctl.Sh Services After Fresh Installation Of 12.2 On Linux 6.3 d1


    while installing "instances" directory is missing...This directory should be delivered as part of a successful installation, so please review the installation log files for any errors.Does AutoConfig complete with no errors?Thanks,Hussein

    DB:2.90:Re: Unable To Start ./Adopmnctl.Sh Services After Fresh Installation Of 12.2 On Linux 6.3 d1

    Using underscore in the hostname is not specific to 12.2 and it should not be used with any EBS 11i/12.1/12.2 installation.R12: Error "You are trying to access a page that is no longer active" When Attempting to Login to Newly Cloned Instance (Doc ID 1554558.1)Thanks,Hussein

  • RELEVANCY SCORE 2.89

    DB:2.89:Install Oracle R12 On Rhel 3.0 Erro sa


    Hi,

    I install Oracle R12 on Redhat3, but there is a problem as following :

    ouicli.pl INSTE8_APPLY -1

    AutoConfig is exiting with status 1

    RC-50013: Fatal: Instantiate driver did not complete successfully.
    /d01/oracle/VIS/apps/tech_st/10.1.3/appsutil/driver/regclone.drv

    Is there anyone coming across the problem ?

    DB:2.89:Install Oracle R12 On Rhel 3.0 Erro sa

    hi Srawan,
    thanks for sharing the solution
    fadi

  • RELEVANCY SCORE 2.88

    DB:2.88:Re: Error In Instantiate Phase (Adcrdb.Sh) During Adcfgclone.Pl Dbconfig xm


    adcrdb.sh INSTE8
    AutoConfig is exiting with status 1

    RC-50014: Fatal: Execution of AutoConfig was failed
    Raised by oracle.apps.ad.clone.ApplyDatabaseThis is a generic error, please search the log file for "adcrdb.sh" and you should find more details about the error around the file name.

    Thanks,
    Hussein

    DB:2.88:Re: Error In Instantiate Phase (Adcrdb.Sh) During Adcfgclone.Pl Dbconfig xm

    user4434301 wrote:
    Eventually I just set it all up for a workaround so that once the file was deleted when adcfgclone.pl dbconfig was kicked off, I copied it back again from the Source directory. This allowed for the script to finish, That's a good idea :)

    however I still don't know why it was deleting the file upon starting the script. Regardless, we should be able to complete the clone now...thanks.I do not see much in the log file, so you may log a SR and ask Oracle support for an explanation.

    Thanks,
    Hussein

  • RELEVANCY SCORE 2.87

    DB:2.87:Adcfg Clone Error z3


    Hi,

    Error while running the adcfgclone

    ***************************************************

    Skipping Profile Phase
    Skipping Apply Phase

    [AutoConfig Error Report]
    The following report lists errors AutoConfig encountered during each
    phase of its execution. Errors are grouped by directory and phase.
    The report format is:
    filename phase return code where appropriate

    [INSTANTIATE PHASE]
    AutoConfig could not successfully instantiate the following files:
    Directory: /ozone/testozoneBUP/db/tech_st/10.2.0/appsutil/install/crp_te
    stapps
    adcrdb.sh INSTE8

    AutoConfig is exiting with status 1

    RC-50014: Fatal: Execution of AutoConfig was failed
    Raised by oracle.apps.ad.clone.ApplyDBTechStack

    Regards,
    Rahul Reddy

    DB:2.87:Adcfg Clone Error z3

    so.... yeah we need the logs to see what's wrongExactly :)

  • RELEVANCY SCORE 2.85

    DB:2.85:Autoconfig Error 1f


    Hi
    while running auto config i am getting in 11.5.10 and on solaris sparc 64 bit
    AutoConfig could not successfully execute the following scripts:
    Directory: /financial/dev/xxx
    adgendbc.sh INSTE8_SETUP 1
    adgentopfile.sh INSTE8_SETUP 1

    AutoConfig is exiting with status 2

    Regards

    DB:2.85:Autoconfig Error 1f

    Please upload AutoConfig log file to any free hosting website and post the link here.

    Thanks,
    Hussein

  • RELEVANCY SCORE 2.85

    DB:2.85:Autoconfig Issues In R12 zj


    recently i have upgraded to R12 and successfully i re build db context file,however while i am running autoconfig in MT its completing with error

    here is autoconfig error information
    =====================

    [AutoConfig Error Report]
    The following report lists errors AutoConfig encountered during each
    phase of its execution. Errors are grouped by directory and phase.
    The report format is:
    filename phase return code where appropriate

    [SETUP PHASE]
    AutoConfig could not successfully execute the following scripts:
    Directory: /data/oracle/R12/inst/apps/UAT_ingras/admin/install
    adgenjky.sh ; INSTE8_SETUP 1

    AutoConfig Setup Phase
    Running Setup Process 3 of 7 for AD_TOP
    File /data/oracle/R12/inst/apps/UAT_ingras/admin/install/txkConfigAppsOcm.pl not instantiated in the current pass, this file will not be executed
    AutoConfig Setup Phase
    Running Setup Process 4 of 7 for AD_TOP
    Executing script in InstantiateFile:
    /data/oracle/R12/inst/apps/UAT_ingras/admin/install/adgenjky.sh

    one more thing,

    is R12 patches are cumulative..?, i need to apply patch 9386653 now.

    patch readme.txt says

    Before Applying This Patch 1. Source the Applications environment file as the owner of the application
    tier file system.

    2. Stop the application server processes using the script adstpall.sh

    3. Apply patch R12.AD.A.delta.4 or higher if you have not already done so.do i need to apply R12.AD.A delta 4 patch then 9386653

    DB:2.85:Autoconfig Issues In R12 zj

    Sawwan,

    MT Autoconfig issue has been resolved after upgrading to latest Jre1.6 :) .

  • RELEVANCY SCORE 2.84

    DB:2.84:Autoconfig 71


    hello
    I am getting this when i ran adconfig.sh
    after applying following patch 5478710,4676589,
    [AutoConfig Error Report]
    The following report lists errors AutoConfig encountered during each
    phase of its execution. Errors are grouped by directory and phase.
    The report format is:
    filename phase return code where appropriate

    [APPLY PHASE]
    AutoConfig could not successfully execute the following scripts:
    Directory: /orapps11i/oravis/visdb/9.2.0/appsutil/install/VIS_oracle
    adcrobj.sh INSTE8_APPLY 1

    AutoConfig is exiting with status 1

    pls give idea or solution to resolve to issue

    Thanks/regs
    Sunil

    DB:2.84:Autoconfig 71

    Sunil,

    Does this mean it is no longer an issue? If yes, it would be great to share what you did to fix the issue with us.

    Thanks,
    Hussein

  • RELEVANCY SCORE 2.84

    DB:2.84:Re: R12 Installation Issue With Mks pa


    c:\mks\mksnt\which.exe

    DB:2.84:Re: R12 Installation Issue With Mks pa

    btw what is 'cl' ?E:\oracle\prodapplwhich cl
    C:\MSVC\BIN/cl.exe

    E:\oracle\prodapplcl
    Microsoft (R) 32-bit C/C++ Standard Compiler Version 12.00.8168 for 80x86
    Copyright (C) Microsoft Corp 1984-1998. All rights reserved.

    usage: cl [ option... ] filename... [ /link linkoption... ]

  • RELEVANCY SCORE 2.84

    DB:2.84:Auto Confing Throws Error 1d


    Hello

    When I ran auto config on database tier i am getting this issue what could be the reason
    I had install oracle apps R12 on windowsXp
    [AutoConfig Error Report]
    The following report lists errors AutoConfig encountered during each
    phase of its execution. Errors are grouped by directory and phase.
    The report format is:
    filename phase return code where appropriate

    [PROFILE PHASE]
    AutoConfig could not successfully execute the following scripts:
    Directory: C:\oracle\VIS\db\tech_st\11.1.0\appsutil\install\VIS_sunrise
    afdbprf.cmd INSTE8_PRF 1

    [APPLY PHASE]
    AutoConfig could not successfully execute the following scripts:
    Directory: C:\oracle\VIS\db\tech_st\11.1.0\appsutil\install\VIS_sunrise
    adcrobj.cmd INSTE8_APPLY 1

    when on appllcations i am getting auto config with erros
    AutoConfig Error Report]
    The following report lists errors AutoConfig encountered during each
    phase of its execution. Errors are grouped by directory and phase.
    The report format is:
    filename phase return code where appropriate

    [SETUP PHASE]
    AutoConfig could not successfully execute the following scripts:
    Directory: C:\oracle\VIS\inst\apps\VIS_sunrise\admin\install
    adgendbc.cmd INSTE8_SETUP 1
    afcpnode.cmd INSTE8_SETUP 1
    afgcsreg.cmd INSTE8_SETUP 1

    [PROFILE PHASE]
    AutoConfig could not successfully execute the following scripts:
    Directory: C:\oracle\VIS\inst\apps\VIS_sunrise\admin\install
    adadmprf.cmd INSTE8_PRF 1
    afadmprf.cmd INSTE8_PRF 1
    afcpctx.cmd INSTE8_PRF 1
    afcpgsm.cmd INSTE8_PRF 1
    igccmprf.cmd INSTE8_PRF 1
    jtfictx.cmd INSTE8_PRF 1
    okladmprf.cmd INSTE8_PRF 1
    txkJavaMailerCfg.cmd INSTE8_PRF 1
    txkWebServicescfg.cmd INSTE8_PRF 1

    AutoConfig is exiting with status 12

    thanks
    Sunil

    Edited by: RedRose on Jun 15, 2012 9:01 AM

    DB:2.84:Auto Confing Throws Error 1d

    I am getting error whenI trying to start addbctl.cmd through command mode, listerner error ORA12541.
    WhenI going to start Listner it is saying up and running already running addlnctl.cmd through this executable
    I need to configure any file for this i mean to say to set the file
    yesterday it was running fine with listener and database, whenI ran auto config i got erros on both nodes of apps and db that is why i iam asking to connect to my system.
    pls let me know Restart the machine and see if you can start the listener then.

    For the database, check the alert log file.

    Thanks,
    Hussein

  • RELEVANCY SCORE 2.84

    DB:2.84:Re: Autoconfig Exiting With Status 1 39


    With the following entries in context file autoconfig is completing successfully

    proxyhost oa_var="s_proxyhost"xxxxx-proxy.xxxxx.xxx.dom/proxyhost
    proxyport oa_var="s_proxyport"3128/proxyport
    proxybypassdomain oa_var="s_proxybypassdomain"xxxxx.xxx.dom/proxybypassdomain

    it fails when I remove the entries and run autoconfig

    proxyhost oa_var="s_proxyhost"/proxyhost
    proxyport oa_var="s_proxyport"/proxyport
    proxybypassdomain oa_var="s_proxybypassdomain"/proxybypassdomain

    DB:2.84:Re: Autoconfig Exiting With Status 1 39

    Do you see the same error message in AutoConfig log file? If yes, please log a SR.

    Thanks,
    Hussein

  • RELEVANCY SCORE 2.84

    DB:2.84:Re: Ebs R12 Dr Setup (Data Guard) zf


    You don't need to edit any file manually.Have you tried to deregister the application tier from the Net Services Topology Data Model and run AutoConfig then?TNS Connectivity With Database Breaks After Running Autoconfig (Doc ID 377764.1)Using AutoConfig to Manage System Configurations in Oracle E-Business Suite Release 12 (Doc ID 387859.1)Thanks,Hussein

    DB:2.84:Re: Ebs R12 Dr Setup (Data Guard) zf

    Thank you Hussein for your quick response and you are very knowledgable.

  • RELEVANCY SCORE 2.84

    DB:2.84:Autoconfig Is Exiting With Status 24 ax


    Hi,

    AutoConfig is exiting with status 24 ,cloning from multinode to single node

    afcmprf.sh INSTE8_PRF 1
    ahladmprf.sh INSTE8_PRF 1
    aradmprf.sh INSTE8_PRF 1
    bisadmprf.sh INSTE8_PRF 1
    bisdblrp.sh INSTE8_PRF 1
    clnadmprf.sh INSTE8_PRF 1
    cnadmprf.sh INSTE8_PRF 1
    cncmprf.sh INSTE8_PRF 1
    csdadmprf.sh INSTE8_PRF 1
    cseadmprf.sh INSTE8_PRF 1
    csiadmprf.sh INSTE8_PRF 1
    eamadmprf.sh INSTE8_PRF 1
    fteadmprf.sh INSTE8_PRF 1
    gladmprf.sh INSTE8_PRF 1
    igccmprf.sh INSTE8_PRF 1
    jtfadmprf.sh INSTE8_PRF 1
    okeadmprf.sh INSTE8_PRF 1
    okladmprf.sh INSTE8_PRF 1
    ontadmprf.sh INSTE8_PRF 1
    paadmprf.sh INSTE8_PRF 1
    txkJavaMailerCfg.sh INSTE8_PRF 1
    wipadmprf.sh INSTE8_PRF 1
    wshadmprf.sh INSTE8_PRF 1
    xnccmprf.sh INSTE8_PRF 1

    AutoConfig is exiting with status 24

    DB:2.84:Autoconfig Is Exiting With Status 24 ax

    Duplicate thread ...

    AutoConfig is exiting with status 24
    Re: AutoConfig is exiting with status 24

  • RELEVANCY SCORE 2.83

    DB:2.83:12.1.1 Fresh Installation Hang While Running Autoconfig On Apps Node 8k


    Hi All,
    I am installing 12.1.1 fresh installation which is multi-node installation. OS: OEL 5.4 64bit.
    Node-1 for DB, and the second node for Apps.

    I successfully installed the DB, but while running the rapidwiz on Apps Node, the progress bar was hung on following:
    1. Processing Step 2 of 3, running adrunat.sh
    2. and after unzipping around 1191 zip files, it's running AutoConfig on Apps Node

    I check from the adconfig.log, it's exiting with status 1 and following error reported:
    [CVM Error Report]
    The following report lists errors encountered during CVM Phase
    filename return code where appropriate
    /U01_TestAPP/TEST/apps/apps_st/appl/ad/12.0.0/bin/adgentns.pl -1

    From /etc/hosts, following list I have:
    127.0.0.1 localhost.localdomain localhost
    10.4.72.87 server-testdb.xxx-yyy.com server-testdb -- It's for the DB
    10.4.72.84 server-devdb.xxx-yyy.com server-devdb --- It's for the Applications

    Please help me to solve the Issue.

    Thanks,
    Deki

    DB:2.83:12.1.1 Fresh Installation Hang While Running Autoconfig On Apps Node 8k

    Hi Hussein,
    It's really helpful, I already tested the stage area using md5sum before, but not really sure before you gave me that link (Doc ID 452120.1). Wish you all the best in your life.

    Thanks,
    Deki

  • RELEVANCY SCORE 2.83

    DB:2.83:Rc-50014: Fatal: Execution Of Autoconfig Was Failed c1


    Dear All

    I am installing R12 on Windows server 2003. After successful message of pre-requisite (Utilities check), while installing the step 1 of 5, when 13% of installation is complete, I get this error: RW 50004 : Error code received when running external process.

    When I opened the log file ApplyDBTechStack____.log, following is written there:

    """"""""""""""""""""""""""""""""""""""""""""""""""""""""""""""""""""""""
    """"""""""""""""""""""""""""""""""""""""""""""""""""""""""""""""""""""""
    [AutoConfig Error Report]
    The following report lists errors AutoConfig encountered during each
    phase of its execution. Errors are grouped by directory and phase.
    The report format is:
    filename phase return code where appropriate

    [SETUP PHASE]
    AutoConfig could not successfully execute the following scripts:
    Directory: D:\oracle\VIS\db\tech_st\11.1.0\appsutil\install\VIS_r12
    adsvdlsn.cmd INSTE8_SETUP 9020

    AutoConfig is exiting with status 1

    RC-50014: Fatal: Execution of AutoConfig was failed
    Raised by oracle.apps.ad.clone.ApplyDBTechStack

    """"""""""""""""""""""""""""""""""""""""""""""""""""""""""""""""""""""""
    """"""""""""""""""""""""""""""""""""""""""""""""""""""""""""""""""""""""

    Please guide, what can be the issue?

    I shall be ever thankful to you.

    Regards

    DB:2.83:Rc-50014: Fatal: Execution Of Autoconfig Was Failed c1

    Dear Helios

    Thanks for your reply..... Let me try it and reply you...

    Regards

  • RELEVANCY SCORE 2.82

    DB:2.82:Rw-50015: Error ..Http Listener Is Not Responding fd


    Hi Experts,

    I'm a newbei to Oracle EBS R12, I was in a process of installing R12 (12.1.1.9 ) on Red Hat Enterprise Linux Server release 6.0 (64 bit).

    R12 Rapidwiz Postinstall Steps Http, Login page, Virtual directory, JSP, Help Page Fails with RW-50015

    After installation, the database checks were fine and the database listener processes are running fine.

    When i try to start the application services manually it show this error

    [applmgr@oracleupk scripts]$ ./adstrtal.sh

    You are running adstrtal.sh version 120.15

    Enter the APPS username: apps

    Enter the APPS password:

    adstrtal.sh: Database connection could not be established. Either the database is down or the APPS credentials supplied are wrong.

    USAGE: adstrtal.sh appsusername/appspassword

    adstrtal.sh: exiting with status 1

    I crosschecked apps credentials are right and database is up and running.
    SQL conn apps/*****
    Connected.
    SQL sho user
    USER is "APPS"

    I crosschecked Database and listener of D/B both are running.

    [oracle@oracleupk ~]$ ps -ef | grep tns
    oracle 13923 1 0 Apr05 ? 00:00:00 /u01/db_top/db/tech_st/11.1.0/bin/tnslsnr PROD -inherit

    SQL !ps -ef | grep smon
    oracle 5571 1 0 03:49 ? 00:00:01 ora_smon_PROD

    While trying to connect to sqlplus through applmgr user i get the following error.
    [applmgr@oracleupk PROD_oracleupk]$ sqlplus

    sqlplus: error while loading shared libraries: libclntsh.so.10.1: cannot open shared object file: No such file or directory

    I reviewed the installation doc to make sure all OS software packages and pre-req are installed as per [ID 761566.1]

    While investigating the issue, i found that the post install steps fails mainly because of missing gcc-* rpm package. But it is already installed in my case.

    [oracle@oracleupk ~]$ rpm -qa gcc*
    gcc-c++-4.4.7-3.el6.x86_64
    gcc-4.4.7-3.el6.x86_64

    I have followed these metalink notes but still issue persists, Please assist me so that i can finish up the installation before deadline. :(

    Adcfgclone Fails With Error While Loading Shared Libraries: libclntsh.so.10.1 [ID 736410.1]
    Installing Rel 12.0.4 Ebuisines Suite autoconfig fails with: sqlplus: error while loading shared libraries: libclntsh.so.10.1: cannot open shared object file: No such file or directory [ID 579254.1]

    DB:2.82:Rw-50015: Error ..Http Listener Is Not Responding fd

    978366 wrote:
    Thank you for ur responce.

    Actually I followed this MOS note to overcome the RW-50015 error.
    R12 Installation Post Steps: Apache Fails : RW-50015 Cannot Load Libphp4.So, Unresolved Symbols [ID 736689.1]

    Now all the app services are up and running.Thanks for sharing the solution.

  • RELEVANCY SCORE 2.82

    DB:2.82:Running Autoconfig mk


    Hi,

    OS:AIX6.1
    Oracle :11.2
    Apps: r12

    Before running autoconfig which configuration files are require to be backed up?

    regards,
    Vishwanath

    DB:2.82:Running Autoconfig mk

    Vishwanath wrote:
    Hi,

    OS:AIX6.1
    Oracle :11.2
    Apps: r12

    Before running autoconfig which configuration files are require to be backed up?None actually since you can rollback AutoConfig session.

    Using AutoConfig to Manage System Configurations in Oracle E-Business Suite Release 12 [ID 387859.1] -- 2.5. Rolling Back an AutoConfig Session

    Thanks,
    Hussein

  • RELEVANCY SCORE 2.82

    DB:2.82:Re: Autoconfig Is Exiting With Status 30 d1


    glibc.i686 2.5-107 installedThis is the 32-bit package.

    glibc.x86_64 2.5-107 installedThis is the 64-bit package.

    gcc.x86_64 4.1.2-54.el5 installedThis is the 64-bit package.

    I have also gone through the documents recommended by you and found everything as it should be all packages are installled. Still the issue persists ! :(What is your application release? OS?

    Thanks,
    Hussein

    DB:2.82:Re: Autoconfig Is Exiting With Status 30 d1

    Thanks Hussein and Alvaro for your help ! I will update once everything is up and working.

    Regards,
    Vinod

  • RELEVANCY SCORE 2.81

    DB:2.81:Adcfgclone.Pl On Appstier c8


    Hello All,

    Using r12 ebs with 11g DB.

    We clone out test instance and everytime when we start adcfgclone.pl appsTier on aplication side it error out with following error:

    log file of adcfgclone shows below error:

    [PROFILE PHASE]
    AutoConfig could not successfully execute the following scripts:
    Directory: /test/DB_oracle/admin/install
    afcpctx.sh INSTE8_PRF 137

    AutoConfig is exiting with status 1

    RC-50014: Fatal: Execution of AutoConfig was failed
    Raised by oracle.apps.ad.clone.ApplyApplTop
    ERROR: AutoConfig completed with errors. Check logfile at /test/inst/apps/DB_oracle/admin/log/ApplyAppsTier_06011113.log for details.
    ApplyApplTop Completed Successfully.

    # Checking the status of AutoConfig run of ApplyApplTop
    Warning : AutoConfig has completed with errors .
    Please review the AutoConfig section in the logfile. If required, you can re-run AutoConfig from command line after fixing the problem

    to workaround this we have to copy 10.1.2 HOME/lib32/libclntsh.so.10.1 from PROD to test instance in the same location and run autoconfig.

    After this workaround everything OK and I can proceed with post cloning steps.

    I just want to know where is the problem ? Is there any common mistake I am doing or this is any bug ?

    What would be the permanent solution of this cause.

    Thanks.

    DB:2.81:Adcfgclone.Pl On Appstier c8

    to workaround this we have to copy 10.1.2 HOME/lib32/libclntsh.so.10.1 from PROD to test instance in the same location and run autoconfig.Is there a difference between the file you have in the cloned instance and the one you copy over from prod (source instance) in terms of size?

    Was this file originally copied from the source instance? If yes, what was the command used?

    Do you have the latest AutoConfig and Rapid Clone patches applied?

    Thanks,
    Hussein

  • RELEVANCY SCORE 2.81

    DB:2.81:Autoconfig Error jd


    I am upgrading R12 database 10.2.0.4 to 11.2.0.1

    but while running autoconfig on database tier, I am getting below error

    --------------------------------------------------------------------------------------------------------------------------------------------------

    ORACLE_HOME : /u01/oracle/db_11/tech_st/11.2.0
    ORACLE_SID : TEST
    TWO_TASK :
    PATH : /u01/oracle/db_11/tech_st/11.2.0/perl/bin:/usr/bin::.
    Library Path : /u01/oracle/db_11/tech_st/11.2.0/lib:/usr/dt/lib:/usr/openwin/lib:/u01/oracle/db_11/tech_st/11.2.0/ctx/lib:/u01/oracle/db_11/tech_st/11.
    2.0/lib32

    SQLPLUS Executable : no sqlplus in /u01/oracle/db_11/tech_st/11.2.0/perl/bin /usr/bin . .

    adcrobj.sh exiting with status 1
    ERRORCODE = 1 ERRORCODE_END
    .end std out.
    /u01/oracle/db_11/tech_st/11.2.0/appsutil/install/TEST_test/adcrobj.sh: sqlplus: not found
    ----------------------------------------------------------------------------------------------------------------------------------------------------------

    Please suggest

    DB:2.81:Autoconfig Error jd

    gbite wrote:
    A new title born today - Doctor of Oracle.

    Hussein - I have to say you are always on point and wonder what will happen without you on this forum. Nobody is indispensable I agree but you are close to being indispensable :)Thanks for your kind words, I really appreciate it :)

    Thanks,
    Hussein

  • RELEVANCY SCORE 2.80

    DB:2.80:Autoconfig Error:Exiting With Status 1 z7


    Hiii,

    My apps version is 12.1.3 on windows 2003 server,

    When i run autoconfig, it completes with error, the following is the error im getting

    *[AutoConfig Error Report]*
    The following report lists errors AutoConfig encountered during each
    phase of its execution. Errors are grouped by directory and phase.
    The report format is:
    *filename phase return code where appropriate*

    *[PROFILE PHASE]*
    AutoConfig could not successfully execute the following scripts:
    Directory: E:\R12\inst\apps\CLONE_w-orcaleupgrade\admin\install
    afcpctx.cmd INSTE8_PRF 1

    AutoConfig is exiting with status 1

    The following is the information i got from logfile

    Executing script in InstantiateFile:
    E:\R12\inst\apps\CLONE_w-orcaleupgrade\admin\install\afcpctx.cmd
    script returned:
    ******************************************************
    Mon 12/12/2011
    *01:31 PM*
    ECHO is off.
    ECHO is off.
    *""*
    *"The environment settings are as follows ..."*
    *""*
    *" ORACLE_HOME : E:\R12\apps\tech_st\10.1.2"*
    *" ORACLE_SID : "*
    *" LOCAL : CLONE"*
    *" PATH : E:\R12\inst\apps\CLONE_w-orcaleupgrade\admin\scripts;E:\R12\apps\apps_st\appl\au\12.0.0\bin;E:\R12\apps\apps_st\appl\fnd\12.0.0\bin;E:\R12\apps\apps_st\appl\ad\12.0.0\bin;E:\R12\apps\tech_st\10.1.3\appsutil\jdk\jre\bin;E:\R12\apps\tech_st\10.1.3\perl\5.8.3\bin\MSWin32-x86-multi-thread\;E:\R12\apps\tech_st\10.1.3\appsutil\jdk\bin;E:\R12\apps\tech_st\10.1.2\bin;E:\R12\apps\tech_st\10.1.3\appsutil\jdk\bin;E:\R12\apps\tech_st\10.1.3\appsutil\jdk\jre\bin;E:\R12\apps\tech_st\10.1.3\perl\5.8.3\bin\MSWin32-x86-multi-thread\perl.exe;c:\VC98\Common7\IDE;c:\VC98\VC\BIN;c:\VC98\Common7\Tools;c:\VC98\Common7\Tools\bin;c:\VC98\VC\PlatformSDK\bin;c:\VC98\SDK\v2.0\bin;c:\WINDOWS\Microsoft.NET\Framework\v2.0.50727;c:\VC98\VC\VCPackages;E:\R12\inst\apps\CLONE_w-orcaleupgrade\admin\scripts;E:\R12\apps\apps_st\appl\au\12.0.0\bin;E:\R12\apps\apps_st\appl\fnd\12.0.0\bin;E:\R12\apps\apps_st\appl\ad\12.0.0\bin;E:\R12\apps\tech_st\10.1.3\appsutil\jdk\jre\bin;E:\R12\apps\tech_st\10.1.3\perl\5.8.3\bin\MSWin32-x86-multi-thread\;E:\R12\apps\tech_st\10.1.3\appsutil\jdk\bin;E:\R12\apps\tech_st\10.1.2\bin;E:\R12\apps\tech_st\10.1.3\appsutil\jdk\bin;E:\R12\apps\tech_st\10.1.3\appsutil\jdk\jre\bin;C:\MKS\mksnt;C:\WINDOWS;C:\WINDOWS\system32;E:\R12\apps\tech_st\10.1.2\OPatch;E:\R12\apps\tech_st\10.1.3\ant\bin;;E:\R12\apps\tech_st\10.1.2\OPatch;E:\R12\apps\tech_st\10.1.3\ant\bin"*
    *""*
    *""*
    *"Running FNDCPUCF"*
    *""*
    Enter the Username/Password:
    SQLPlus: Release 10.1.0.5.0 - Production on Mon Dec 12 13:31:57 2011*

    Copyright (c) 1982, 2005, Oracle. All rights reserved.

    Enter value for 1: Enter value for 2: Enter value for 3: Connected.

    COUNT()*
    ----------
    *6*

    Disconnected from Oracle Database 11g Enterprise Edition Release 11.1.0.7.0 - 64bit Production
    With the Partitioning, OLAP, Data Mining and Real Application Testing options
    ERRORCODE = 1 ERRORCODE_END
    *.end std out.*

    *.end err out.*

    Can anyone provide me a solution for this issue..

    Waiting for your replies

    Thankss in advance

    DB:2.80:Autoconfig Error:Exiting With Status 1 z7

    Please see these docs.

    AutoConfig Fails While Executing Afcpctx.sh: Check Log File Created By FNDCPUCF Program [ID 282232.1]
    perl adcfgclone.pl appsTier fails for afcpctx.sh - Could not load program FNDCPUCF [ID 453041.1]

    Thanks,
    Hussein

  • RELEVANCY SCORE 2.80

    DB:2.80:Rc-50014: Fatal: Execution Of Autoconfig Was Failed pk


    Dear Support Team,I am facing the below issue while performing the clone. Please advise.[AutoConfig Error Report]The following report lists errors AutoConfig encountered during each phase of its execution. Errors are grouped by directory and phase.The report format is: filename phase return code where appropriate [SETUP PHASE] AutoConfig could not successfully execute the following scripts: Directory: /u01/TEST/8004/inst/apps/TEST_HOSTNAME/admin/install adgendbc.sh INSTE8_SETUP 1 afcpnode.sh INSTE8_SETUP 1 afgcsreg.sh INSTE8_SETUP 1 txkWfClone.sh INSTALL_SETUP 1 [PROFILE PHASE] AutoConfig could not successfully execute the following scripts: Directory: /u01/TEST/8004/apps/tech_st/10.1.3/perl/bin/perl -I /u01/TEST/8004/apps/tech_st/10.1.3/perl/lib/5.8.3 -I /u01/TEST/8004/apps/tech_st/10.1.3/perl/lib/site_perl/5.8.3 -I /u01/TEST/8004/apps/apps_st/appl/au/12.0.0/perl -I /u01/TEST/8004/apps/tech_st/10.1.3/Apache/Apache/mod_perl/lib/site_perl/5.8.3/i686-linux-thread-multi /u01/TEST/8004/inst/apps/TEST_HOSTNAME/admin/scripts/adexecsql.pl sqlfile=/u01/TEST/8004/inst/apps/TEST_HOSTNAME/admin/install afwebprf.sql INSTE8_PRF 1 amscmprf.sql INSTE8_PRF 1 amswebprf.sql INSTE8_PRF 1 bisadmprf.sql INSTE8_PRF 1 bisdblrp.sql INSTE8_PRF 1 clnadmprf.sql INSTE8_PRF 1 cncmprf.sql INSTE8_PRF 1 cseadmprf.sql INSTE8_PRF 1 csfadmprf.sql INSTE8_PRF 1 csiadmprf.sql INSTE8_PRF 1 eamadmprf.sql INSTE8_PRF 1 fteadmprf.sql INSTE8_PRF 1 icxwebprf.sql INSTE8_PRF 1 oksfrmprf.sql INSTE8_PRF 1 wshadmprf.sql INSTE8_PRF 1 Directory: /u01/TEST/8004/inst/apps/TEST_HOSTNAME/admin/install adadmprf.sh INSTE8_PRF 1 admk80ln.sh INSTALL_PRF 1 afadmprf.sh INSTE8_PRF 1 afcpctx.sh INSTE8_PRF 1 afcpgsm.sh INSTE8_PRF 1 ibywebprf.sh INSTE8_PRF 1 igccmprf.sh INSTE8_PRF 1 jtfictx.sh INSTE8_PRF 1 okladmprf.sh INSTE8_PRF 1 txkJavaMailerCfg.sh INSTE8_PRF 1 txkWebServicescfg.sh INSTE8_PRF 1 [APPLY PHASE] AutoConfig could not successfully execute the following scripts: Directory: /u01/TEST/8004/apps/tech_st/10.1.3/perl/bin/perl -I /u01/TEST/8004/apps/tech_st/10.1.3/perl/lib/5.8.3 -I /u01/TEST/8004/apps/tech_st/10.1.3/perl/lib/site_perl/5.8.3 -I /u01/TEST/8004/apps/apps_st/appl/au/12.0.0/perl -I /u01/TEST/8004/apps/tech_st/10.1.3/Apache/Apache/mod_perl/lib/site_perl/5.8.3/i686-linux-thread-multi /u01/TEST/8004/inst/apps/TEST_HOSTNAME/admin/install adadmat.pl INSTE8_APPLY 1 AutoConfig is exiting with status 31RC-50014: Fatal: Execution of AutoConfig was failedRaised by oracle.apps.ad.clone.ApplyApplTopERROR: AutoConfig completed with errors. Check logfile at /u01/TEST/8004/inst/apps/TEST_HOSTNAME/admin/log/ApplyAppsTier_11171643.log for details.ApplyApplTop Completed Successfully.# Checking the status of AutoConfig run of ApplyApplTopWarning : AutoConfig has completed with errors . Please review the AutoConfig section in the logfile. If required, you can re-run AutoConfig from command line after fixing the problemRegardsMohammed Abdul Muqeet

    DB:2.80:Rc-50014: Fatal: Execution Of Autoconfig Was Failed pk

    This looks like a connectivity issue -- Please confirm that you can connect to the database remotely and your port is open.Thanks,Hussein

  • RELEVANCY SCORE 2.80

    DB:2.80:Re: Starting R12 Instance aj


    Hi,

    What is the env file you are sourcing?

    Did you run AutoConfig? If yes, did it complete successfully?

    Thanks,
    Hussein

  • RELEVANCY SCORE 2.80

    DB:2.80:Change Hostname R12 11i 38


    Hi

    We have 11i R12 vision instances.
    I have tried to change both to SSL using the following metalink docs

    Note:338003.1 How to change the hostname and/or port of the Database Tier using AutoConfig
    Note:341322.1 How to change the hostname of an Applications Tier using AutoConfig

    In case of R12 after i changed the hostname, the forms did not open from the frontend

    In case of R12 after i changed the hostname, when i tried bringing up I got the following errors

    adoacorectl.sh: exiting with status 204
    adformsctl.sh: exiting with status 204
    adapcctl.sh: exiting with status 150

    Where probably did i go wrong

    Thanks
    JIL

    DB:2.80:Change Hostname R12 11i 38

    You strongcould be/strong hitting this issue:

    OC4J Fails to startup with "ERROR Failed to set the internal configuration of the OC4J JMS Server" (Doc ID: Note:372412.1)

    oafm,forms and oacore not starting up after IP adress change (Doc ID: Note:412980.1)

  • RELEVANCY SCORE 2.79

    DB:2.79:Re: Custom_Top Doubts 7z


    Hi,

    I believe all the above are correct (for #4, I do not see any entry for the custom schema when running AutoConfig on my 11i/R12 instance).

    Regards,
    Hussein

    DB:2.79:Re: Custom_Top Doubts 7z

    Hi Hussain,

    I objective was to create custom_top and check whether it is wroking properly and request is getting picked by cocnurrent manager from the right location and concurrent manger can se this custom_top ,so after seeing this error it is confirmed that it is set properly so thats all

    Thanks for the help

    regards

  • RELEVANCY SCORE 2.79

    DB:2.79:Re: Autoconfig Is Exiting With Status 24 m1


    Database is up and running and also database listener.

    i can start/stop the listener and i am able to connect from application

    sqlplus apps/apps

    but in logfile it is giving me a TNS error

    DB:2.79:Re: Autoconfig Is Exiting With Status 24 m1

    tnsping TEST1 is working fineis this TEST or TEST1

    can you paste your output of the following from applications tier

    (a) $tnsping TEST

    (b) entries of /etc/hosts file

    (c) entries of $ORACLE_HOME/network/admin/SID_hostname/tnsnames.ora in Application Tier

  • RELEVANCY SCORE 2.78

    DB:2.78:Autoconfig Is Exiting With Status 5 c1


    Hi;

    I have R12.1.1 on OEL5. During post installation i had some error which were related to HTTP patch missing. After Installation i already appliedch than i can start my database and also autoconfig run wihtout any issue.

    When i try to run autoconfig on appstier to be sure all is okey it through below errors in log file
    [INSTANTIATE PHASE]
    AutoConfig could not successfully instantiate the following files:
    Directory: /d01/oracle/VIS/inst/apps/VIS_oracle/ora/10.1.3/j2ee/forms/config
    server.xml INSTE8

    Directory: /d01/oracle/VIS/inst/apps/VIS_oracle/ora/10.1.3/j2ee/oacore/application-deployments/oacore/html
    oracle-webservices.xml INSTE8

    Directory: /d01/oracle/VIS/inst/apps/VIS_oracle/ora/10.1.3/j2ee/oacore/config
    server.xml INSTE8

    Directory: /d01/oracle/VIS/inst/apps/VIS_oracle/ora/10.1.3/j2ee/oafm/application-deployments/default/AppsSOAAdapter
    oc4j-ra.xml INSTE8

    Directory: /d01/oracle/VIS/inst/apps/VIS_oracle/ora/10.1.3/j2ee/oafm/config
    server.xml INSTE8

    I do not find any related note in metalink. Question is anyone face similar issue before? Should i start installation from beginning?

    Thanks

  • RELEVANCY SCORE 2.77

    DB:2.77:Autoconfig 93


    Hi All,
    I s the feature of autoconfig run parallel mode in r12? .

    Regards,
    raj

    DB:2.77:Autoconfig 93

    Hi Raj;

    Please see:
    Power Tools: Running AutoConfig in Parallel in EBS 12
    http://blogs.oracle.com/stevenChan/entry/power_tools_autoconfig_parallel_runs_in_ebs12

    Also see:
    http://onlineappsdba.com/index.php/2010/04/15/reduce-autoconfig-downtime-parallel-run-profiler/

    Regard
    Helios

  • RELEVANCY SCORE 2.76

    DB:2.76:Autoconfig Error Jtfictx.Sh Inste8_Prf 71


    Hi,

    Any one can help me to resolve the issue. The below is the autoconfig log.

    [AutoConfig Error Report]
    The following report lists errors AutoConfig encountered during each
    phase of its execution. Errors are grouped by directory and phase.
    The report format is:
    filename phase return code where appropriate

    [PROFILE PHASE]
    AutoConfig could not successfully execute the following scripts:
    Directory: /backup/applerpp/erpp1/inst/apps/erpp1_erpp1/admin/install
    jtfictx.sh INSTE8_PRF 1

    AutoConfig is exiting with status 1

    Regards

    DB:2.76:Autoconfig Error Jtfictx.Sh Inste8_Prf 71

    Hi,

    Search AutoConfig for "jtfictx.sh", you should find more details about the error around this file name.

    Regards,
    Hussein

  • RELEVANCY SCORE 2.76

    DB:2.76:Install R12 Software Same Instance Same Port Pool, Etc. 1k


    I'm testing the R12 upgrade and have a question about installing the R12 software stack prior to the actual upgrade time. Example: Install the R12 software one weekend and then start and perform the actual upgrade the next weekend. My concern is the fact that the R12 installation runs autoconfig. Our plan is to install with the same instance name, database SID, port pool, etc. as the existing 11i instance but naturally install the R12 stack into a seperate file system (in our case a shared appltop) which would be completely seperate from the 11i tech stack, oraInventory, etc. I know this works because I've been through it before but my concern is that when R12 runs autoconfig it creates a new entry for each application server in the autoconfig tables so now you have two, one for 11i autconfig and one for R12 autoconfig. This is clear from looking at the AutoConfig page in OAM. I haven't encountered any issues in my trial runs doing this except that I've found it is better to stop the applications when running the R12 install because the autoconfig part will get additional errors because of the ports being in use because of the same port pool. My question is have others done this R12 install ahead of the actual upgrade period in this same manner and if so did any issues come up with the 11i instance that would have to be available and in production during the time between the R12 install and the actual start of the upgrade? Hope this makes sense.

  • RELEVANCY SCORE 2.76

    DB:2.76:Autoconfig Could Not Successfully Execute The Following Scripts Adsvalsn.Cm jj


    When i run the autoconfig, it end up with following error message:

    AutoConfig could not successfully execute the following scripts:
    Directory: E:\oracle\fincomn\admin\install\FIN_ora-fin
    adsvalsn.cmd INSTE8_APPLY -1

    AutoConfig is exiting with status 1

    ---------------------------------------------------------------------------------------------------------------
    And because of this error autoconfig takes more than an hour to complete. please help me

    regards

  • RELEVANCY SCORE 2.75

    DB:2.75:R12 Database Cloning With Error Ac-00423 / Rc-50014 dk


    Hi Friends.

    We have an R12.1.3 Application with 11gR2 database on a Sun Sparc solaris 10 machine.

    From production cold backups, we are trying to clone a new test instance. The cloning is failing while configuring Oracle Home in DB Tier.

    in the logs it shows:

    ####################################################################################

    instantiate file:

    source : /devnew/dbexec/fintestdb/11.2.0/appsutil/template/adcrdb.sh

    dest : /devnew/dbexec/fintestdb/11.2.0/appsutil/install/FINTEST_riysverp-004/adcrdb.sh

    backup : /devnew/dbexec/fintestdb/11.2.0/appsutil/install/FINTEST_riysverp-004/adcrdb.sh to /devnew/dbexec/fintestdb/11.2.0/appsutil/out/FINTEST_riysverp-004/01041024/adcrdb.sh

    setting permissions: 700

    setting ownership: devnewd:devnew

    **********

    AC-00423: Template file: /devnew/dbexec/fintestdb/11.2.0/appsutil/template/adcrdb.sh missing from file system.

    Raised by oracle.apps.ad.autoconfig.InstantiateProcess

    **********

    [AutoConfig Error Report]

    The following report lists errors AutoConfig encountered during each

    phase of its execution. Errors are grouped by directory and phase.

    The report format is:

    filename phase return code where appropriate

    [INSTANTIATE PHASE]

    AutoConfig could not successfully instantiate the following files:

    Directory: /devnew/dbexec/fintestdb/11.2.0/appsutil/install/FINTEST_riysverp-004

    adcrdb.sh INSTE8

    AutoConfig is exiting with status 1

    RC-50014: Fatal: Execution of AutoConfig was failed

    Raised by oracle.apps.ad.clone.ApplyDatabase

    StackTrace:

    java.lang.Exception: RC-50014: Fatal: Execution of AutoConfig was failed

    at oracle.apps.ad.clone.ApplyDatabase.checkAutoConfigErr(ApplyDatabase.java:3192)

    at oracle.apps.ad.clone.ApplyDatabase.runAutoConfig(ApplyDatabase.java:2985)

    at oracle.apps.ad.clone.ApplyDatabase.doConf(ApplyDatabase.java:522)

    at oracle.apps.ad.clone.ApplyDatabase.doApply(ApplyDatabase.java:473)

    at oracle.apps.ad.clone.ApplyDatabase.init(ApplyDatabase.java:366)

    at oracle.apps.ad.clone.ApplyDBTier.init(ApplyDBTier.java:110)

    at sun.reflect.NativeConstructorAccessorImpl.newInstance0(Native Method)

    at sun.reflect.NativeConstructorAccessorImpl.newInstance(NativeConstructorAccessorImpl.java:39)

    at sun.reflect.DelegatingConstructorAccessorImpl.newInstance(DelegatingConstructorAccessorImpl.java:27)

    at java.lang.reflect.Constructor.newInstance(Constructor.java:494)

    at oracle.apps.ad.clone.util.CloneProcessor.run(CloneProcessor.java:67)

    at java.lang.Thread.run(Thread.java:595)

    ############################################################################################

    As you can see in the log messages, it complains that the adcrdb.sh file is missing from the system.

    As per note 549872.1 this error could be resolved by copying the missing adcrdb.sh file from the source environment. However, we tried it and its not working for us. The copied file gets deleted somewhere during the cloning process and it again fails complaining that the adcrdb.sh file is missing

    Please help us in resolving this as its a bit urgent.

    Thanks.

    DB:2.75:R12 Database Cloning With Error Ac-00423 / Rc-50014 dk

    muneer.ngha.ksa wrote:
    the issue was resolved by running autoconfig and adpreclone on the source system.Thanks for the update and for sharing the solution!

    Hussein

  • RELEVANCY SCORE 2.75

    DB:2.75:Autoconfig Errors jk


    Hi,
    1-autoconfig on DB gives :
    adlsnodes.sh INSTE8
    adpreclone.pl INSTE8
    adstopdb.sql INSTE8
    adstrtdb.sql INSTE8
    AutoConfig is exiting with status 31
    Does it mean the error was only for adstrtdb.sql ? What means status 31

    2-also it says :
    Verifying existance of the table: ADX_PRE_AUTOCONFIG
    Table does not exist. Exiting RestoreProfile...
    What should we do ?

    Many thanks.

    DB:2.75:Autoconfig Errors jk

    Do you have the latest TXK AutoConfig Rollup patch applied (Patch 5985992)?

    adlsnodes.sh INSTE8
    adpreclone.pl INSTE8
    adstopdb.sql INSTE8
    adstrtdb.sql INSTE8Can you check if you have any other errors in the log file around those files?

  • RELEVANCY SCORE 2.74

    DB:2.74:Post Installation Error In R12 a9


    Hi Experts,

    Thanks for all your support,
    I installed oracle r12 (db in one hard disk and application in another hard disk) But i encountered two things
    failed in post install checks One is Jsp and another one login page. By the advice I run autoconfig file..It completed successfully. when i started services Except OC4J services remaining all are started.

    I encountered the following error for forms OC4J and OACORE OC4J,
    ERROR: Timed out (100000) :Interrupted Exception in oracle r12 Installation.

    please suggest me....

    Thanks Regard.

    Harish

    DB:2.74:Post Installation Error In R12 a9

    What is the OS?

    Please see these docs.

    R12 Rapidwiz Fails on Post Installation Tasks : RW-50016, Timed Out( 100000 ) [ID 437152.1]
    On R 12.1.1 Fresh Installation, POST RAPIDWIZ INSTALL CHECKS FAILS , Rapidwiz Ends With Error Jsp, Virtual Directory And Login Page Does Not Work RW-50016: Error: - {0} was not created: [ID 850264.1]
    Starting up AS10g services in an EBusiness Suite Release 12 environment [ID 743518.1]

    Thanks,
    Hussein

  • RELEVANCY SCORE 2.74

    DB:2.74:11.5.9 Installation Oel4up5 91


    Hi All,

    Please let me know if any one don 11.5.9 installation OEL4UP5.If done please send me the notes/docs.

    I am getting issues 2nd step

    [INSTANTIATE PHASE]
    AutoConfig could not successfully instantiate the following files:
    Directory: /ed02/ora1159/eldemodb/9.2.0/md/demo/orascv/doc
    OraSCV.asc INSTE8

    Directory: /ed02/ora1159/eldemodb/9.2.0/oem_webstage/readme
    emreadme.txt INSTE8

    Directory: /ed02/ora1159/eldemodb/9.2.0/relnotes/em
    README_EM.txt INSTE8

    Directory: /ed02/ora1159/eldemodb/9.2.0/sysman/doc/readme
    README_em.txt INSTE8

    AutoConfig is exiting with status 4

    Please help me in this issue.

    Thanks,
    Venkat.

    DB:2.74:11.5.9 Installation Oel4up5 91

    Hi,

    Can you find any errors in the CM log file?

    Did AutoConfig complete successfully?

    Please stop the CM, run cmclean.sql script (Note: 134007.1) and check then.

    Regards,
    Hussein

  • RELEVANCY SCORE 2.74

    DB:2.74:R12.1.1 Installation Error On Oracle Solaris 10 U9 - Sparc cs


    Hi All,

    I am trying to install E-Business suite R12.1.1 single node on Oracle Solaris 10 U9 sparc. The Installation completed with errors:

    I completed all pre-requisite steps from Oracle Applications Installation and Upgrade Notes Release 12 (12.1.1) for Sun Solaris SPARC (64-bit) [ID 761568.1]

    In Validate system configuration window:

    HTTP, Virtual directory, JSP, Login Page and Help page completed with errors:

    In Installation logfile the error message is :

    AutoConfig completed with errors.

    In autoconfig logfile:

    [SETUP PHASE]
    AutoConfig could not successfully execute the following scripts:
    Directory: /OrApps/appsR12/inst/apps/PROD_nadecerp/admin/install
    adgenjky.sh INSTE8_SETUP 1

    [PROFILE PHASE]
    AutoConfig could not successfully execute the following scripts:
    Directory: /OrApps/appsR12/inst/apps/PROD_nadecerp/admin/install
    afcpctx.sh INSTE8_PRF 137

    When i check further for these scripts:

    adgenjky.sh finished at Sun Oct 24 14:41:34 AST 2010
    adgenjky.sh exiting with status 1
    Log file is located at : /OrApps/appsR12/inst/apps/PROD_nadecerp/admin/log/PROD_nadecerpjkey.log
    ERRORCODE = 1 ERRORCODE_END
    .end std out.
    Killed
    Killed

    From PROD_nadecerpjkey.log:

    ld.so.1: adjkey: fatal: /OrApps/appsR12/apps/tech_st/10.1.2/lib/libclntsh.so.10.1: wrong ELF class: ELFCLASS64
    ld.so.1: adjkey: fatal: /OrApps/appsR12/apps/tech_st/10.1.2/lib/libclntsh.so.10.1: wrong ELF class: ELFCLASS64

    When i am trying to manually start opmnctl services its also completing with errors:

    10/24/10-14:50:13 :: adopmnctl.sh: Starting Oracle Process Manager (OPMN)

    libopmnoraclenls.so: unable to open library
    main: NLS initialization failed!!
    libopmnoraclenls.so: unable to open library
    main: NLS initialization failed!!
    libopmnoraclenls.so: unable to open library
    main: NLS initialization failed!!
    opmnctl: opmn start failed.

    10/24/10-14:50:14 :: adopmnctl.sh: exiting with status 2

    I found one metalink note simlar to this issue *413109.1* when i implement the action plan from MOS again one more error :(

    bash-3.00$ ./genclntsh -32
    cat: cannot open /OrApps/appsR12/apps/tech_st/10.1.3/lib32/ldflags
    Undefined first referenced
    symbol in file
    nnfhboot /OrApps/appsR12/apps/tech_st/10.1.3/lib32/libn10.a(nnfgt.o)
    nnflboot /OrApps/appsR12/apps/tech_st/10.1.3/lib32/libn10.a(nnfgt.o)
    nnflgapc /OrApps/appsR12/apps/tech_st/10.1.3/lib32/libnl10.a(nlpa.o)
    nnftboot /OrApps/appsR12/apps/tech_st/10.1.3/lib32/libn10.a(nnfgt.o)
    nnflgav /OrApps/appsR12/apps/tech_st/10.1.3/lib32/libnl10.a(nlol.o)
    nnflfrm /OrApps/appsR12/apps/tech_st/10.1.3/lib32/libnl10.a(nlol.o)
    nnflrne /OrApps/appsR12/apps/tech_st/10.1.3/lib32/libnl10.a(nlol.o)
    ntusini /OrApps/appsR12/apps/tech_st/10.1.3/lib32/libn10.a(ntcontab.o)
    ntpini /OrApps/appsR12/apps/tech_st/10.1.3/lib32/libn10.a(ntcontab.o)
    nttini /OrApps/appsR12/apps/tech_st/10.1.3/lib32/libn10.a(ntcontab.o)
    ntzini /OrApps/appsR12/apps/tech_st/10.1.3/lib32/libn10.a(ntcontab.o)
    ld: fatal: Symbol referencing errors. No output written to /OrApps/appsR12/apps/tech_st/10.1.3/lib32/libclntsh.so.10.1

    I also referred R12 installation on Solaris 10
    and some more similar threads but no hope.

    DB:2.74:R12.1.1 Installation Error On Oracle Solaris 10 U9 - Sparc cs

    Hi,

    Since none of those docs help, I would suggest you keep working on this issue with Oracle support.

    Thanks,
    Hussein

  • RELEVANCY SCORE 2.74

    DB:2.74:Cloning Issue xs


    hi,

    while cloning from a single node to another single node m/c I am facing the following issues...

    AutoConfig could not successfully execute the following scripts:
    Directory: /b02/demoap/apps/tech_st/10.1.3/perl/bin/perl -I /b02/demoap/apps/tech_st/10.1.3/perl/lib/5.8.3 -I /b02/demoap/apps/tech_st/10.1.3/perl/lib/site_perl/5.8.3 -I /b02/demoap/apps/apps_st/appl/au/12.0.0/perl -I /b02/demoap/apps/tech_st/10.1.3/Apache/Apache/mod_perl/lib/site_perl/5.8.3/i686-linux-thread-multi /b02/demoap/inst/apps/CRP3_prod/admin/install
    txkExecSetJaznCredentials.pl INSTE8_APPLY 255
    txkGenDefaultEnv.pl INSTE8_APPLY 255

    AutoConfig is exiting with status 2

    RC-50014: Fatal: Execution of AutoConfig was failed
    Raised by oracle.apps.ad.clone.ApplyApplTop
    ERROR: AutoConfig completed with errors. Check logfile at /b02/demoap/inst/apps/CRP3_prod/admin/log/ApplyAppsTier_06171610.log for details.
    ApplyApplTop Completed Successfully.

    # Checking the status of AutoConfig run of ApplyApplTop

    Warning : AutoConfig has completed with errors .
    Please review the AutoConfig section in the logfile. If required, you can re-run AutoConfig from command line after fixing the problem

    adcfgclone on db tier ran successfully...but issue is with apps tier

    platform:
    RHEL - 5
    and 12.0.6

    plz help

    DB:2.74:Cloning Issue xs

    Annex,

    Search the log file for "txkExecSetJaznCredentials.pl", you should find more details about the error around the file name.

    Thanks,
    Hussein

  • RELEVANCY SCORE 2.74

    DB:2.74:Apps Pwd Change pz


    Hi,
    Can any one explain me why Oracle recommends to run autoconfig after Apps password change in R12..when it is not updated in any files(like wdbsvr.app and cgicmd.dat in 11i)

    DB:2.74:Apps Pwd Change pz

    Hi,

    You need to run AutoConfig so the apps password will be propagated correctly.

    Error Unable To Connect To Oracle Applications Database 'afscpgcs' After Cloning An APPS Instance Changing APPS Passwords [ID 788706.1]

    If you do not have the apps password you cannot use FNDCPASS -- See these docs for details (esp the first doc).

    How to Troubleshoot Login Issue After Changing APPS Password Using FNDCPASS Utility [ID 809155.1]
    How to Change and Which Apps Database Users Passwords Can Be Changed in a Multi-Node Apps Installation? [ID 303621.1]
    How to Change Applications R12 Passwords using Applications Schema Password Change Utility (FNDCPASS)? [ID 437260.1]

    Thanks,
    Hussein

  • RELEVANCY SCORE 2.73

    DB:2.73:Errors While Starting Apps R12 ?? jd


    adapcctl.sh: exiting with status 150

    adalnctl.sh: exiting with status 2

    adstrtal.sh: Exiting with status 130

    i run the autoconfig and database is up and running,.

    thanks
    vijay

    DB:2.73:Errors While Starting Apps R12 ?? jd

    cherukuri wrote:
    TNS-12502: TNS:listener received no CONNECT_DATA from clientDo you get this error when you start the database listener? If yes, please see these docs.

    Listener.log contains many TNS-12502: TNS:listener received no CONNECT_DATA from client (TNS-12502) [ID 422931.1]
    TNS-12521 / TNS-12502 and service_died Reported in the Listener Log [ID 1307275.1]
    TNS-12514,TNS-12523,TNS-12528,J000 died kkjcre1p: unable to spawn jobq slave process [ID 756389.1]
    TroubleShooting Guide For ORA - 12502 TNS:listener received no CONNECT_DATA from client [ID 453505.1]

    The database listener should be able to start the application services and run AutoConfig on the apps tier node.

    Thanks,
    Hussein

  • RELEVANCY SCORE 2.73

    DB:2.73:Can't Run Strtal 3a


    Hi,
    For EBS R12, When running Autocfg, it said some errors got and then I could not run strtal like

    AutoConfig completed with errors.
    [oracle@hpi5 scripts]$ sh adstrtal.sh apps/???

    You are running adstrtal.sh version 120.15

    adstrtal.sh: Database connection could not be established. Either the database is down or the APPS credentials supplied are wrong.

    USAGE: adstrtal.sh appsusername/appspassword

    adstrtal.sh: exiting with status 1

    Why?

    Many Thanks Best Regards,
    HuaMin

    DB:2.73:Can't Run Strtal 3a

    Hi Hua,

    I see this error in the log:

    Exception occurred: java.sql.SQLException: ORA-28000: the account is lockedPlease unlock apps/applsys accounts as follows then run AutoConfig again.

    $ sqlplus / as sysdba

    SQL alter user apps account unlock;

    SQL alter user applsys account unlock;Thanks,
    Hussein

  • RELEVANCY SCORE 2.73

    DB:2.73:Questions About "Configure And Start Server Processes" Step During R12 Upgrade p7


    There is a step listed in the 11i to 12.1.1 upgrade guide, the "Configure and start server processes". it looks like includes two parts, run autoconfig in database tire and run the rapid install second time.so I do have two question here:1. looks like the second rapid install is just autoconfig, so can I just run autoconfig instead of the second rapid install?2. which one goes first? autoconfig in database or rapid install? Thanks

  • RELEVANCY SCORE 2.73

    DB:2.73:Autoconfig Is Exiting With Status 1 On Adgendbc.Sh Inste8_Setu da


    Dear All,

    We Installed single node Fresh R12.1.1 on RHEL 5.8

    Installation went fine did not get any error messages

    But after Installation Concurrent managers are not Starting Up Getting you don't have enough resources to start managers please contact "System Administrator".

    So I Shutdown applications and ran Autoconfig on DB side first and then Application side

    At DB level it got completed with out any issues but at application level got the below error message

    "AutoConfig is exiting with status 1 on adgendbc.sh INSTE8_SETUP 1"

    Also I checked Autoconfig fails when running adgendbc.cmd with Error :DBC generation failed [ID 392811.1] this metalink note it for R11.5.10.2 not R12.1.1

    Also please confirm we can not keep hostname of RHEL server more than 30 characters as per the metalink note "413164.1" what is the minimun characters we can keep,Currently we kept 6 characters i.e testdb that will cause this issue

    Please suggest how to proceed firther

    Thanks in Advance

    Edited by: 925263 on 5 Jun, 2012 3:54 AM

    DB:2.73:Autoconfig Is Exiting With Status 1 On Adgendbc.Sh Inste8_Setu da

    Listener is listening from the host 127.0.0.1 but it should has to listen 10.10.10.14 ipaddress or host name testdb

    Please let me know where to change the that one at application levelIn the listener.ora file under $TNS_ADMIN directory.

    Thanks,
    Hussein

  • RELEVANCY SCORE 2.73

    DB:2.73:Psot Clone Script Failed With Error : Rc-50014: Fatal: Execution Of Autoconfig Was Failed jx


    Hi ALL :Environment description: HP-UNIX Itanium Servers V2 : 11.23Oracle APPS Version : 12.1.1Database version 10.2.0.5Issue description :Clone done on DB successfullywhile doing post clone on APPS Tier it failed =====LOG File=====AutoConfig is exiting with status 31RC-50014: Fatal: Execution of AutoConfig was failedRaised by oracle.apps.ad.clone.ApplyApplTopERROR: AutoConfig completed with errors. Check logfile at /apps/APPS_TMOF2/inst/apps/PRD_rmsadm2/admin/log/ApplyAppsTier_10281317.log for details.ApplyApplTop Completed Successfully.# Checking the status of AutoConfig run of ApplyApplTopWarning : AutoConfig has completed with errors .Please review the AutoConfig section in the logfile. If required, you can re-run AutoConfig from command line after fixing the problem=====E N D===========Note :Unable to login to db-tier from app tier I tried to execute Auto config manually :AutoConfig completed with errors.After checking log file :AutoConfig is exiting with status 29 Seems that i;m not able to access DB from any oracle app/utilityCan someone help meThanks a LotHesham ELBanna

    DB:2.73:Psot Clone Script Failed With Error : Rc-50014: Fatal: Execution Of Autoconfig Was Failed jx

    Hi ALL :Environment description: HP-UNIX Itanium Servers V2 : 11.23Oracle APPS Version : 12.1.1Database version 10.2.0.5Issue description :Clone done on DB successfullywhile doing post clone on APPS Tier it failed =====LOG File=====AutoConfig is exiting with status 31RC-50014: Fatal: Execution of AutoConfig was failedRaised by oracle.apps.ad.clone.ApplyApplTopERROR: AutoConfig completed with errors. Check logfile at /apps/APPS_TMOF2/inst/apps/PRD_rmsadm2/admin/log/ApplyAppsTier_10281317.log for details.ApplyApplTop Completed Successfully.# Checking the status of AutoConfig run of ApplyApplTopWarning : AutoConfig has completed with errors .Please review the AutoConfig section in the logfile. If required, you can re-run AutoConfig from command line after fixing the problem=====E N D===========Note :Unable to login to db-tier from app tier I tried to execute Auto config manually :AutoConfig completed with errors.After checking log file :AutoConfig is exiting with status 29 Seems that i;m not able to access DB from any oracle app/utilityCan someone help meThanks a LotHesham ELBanna

  • RELEVANCY SCORE 2.73

    DB:2.73:Esb-R12 Forms Service (Adformsctl.Sh) Exiting With Status 204 sp


    My EBS two services not start gives following errors ;Executing service control script:/u01/oracle/PROD/inst/apps/PROD_ebs-prod/admin/scripts/adformsctl.sh startscript returned:****************************************************You are running adformsctl.sh version 120.12Starting OPMN managed FORMS OC4J instance ...adformsctl.sh: exiting with status 204---------------------------------------------------------------------------------here i mention that i have already clean the persistence folders also run autoconfig but problem still not solve, any one guide me ?????ThanksAsif

    DB:2.73:Esb-R12 Forms Service (Adformsctl.Sh) Exiting With Status 204 sp

    Asif,Was this working before? Any changes been done recently?Are there any errors in $INST_TOP/logs/appl/admin/log/adformsctl.txt?Any errors in the DB log file?What is the output of "adopmnctl.sh status"?Thanks,Hussein

  • RELEVANCY SCORE 2.72

    DB:2.72:Re: Ne Services In R12 cf


    Hi,

    All installation log files.

    Regards,
    Hussein

    DB:2.72:Re: Ne Services In R12 cf

    Hi,

    Yah that is compulsary,I dont know why the document is telling like this.

    Any way thanks..

    Regards

  • RELEVANCY SCORE 2.72

    DB:2.72:Basic Doubt About Autoconfig.. fa


    Hai all,

    As I am new to AppsDBA, I have a very basic doubt about autoconfig. please clarify....

    1. To run Autoconfig on dbTier AppsTier, both tier services should be UP.

    2. Whenever I run autoconfig on one Tier, is it mandatory to run on other tier also?

    3. Could you please give a good link to install a printer in Apps R12.(on windows2003)

    thanks all

    Edited by: userR12 on Nov 18, 2009 11:41 PM

    DB:2.72:Basic Doubt About Autoconfig.. fa

    Thanks for your instant reply on above query. Autoconfig was succesful on DBTier, But when run AppsTier it is giving error. Please take a look at the following log. (Just posted errors here from log file)
    ----------------------------------------------------------------------------------
    ....
    ....
    Configuring OCM in : D:\oracle\VIS\inst\apps\VIS_oraapps\ocm\10.1.2\
    Executing: D:\oracle\VIS\inst\apps\VIS_oraapps\ocm\10.1.2\\ccr\bin\setupCCR -s 123456 abc@abc.com US

    ** Installing base package **
    Deploying core - Version 10.2.4.0.0

    ** Registering installation with Oracle Configuration Manager server(s) **
    Failure in registering with Oracle Configuration Manager server
    Error connecting to server
    peer not authenticated

    Script Exit Code: 255

    OCM configuration failed for : D:\oracle\VIS\inst\apps\VIS_oraapps\ocm\10.1.2\

    OCM configuration failed on mid tier.
    -------------------------
    ....
    ....
    Cannot find j2se15010.exe, please place this file under the D:\oracle\VIS\apps\apps_st\comn\webapps\oacore\util\jinitiator\ directory.
    adgenjky.cmd exiting with status 9009
    ERRORCODE = 9009 ERRORCODE_END
    .end std out.
    'cp' is not recognized as an internal or external command,
    operable program or batch file.

    ....
    ....
    -------------------
    ....
    ....
    [ ICX_REQ_SERVER ]
    Application Id : 178
    Profile Value : oraapps.mod.com:8000
    Level Name : SITE
    INFO: Error updating/creating profile option value.
    ....
    ....
    --------------------
    ....
    ....
    [AutoConfig Error Report]
    The following report lists errors AutoConfig encountered during each
    phase of its execution. Errors are grouped by directory and phase.
    The report format is:
    filename phase return code where appropriate

    [SETUP PHASE]
    AutoConfig could not successfully execute the following scripts:
    Directory: D:\oracle\VIS\inst\apps\VIS_oraapps\admin\install
    adgenjky.cmd INSTE8_SETUP 9009

    AutoConfig is exiting with status 1

    Thanks

    * It would be more useful if you can start a blog for new aspiring apps DBAs.*

    Edited by: userR12 on Nov 19, 2009 1:44 AM

  • RELEVANCY SCORE 2.72

    DB:2.72:Re: Rc-50014: Fatal: Execution Of Autoconfig Was Failed mm


    Hi,Hussein

    The error occoure the same as above

    ****************************************************

    Product Top Drivers executed : AD_TOP FND_TOP ICX_TOP IEO_TOP ABM_TOP ECX_TOP BIS_TOP GL_TOP AMS_TOP CCT_TOP WSH_TOP CLN_TOP OKE_TOP OKL_TOP OKS_TOP CSF_TOP XNC_TOP IGS_TOP IBY_TOP PA_TOP JTF_TOP MWA_TOP CN_TOP CSI_TOP WIP_TOP CSE_TOP EAM_TOP IMT_TOP FTE_TOP ONT_TOP AR_TOP AHL_TOP OZF_TOP IES_TOP CSD_TOP IGC_TOP

    [AutoConfig Error Report]
    The following report lists errors AutoConfig encountered during each
    phase of its execution. Errors are grouped by directory and phase.
    The report format is:
    filename phase return code where appropriate

    [APPLY PHASE]
    AutoConfig could not successfully execute the following scripts:
    Directory: /test/tmptest/tmpap/testora/iAS/Apache/perl/bin/perl -I /test/tmptest/tmpap/testora/iAS/Apache/perl/lib/5.00503 -I /test/tmptest/tmpap/testora/iAS/Apache/perl/lib/site_perl/5.005 -I /test/tmptest/tmpap/testappl/au/11.5.0/perl /test/tmptest/tmpap/testcomn/admin/install/TEST_erp-dev
    txkGenExtSecConf.pl INSTE8_APPLY 1

    AutoConfig is exiting with status 1

    RC-50014: Fatal: Execution of AutoConfig was failed
    Raised by oracle.apps.ad.clone.ApplyApplTop

    Thanks
    gavin

    DB:2.72:Re: Rc-50014: Fatal: Execution Of Autoconfig Was Failed mm

    Hi,

    I saw the Metalink Note:1186394.1.
    But I can not download the patch, it is because Oracle does not provide downloads

    Thanks!
    gavin

  • RELEVANCY SCORE 2.72

    DB:2.72:Re: How To Setup Metalink Credentials In R12 d1


    hi Hussein,

    I referred the given note and edited the context file and ran autoconfig.

    But i am receiving the following error.

    Metalink Userid
    Unable to connect to Metalink. Please enter a valid Metalink userid and password. Please also check if the Web Proxy Setup information is correct.
    * Metalink Password

    * Email
    This email address will be used for querying Metalink.

    DB:2.72:Re: How To Setup Metalink Credentials In R12 d1

    THIS IS A BUG - U THINK THESE GUYS WOULD HAVE FIXED THIS - If your password is has uppercase the OCM does not connect - metalink forces you now to use upper and lowe case - I WILL OPEN AN SR

  • RELEVANCY SCORE 2.72

    DB:2.72:Autoconfig Is Exiting With Status 1 Adchknls.Pl After Upgrade To 11.2.0.3 3k


    Dear Experts,

    Kindly note that i have upgraded the the database to 11.2.0.3.

    I am getting the below error ?

    AutoConfig could not successfully execute the following scripts:
    Directory: /u01/d01/db/tech_st/11.2.0/perl/bin/perl -I /u01/d01/db/tech_st/1 1.2.0/perl/lib/5.8.3 -I /u01/d01/db/tech_st/11.2.0/perl/lib/site_perl/5.8.3 -I / u01/d01/db/tech_st/11.2.0/appsutil/perl /u01/d01/db/tech_st/11.2.0/appsutil/scri pts/TEST_dba1
    adchknls.pl INSTE8_SETUP 1

    AutoConfig is exiting with status 1

    Please advise.

    Mohammed Abdul Muqeet

    DB:2.72:Autoconfig Is Exiting With Status 1 Adchknls.Pl After Upgrade To 11.2.0.3 3k

    Please search AutoConfig log file for "adchknls.pl" and you should find more details about the error.

    Please also see if (11i: AMP Clone fails for 'adchknls.pl' with error: 'Can't locate Config.pm in @INC [ID 885173.1]) helps.

    Thanks,
    Hussein

  • RELEVANCY SCORE 2.72

    DB:2.72:Autoconfig Error After 11g Db Upgrade From 10.2.0.4 dm


    Hi All,

    I encountered the below error after successful upgrade of Database from 10.2.0.4 to 11.1.0.7:

    Environment:

    OS --- Sun OS 5.10 sparc
    apps --- 11.5.10.2 single node Installation

    [AutoConfig Error Report]
    The following report lists errors AutoConfig encountered during each
    phase of its execution. Errors are grouped by directory and phase.
    The report format is:
    filename phase return code where appropriate

    [PROFILE PHASE]
    AutoConfig could not successfully execute the following scripts:
    Directory: /db/data/dbase/11.1.0/product/11.1.0/11g_home/appsutil/install/testnew_nadecerp
    afdbprf.sh INSTE8_PRF 1

    [APPLY PHASE]
    AutoConfig could not successfully execute the following scripts:
    Directory: /db/data/dbase/11.1.0/product/11.1.0/11g_home/appsutil/install/testnew_nadecerp
    adcrobj.sh INSTE8_APPLY 1
    txkcreateACL.sh INSTE8_APPLY 1

    AutoConfig is exiting with status 3

    All the upgrade steps went smooth as per doc id *452783.1*, now the issue is with autoconfig.

    On search i found thread i think which is similar to my issue http://kr.forums.oracle.com/forums/thread.jspa?messageID=2503189

    As at the time of 11g installation the group sepcifed was other, later i changed the $ORACLE_BASE ownership to dba group, can this be a cause?

    Any inputs on this issue greatly appreciated.

    Thanks in advance.

    DB:2.72:Autoconfig Error After 11g Db Upgrade From 10.2.0.4 dm

    Hi,

    you can apply Patch 9535311

    ====
    Using AutoConfig to Manage System Configurations with Oracle Applications 11i [ID 165195.1]
    ====

    Don't forget Define the PERL5LIB environment variable

    On the Application Tier:

    PERL5LIB=IAS_ORACLE_HOME/Apache/perl/lib/5.00503:
    IAS_ORACLE_HOME/Apache/perl/lib/site_perl/5.005:AU_TOP/perl

    export PERL5LIB

    On an 11i instance with 11gR2 Database, the perl version on the database tier is '5.10.0'. So the variable 'PERL5LIB' on the 11gR2 database tier needs to be set as follows:

    ORACLE_HOME/perl/lib/5.10.0:ORACLE_HOME/perl/lib/site_perl/5.10.0:ORACLE_HOME/appsutil/perl

    export PERL5LIB

    Thanks!

  • RELEVANCY SCORE 2.72

    DB:2.72:Autoconfig Could Not Successfully Execute The Following Scripts Afcpnode.Cm pp


    When i run the autoconfig, it end up with following error message:

    [AutoConfig Error Report]
    The following report lists errors AutoConfig encountered during each
    phase of its execution. Errors are grouped by directory and phase.
    The report format is:
    filename phase return code where appropriate

    [SETUP PHASE]
    AutoConfig could not successfully execute the following scripts:
    Directory: d:\oracle\prodcomn\admin\install\PROD_oraprod
    afcpnode.cmd INSTE8_SETUP 1

    [PROFILE PHASE]
    AutoConfig could not successfully execute the following scripts:
    Directory: d:\oracle\prodcomn\admin\install\PROD_oraprod
    afcpgsm.cmd INSTE8_PRF 1

    AutoConfig is exiting with status 2

    this error is comming after running the FNDCPASS utility to change apps and other schema password. i also changed the password for sys and system and remote_login_passwordfile parameter is set to exclusive. This error is comming on application node. On Database node there is no error.

    Thanls and Regards

    DB:2.72:Autoconfig Could Not Successfully Execute The Following Scripts Afcpnode.Cm pp

    I think i should raise a SRI would suggest this also. You may also try to change the apps password to less than 17 characters, and run AutoConfig again.

  • RELEVANCY SCORE 2.71

    DB:2.71:Unable To Connect Opmn After R12 Installation x9


    Hello,

    After R12 getting error

    exiting with status 204

    /oracle/R12/dev/inst/apps/dev_devserver/logs/appl/admin/log/adoafmctl.txt

    Please guide me

    Edited by: user9376205 on Apr 11, 2011 10:48 PM

    DB:2.71:Unable To Connect Opmn After R12 Installation x9

    Hello,

    After R12 getting error

    exiting with status 204

    /oracle/R12/dev/inst/apps/dev_devserver/logs/appl/admin/log/adoafmctl.txt

    Please guide me

    Edited by: user9376205 on Apr 11, 2011 10:48 PM

  • RELEVANCY SCORE 2.70

    DB:2.70:Autoconfig With Netca 7k


    On apps R12 db 11g

    If we generate listener configuration files using "netca", its generating two listener files by name 1) listener.ora and 2) endpoints_listener.ora

    Where as when we run autoconfig, it generates only one listener.ora file (expected behavior).

    What we are looking for is, how we can customize listener templates / XML etc to achieve the functionality provided by "netca" ie on running autoconfig, it should generate both listener files... 1) listener.ora and
    2) endpoints_listener.ora.

    DB:2.70:Autoconfig With Netca 7k

    Hi,

    But when you configure the listener using "NETCA" it is creating multiple listener files.It creates one at a time, and you have the option to close the wizard or create additional listener(s).

    We are not generating manually but oracle tool "NETCA" generating as a new 11g feature may be which I am not sure of...What is the old ORACLE_HOME release? Copy the listener.ora from the old $TNS_ADMIN directory to the new one and start the listener. Or, use netca to create one listener.

    Thanks,
    Hussein

  • RELEVANCY SCORE 2.70

    DB:2.70:Discoverer In Ebs R12 za


    Is discoverer10g included in EBS R12 installation?

    DB:2.70:Discoverer In Ebs R12 za

    gadba wrote:
    Is discoverer10g included in EBS R12 installation?No, and you have to install it separately -- Using Discoverer 10.1.2 with Oracle E-Business Suite Release 12 [ID 373634.1]

    Please note that Discoverer 11g is certified with R12

    Discoverer 11.1.1.4 Certified with E-Business Suite
    http://blogs.oracle.com/stevenChan/entry/discoverer_11114_ebs

    Using Discoverer 11.1.1 with Oracle E-Business Suite Release 12 [ID 1074326.1]

    Thanks,
    Hussein

  • RELEVANCY SCORE 2.70

    DB:2.70:How To Re-Create Only Httpd.Conf In-Case It Is Lost kz


    E-Business suite: 11i/R12

    How to re-create only 1 application configuration file in-case it is lost.
    For ex. How to re-create only httpd.conf In-case it is lost.

    As i know If we run autoconfig we can get it back and it updates all the configuration files.
    But, is there any way to create specific file, without brinnging down the services.

    DB:2.70:How To Re-Create Only Httpd.Conf In-Case It Is Lost kz

    Hi;

    How to re-create only 1 application configuration file in-case it is lost.
    For ex. How to re-create only httpd.conf In-case it is lost.AFAIK the only way is to use backup.Check google there are some link mention your question but i can not find exact solution. So I suggest rise SR and confirm wiht support while waiting other user response here

    Regard
    Helios

  • RELEVANCY SCORE 2.69

    DB:2.69:Post Installation Error Oracle R12 xx


    Hi all,

    Thanks for all your support,
    I installed oracle r12 (db in one hard disk and application in another hard disk) But i encountered two things
    failed in post install checks One is Jsp and another one login page. By the advice I run autoconfig file..It completed successfully. when i started services Except OC4J services remaining all are started.

    I encountered the following error for forms OC4J and OACORE OC4J,
    ERROR: Timed out (100000) :Interrupted Exception in oracle r12 Installation.

    please suggest me....

    Thanks Regard.

    Harish

    Edited by: 805567 on Feb 14, 2011 5:14 AM

    DB:2.69:Post Installation Error Oracle R12 xx

    Installation related question must be posted in {forum:id=64} forum

  • RELEVANCY SCORE 2.69

    DB:2.69:Multi Node Clone. s1


    Hi hussein/helios

    I am cloning my Apps tier to another node (apps2 server) but I got this error:

    [AutoConfig Error Report]
    The following report lists errors AutoConfig encountered during each
    phase of its execution. Errors are grouped by directory and phase.
    The report format is:
    filename phase return code where appropriate

    [SETUP PHASE]
    AutoConfig could not successfully execute the following scripts:
    Directory: /u01/applprod/PROD/inst/apps/PROD_apps2/admin/install
    adgendbc.sh INSTE8_SETUP 1

    AutoConfig is exiting with status 1

    RC-50014: Fatal: Execution of AutoConfig was failed
    Raised by oracle.apps.ad.clone.ApplyApplTop
    ERROR: AutoConfig completed with errors. Check logfile at /u01/applprod/PROD/inst/apps/PROD_apps2/admin/log/ApplyAppsTier_03120502.log for details.
    ApplyApplTop Completed Successfully.

    # Checking the status of AutoConfig run of ApplyApplTop
    Warning : AutoConfig has completed with errors .
    Please review the AutoConfig section in the logfile. If required, you can re-run AutoConfig from command line after fixing the problemI found out that the hostname for the DB Tier on the other node was incorrect rdbms1.abc.com instead of rdbms1.pci.com

    I check the rdbms1 server /etc/hosts but it has correct entry 192.168.10.211 rdbms1.pci.com rdbms1
    The apps2 server /etc/hosts is 192.168.26.226 apps2.abc.com apps2
    Why did it copy the domain of apps2 for the dbTier? abc.com

    Please help....Thanks a lot

    MsK

    DB:2.69:Multi Node Clone. s1

    Hi,

    Fix the entry in the hosts file and see if you get the same error.

    The hosts file will never be updated by any Oracle processes -- Check the file time stamp to confirm.

    Regards,
    Hussein

  • RELEVANCY SCORE 2.69

    DB:2.69:Autoconfig Steps, Any Document Where Its Is Mentioned 89


    Autoconfig steps, any document where its is mentioned what all steps are followed when adautocfg.sh context name is run ??

    R12

    DB:2.69:Autoconfig Steps, Any Document Where Its Is Mentioned 89

    Autoconfig steps, any document where its is mentioned what all steps are followed when adautocfg.sh context name is run ??I believe those steps/details are not documented.

    You may also see (Autoconfig FAQ [ID 218089.1]).

    Thanks,
    Hussein

  • RELEVANCY SCORE 2.68

    DB:2.68:Re: Installation R12 On Oel 5.5 f1


    Hello

    Thanks Hsawwan

  • RELEVANCY SCORE 2.68

    DB:2.68:Installation Ebs R12 93


    is it possible to installed EBS R12 on external harddisk??

    DB:2.68:Installation Ebs R12 93

    Hi
    is it possible to installed EBS R12 on external harddisk??Yes its possible, but as Hussein Sawwan mention you can have some performance issue wiht it. Also you have to check size of installation(demo and fresh has different installation size) and you have to decide your external hd size. ( I prefer to use 500 Gb 2,5")

    Regard
    Helios

  • RELEVANCY SCORE 2.67

    DB:2.67:C++ In R12 zs


    is C++ needed only in the starting of installation

    or is it used towards the completion .

    i used a vc++ 2005 express edition

    but towards the end website , http , help errors are displayed .

    but i am able to do autoconfig on database tier
    but the applicatio tier ends with error .

    or is it the operating systm compatibility error

  • RELEVANCY SCORE 2.67

    DB:2.67:Re: Autoconfig Fails After Cloning On R12 1k


    Hello HusseinAnd when we should rum cmclean and the relink commands...Please adviseKam

  • RELEVANCY SCORE 2.67

    DB:2.67:Error While Running Adconfig a9


    We are doing EBS R12.1.1 with 11gR2 database OS platform migration from Solaris Sparc 10(64 bit) to RHEL 5.6 (64 bit),
    we are following Oracle documents :-
    Export/import process for R12 using 11gR1 or 11gR2 [ID 741818.1]
    Application Tier Platform Migration with Oracle E-Business Suite Release 12 [ID 438086.1]

    We are facing issue during Application Tier Platform Migration for following step :-
    Section 2: Migration Tasks 7.Run AutoConfig setup phase on the Target System

    Executing script in InstantiateFile:
    /u01/app/applmgr/inst/apps/PRD_sebs01/admin/install/adgenjky.sh
    script returned:
    ****************************************************

    adgenjky.sh started at Thu Aug 23 04:31:35 PDT 2012

    Creating the key
    Error while creating keys
    Error while running keytool

    adgenjky.sh finished at Thu Aug 23 04:31:36 PDT 2012
    adgenjky.sh exiting with status 1
    Log file is located at : /u01/app/applmgr/inst/apps/PRD_sebs01/admin/log/PRD_sebs01jkey.log
    ERRORCODE = 1 ERRORCODE_END
    .end std out.
    /u01/app/applmgr/inst/apps/PRD_sebs01/admin/install/adgenjky.sh: line 192: createKeysCerUsingJava: command not found

    .end err out.

    .....
    .......

    [AutoConfig Error Report]
    The following report lists errors AutoConfig encountered during each
    phase of its execution. Errors are grouped by directory and phase.
    The report format is:
    filename phase return code where appropriate

    [SETUP PHASE]
    AutoConfig could not successfully execute the following scripts:
    Directory: /u01/app/applmgr/inst/apps/PRD_sebs01/admin/install
    adgenjky.sh INSTE8_SETUP 1

    AutoConfig is exiting with status 1

    AutoConfig execution completed on Thu Aug 23 04:31:50 2012

    Time taken for AutoConfig execution to complete : 0 mins 36 secs

    DB:2.67:Error While Running Adconfig a9

    Do you have the latest AutoConfig patches applied? -- Using AutoConfig to Manage System Configurations in Oracle E-Business Suite Release 12 [ID 387859.1]

    Thanks,
    Hussein

  • RELEVANCY SCORE 2.67

    DB:2.67:R12 Autoconfig 1f


    Hi All,

    I have some doughs Regarding Autoconfig in R12.

    1) When we run autoconfig in check mode, Which template need to be modified for customizations.
    Ex: for httpd.conf which is the template file httpd_conf_1013.tmp or httpd_ux_ias1022.conf

    2) How to find out the template file in R12 is the same way as in 11i
    grep -i Header httpd.conf ?

    3) if all Environment files are in $INST_TOP, what is the use of having same env files in other locations.
    For Ex: httpd.conf is present in $INST_TOP/ora/10.1.3/Apache/Apache/conf
    also in $APACHE_TOP/Apache/Apache/conf

    Thanks
    Srini

    DB:2.67:R12 Autoconfig 1f

    Hi,

    Please see if the following documents help.

    Note: 218089.1 - Autoconfig FAQ
    Note: 270519.1 - Customizing an AutoConfig Environment

    Maintaining Oracle Applications Documentation Set
    http://download.oracle.com/docs/cd/B53825_03/current/html/docset.html

    Regards,
    Hussein

  • RELEVANCY SCORE 2.67

    DB:2.67:Cloning Issue ad


    Hi,

    I want to clone a single tier environment to a n tier environment (on one computer I have apps tier and one another the DB tier). All was ok, but when I run

    perl adcfgclone.pl appsTier i get the following message:

    Skipping the starting of services
    INFO : Rapid Clone completed successfully , but the AutoConfig run recorded some errors.
    Please review the AutoConfig section in the logfile. If required, you can re-run AutoConfig from command line after fixing the problem
    Once Autoconfig issue is fixed , you can start services

    I run AutoConfig and I get the following error:

    ##########################################################################
    Generate Tns Names
    ##########################################################################
    Logfile: /Clone/visappl/admin/apps1_localhost/log/09290941/NetServiceHandler.log
    Classpath : /Clone/util/java/1.4/j2sdk1.4.2_04/jre/lib/rt.jar:/Clone/util/java/1.4/j2sdk1.4.2_04/lib/dt.jar:/Clone/util/java/1.4/j2sdk1.4.2_04/lib/tools.jar:/Clone/java/appsborg2.zip:/Clone/java

    Updating s_tnsmode to 'generateTNS'
    UpdateContext exited with status: 0
    java.lang.Exception: Error while generating listener.ora.
    at oracle.apps.ad.tools.configuration.NetServiceHandler.generate806Listener(NetServiceHandler.java:2487)
    at oracle.apps.ad.tools.configuration.NetServiceHandler.processNode(NetServiceHandler.java:2267)
    at oracle.apps.ad.tools.configuration.NetServiceHandler.main(NetServiceHandler.java:2962)
    AC-50480: Internal error occurred: java.lang.Exception: Error while generating listener.ora.
    Error generating tnsnames.ora from the database, temperory tnsnames.ora will be generated using templates
    Instantiating Tools tnsnames.ora
    Tools tnsnames.ora instantiated
    Web tnsnames.ora instantiated

    adgentns.pl exiting with status 512
    ERRORCODE = 512 ERRORCODE_END
    .end std out.

    .end err out.

    Result : FAILED

    ..........

    [AutoConfig Error Report]
    The following report lists errors AutoConfig encountered during each
    phase of its execution. Errors are grouped by directory and phase.
    The report format is:
    filename phase return code where appropriate

    [SETUP PHASE]
    AutoConfig could not successfully execute the following scripts:
    Directory: /Clone/admin/install/apps1_localhost
    adgendbc.sh INSTE8_SETUP 1

    AutoConfig is exiting with status 1

    Any ides?

    Thanks,
    Paul

    DB:2.67:Cloning Issue ad

    I applied one ... but older :( I will apply this one too :)

    Could anybody tell me what 8.0.6 Listener is used for?

    Thanks,
    Paul

  • RELEVANCY SCORE 2.67

    DB:2.67:Rc-50014: Fatal: Execution Of Autoconfig Was Failed 9m


    During cloning (R12) from Production to Development i am getting an error message when i am running adcfglone.pl on Dbtier....using the xml file.

    RC-50014: Fatal: Execution of AutoConfig was failed

    ERROR while running Apply...
    Mon Dec 27 07:33:10 2010

    ERROR: Failed to execute /ddb02/oradev/BWDEV/db/tech_st/11.2.0/appsutil/clone/bin/adclone.pl

    Log file says ::

    end err out.
    ****************************************************

    [AutoConfig Error Report]
    The following report lists errors AutoConfig encountered during each
    phase of its execution. Errors are grouped by directory and phase.
    The report format is:
    filename phase return code where appropriate

    [APPLY PHASE]
    AutoConfig could not successfully execute the following scripts:
    Directory: /ddb02/oradev/BWDEV/db/tech_st/11.2.0/appsutil/install/BWDEV_bwerpdev07
    txkcreateACL.sh INSTE8_APPLY 1

    AutoConfig is exiting with status 1

    RC-50014: Fatal: Execution of AutoConfig was failed
    Raised by oracle.apps.ad.clone.ApplyDatabase

    Edited by: 815654 on Dec 26, 2010 8:49 PM

    DB:2.67:Rc-50014: Fatal: Execution Of Autoconfig Was Failed 9m

    APPS realted please post in

    General EBS Discussion

    this is specific to DATABASE-GENERAL, close the thread here.

    Thanks

  • RELEVANCY SCORE 2.66

    DB:2.66:Re: Autoconfig Failed as


    What is the error code you get at the end of AutoConfig session? If it is 0 and it says AutoConfig completed successfully then you should be good.Thanks,Hussein

    DB:2.66:Re: Autoconfig Failed as

    HI All,ebs 12.1.3rac 11gr2 2 nodesQuestion: where it get value # 1 and # 2 values below fromSQLPLUS Executable : /u01/oracle/TEST/apps/tech_st/10.1.2/bin/sqlplusSQL*Plus: Release 10.1.0.5.0 - Production on Sat Sep 28 09:43:21 2013Copyright (c) 1982, 2005, Oracle. All rights reserved.Enter value for 1: Enter value for 2: Enter value for 3: ERROR:ORA-12502: TNS:listener received no CONNECT_DATA from clientError encountered while running /u01/oracle/TEST/inst/apps/TEST1_test2/admin/install/amscmprf.sqlERRORCODE = 1 ERRORCODE_END.end std out.even when it failed. the log file shown "the procedure completed successfully and committed"and when open log file for the sql that caused error in this case amscmprf.sql ( the log file always said the procedure completed successfully and committed)Can you please give me an advice?Thanks in advance.

  • RELEVANCY SCORE 2.66

    DB:2.66:Re: Autoconfig Related a9


    Hello,
    restore.sh .

    In R12 its working..in 11i its not working..

    Thanks,
    928714.

    DB:2.66:Re: Autoconfig Related a9

    You should also be able to use OAM, set the value back to what it was before, and run autoconfig.

  • RELEVANCY SCORE 2.66

    DB:2.66:Updating S_Tnsmode To 'Generatetns' -- Ac-50480: Internal Error Occurred: ax


    HI

    Updating s_tnsmode to 'generateTNS'
    UpdateContext exited with status: 0
    AC-50480: Internal error occurred: java.lang.Exception: Error while generating listener.ora.
    Error generating tnsnames.ora from the database, temporary tnsnames.ora will be generated using templates
    Instantiating Tools tnsnames.ora
    Tools tnsnames.ora instantiated
    Web tnsnames.ora instantiated

    adgentns.pl exiting with status 2
    ERRORCODE = 2 ERRORCODE_ENDOS: RHEL 5 64bit
    EBS : R12.1.3

    After cloning of EBS R12 instance using RMAN backup based restoration we found this error during autoconfig AND adstrall.sh is exiting with status 1.

    plz help.

    DB:2.66:Updating S_Tnsmode To 'Generatetns' -- Ac-50480: Internal Error Occurred: ax

    oraDBAebsR12 wrote:
    AC-50480 Error Generating the listener.ora File. [ID 1089036.1]
    During Autoconfig adgentns.pl fails: AC-50480: Internal error occurred: java.lang.Exception:
    Error while generating listener.ora [ID 453901.1]Thanks for the update and for sharing the solution.

    Thanks,
    Hussein