• RELEVANCY SCORE 6.27

    DB:6.27:Fatal Error Installing Photoessential 3.5 da




    Get "MSI.HPPhotoEssential" fatal error message when trying to load Photo Essential 3.5

    DB:6.27:Fatal Error Installing Photoessential 3.5 da

    Get "MSI.HPPhotoEssential" fatal error message when trying to load Photo Essential 3.5

  • RELEVANCY SCORE 2.73

    DB:2.73:Eerror Code 0x80070643 - Fatal Error During Installation When Installing .Net Framework 4 j7




    Log says that

    OS Version = 5.1.2600, Platform 2, Service Pack 3
    OS Description = WinXP - x86 Professional Service Pack 3

  • RELEVANCY SCORE 2.63

    DB:2.63:Microsoft .Net Framework 4 Not Installing Fatal Error During Installation On Windows Xp fk


    Hey guys,
    Microsoft .net framework wont install on my new installed windows xp service pack 3 (2002). Please help me.
    Error log is given below.

    OS Version = 5.1.2600, Platform 2, Service Pack 3
    OS Description = WinXP - x86 Professional Service Pack 3

    DB:2.63:Microsoft .Net Framework 4 Not Installing Fatal Error During Installation On Windows Xp fk

    Hi,

    Have you tried running Windows Update Scan for Updates
    Install all security updates
    May require a reboot
    You might also verify updates to NetFramework which will be offered through Windows Update

    Download the file and save it to your desktop
    http://www.microsoft.com/en-us/download/details.aspx?id=17851
    Close all open Windows/Applications
    Right click on the file and select Run As Administrator

  • RELEVANCY SCORE 2.56

    DB:2.56:Php 5.1.2, Horde Db_Mysql As Array Fatal Error 1m





    I was getting the following error:

    Code:

    DB:2.56:Php 5.1.2, Horde Db_Mysql As Array Fatal Error 1m







    Originally posted by atomicturtle
    is this using my php 5.1 rpms or something you rolled on your own?

  • RELEVANCY SCORE 2.52

    DB:2.52:Getting Errors During Installing Cs6 Master Collection On Windows 8 j7



    Everytime when i'm installing the collection, I recieve an error.

    It says:

    Exit Code: 7

    Please see specific errors and warnings below for troubleshooting. For example, ERROR: DS003, DW050 ... WARNING: DW066 ...

    -------------------------------------- Summary --------------------------------------

    - 3 fatal error(s), 111 error(s), 92 warning(s)

    Already used the cleaner by Adobe.

    Rebooted my computer aswell and also closed all applications at my desktop.

    Someone knows what to do?

    Kind regards

    DB:2.52:Getting Errors During Installing Cs6 Master Collection On Windows 8 j7


    you can hope for the best, rerun the cleaner, restart your computer and then reinstall using compatibility mode (win 7 sp1).

    if that fails you'll need to check your install logs: http://helpx.adobe.com/creative-suite/kb/troubleshoot-install-logs-cs5-cs5.html

  • RELEVANCY SCORE 2.50

    DB:2.50:Error Installing Acrobat X Pro fj



    I was installing Adobe Creative Suite 6 - Design Standard. I got an error message that Acrobat X Pro did not install. I tried installing Acrobat again and got the following error message:

    Exit Code: 6 Please see specific errors and warnings below for troubleshooting. For example, ERROR: DW050 ... WARNING: DW066 ... -------------------------------------- Summary -------------------------------------- - 0 fatal error(s), 3 error(s), 1 warning(s) WARNING: DW066: OS requirements not met for {AC76BA86-1033-F400-7760-000000000005} Acrobat Professional 10.0.0.0 ----------- Payload: {AC76BA86-1033-F400-7760-000000000005} Acrobat Professional 10.0.0.0 ----------- ERROR: Error 1935.An error occurred during the installation of assembly component {9718BF1D-6A9F-3406-A992-630F7EF2F164}. HRESULT: 0x80070BC9. ERROR: Install MSI payload failed with error: 1603 - Fatal error during installation. MSI Error message: Error 1935.An error occurred during the installation of assembly component {9718BF1D-6A9F-3406-A992-630F7EF2F164}. HRESULT: 0x80070BC9. ERROR: DW050: The following payload errors were found during install: ERROR: DW050: - Acrobat Professional: Install failed

    DB:2.50:Error Installing Acrobat X Pro fj


    Errors "Exit Code: 6," "Exit Code: 7"

    Mylenium

  • RELEVANCY SCORE 2.49

    DB:2.49:Installing Centos 5.4 Onto Pavilion Dv6 Laptop ps



    Attempting to install CentOS 5.4 64bit onto my HP Pavilion dv6 pc. Get a "kernel panic - not syncing: fatal execption" error after the initial CentOS screen.

    Anyone get there Pavilion to load CentOS?

    thanks

    DB:2.49:Installing Centos 5.4 Onto Pavilion Dv6 Laptop ps


    looked on the CentOS forum sights, and every other place i could find on the web. No Joy! I'm coming to the conclusion that there is something about CentOS (and RedHat 5 btw) that doesn't work on the Pavilion dv6. I attemted Ubuntu, it worked just fine.

    Going back to ...hack, sputter.... Windows 7, the original install with VMware to run LInux.

  • RELEVANCY SCORE 2.49

    DB:2.49:Error-Rc-20200: Fatal: Could Not Find Unzip 88


    Hi all,

    I am installing 12.1.1 in Oracle linux 6.1 server 64bit, while starting rapidwiz getting error

    "RC-20200: Fatal: Could not find Unzip. At this time only Native UnZip 5.X is supported.

    Please make sure you have UnZip 5.X in your path and try again...

    Unable to complete install of database

    RW-50010: Error: - script has returned an error: 1
    RW-50004: Error code received when running external process

    i am straggling for last two day, pleas help me move forward.

    Thanks a lot...

    Regard
    KSURESH

    DB:2.49:Error-Rc-20200: Fatal: Could Not Find Unzip 88

    You will need the unzip(1) RPM package. Install it from the distribution media, http://public-yum.oracle.com, or http://linux.oracle.com; your choice.

  • RELEVANCY SCORE 2.47

    DB:2.47:Having Trouble Installing Rosetta Stone 7z


    I am having trouble installing Rosetta Stone TotalE. After the installation I get the error Fatal Error #2124.

    DB:2.47:Having Trouble Installing Rosetta Stone 7z

    http://success.rosettastone.com/articles/en_US/Video/VIDEO-Fatal-Application-Err or-2124-Mac/?q=fatal+error+2124l=en_USfs=Searchpn=1

  • RELEVANCY SCORE 2.46

    DB:2.46:Installation Error , Installing Core Features Fatal Error 3m


    DB:2.46:Installation Error , Installing Core Features Fatal Error 3m

    Thanks for sharing the solution.
    Regards,
    Barry Wang
    We are trying to better understand customer views on social support experience, so your participation in this interview project would be greatly appreciated if you have time. Thanks for helping make community forums a great place.

    Click
    HERE to participate the survey.

  • RELEVANCY SCORE 2.46

    DB:2.46:Fatal Error Encountered During Self-Extraction Weblogic sd


    during installing the weblogic server step in oracle fusion applications installation i faced this error
    fatal error encountered during self-extraction weblogic [invalid stored block lengths]

    DB:2.46:Fatal Error Encountered During Self-Extraction Weblogic sd

    It seems like WLS package you downloaded is corrupted. Try download it again on edelivery.oracle.com

    Kinds,
    Gabriel Abelha

  • RELEVANCY SCORE 2.46

    DB:2.46:Getting Error At 5/43 When Installing Tizen Sdk For Werable 83


    Hi, I'm getting the below error message when installing Tizen sdk for wearable.
    Fatal error occured while executing install script. (certificate-generator package)
    I'm using windows 7 home premium 32 bit.
    I've installed java in prior
    Kindly post me a suggestion.
    Thanks

    DB:2.46:Getting Error At 5/43 When Installing Tizen Sdk For Werable 83

    the below link was relevant to me. thanks

    This content has been quoted from Parashurama.Govinds thought.
    check all the prerequisites are install properly
    also find the below link for your reference.https://developer.tizen.org/forums/sdk-ide/fatal-error-occurred-while-executing-install-script-wearable-sdk-installation

  • RELEVANCY SCORE 2.46

    DB:2.46:Getting Error At 5/43 When Installing Tizen Sdk For Werable sm


    Hi, I'm getting the below error message when installing Tizen sdk for wearable.
    Fatal error occured while executing install script. (certificate-generator package)
    I'm using windows 7 home premium 32 bit.
    I've installed java in prior
    Kindly post me a suggestion.
    Thanks

    DB:2.46:Getting Error At 5/43 When Installing Tizen Sdk For Werable sm

    the below link was relevant to me. thanks

    This content has been quoted from Parashurama.Govinds thought.
    check all the prerequisites are install properly
    also find the below link for your reference.https://developer.tizen.org/forums/sdk-ide/fatal-error-occurred-while-executing-install-script-wearable-sdk-installation

  • RELEVANCY SCORE 2.46

    DB:2.46:Avamar Exchange 2010 Dag Backup Errors xa



    Hello,

    We configured our DAG cluster yesterday and when i ran an on demand backup i got this below errors any one has any idea about these errors

    2013-05-29 19:52:42 avtar FATAL 5372: 0: 0x01f37f30 (Log #1)2013-05-29 19:52:42 avtar FATAL 5372: 1: 0x3fb9c55c (Log #1)2013-05-29 19:52:42 avtar FATAL 5372: 2: 0x3fbeeb4d (Log #1)2013-05-29 19:52:42 avtar FATAL 5372: 3: 0x3fbf08d0 (Log #1)2013-05-29 19:52:42 avtar FATAL 5372: 4: 0x3fb5d2cd (Log #1)2013-05-29 19:52:42 avtar FATAL 0378: nbackmain - Windows structured exception ACCESS_VIOLATION in threadID 10136 (Log #1)2013-05-29 19:52:42 avtar FATAL 5372: 5: 0x3fb610b7 (Log #1)2013-05-29 19:52:42 avtar FATAL 5372: 6: 0x3fb61aa4 (Log #1)2013-05-29 19:52:42 avtar FATAL 5372: 7: initADEFlags()+0x14f5c5 [0x3fed54a5] (Log #1)2013-05-29 19:52:42 avtar FATAL 5372: 8: 0x3fb257c8 (Log #1)2013-05-29 19:52:42 avtar FATAL 5372: 9: 0x3fb31f9f (Log #1)2013-05-29 19:52:42 avtar FATAL 5372: 10: BaseThreadInitThunk()+0xd [0x778f652d] (Log #1)2013-05-29 19:52:42 avtar FATAL 5372: 11: RtlUserThreadStart()+0x21 [0x77b2c521] (Log #1)2013-05-29 19:52:42 avexvss Error 7759: Unable to successfully process snapview workorder (Log #3)2013/05/29-23:52:42.30800 avtar DEBUG-ERROR 0378 nbackmain - Windows structured exception ACCESS_VIOLATION in threadID 10136 (Log #1)2013/05/29-23:52:42.40100 avtar DEBUG-ERROR 5372 0: 0x01f37f30 (Log #1)2013/05/29-23:52:42.41700 avtar DEBUG-ERROR 5372 7: initADEFlags()+0x14f5c5 [0x3fed54a5] (Log #1)2013/05/29-23:52:42.41700 avtar DEBUG-ERROR 5372 8: 0x3fb257c8 (Log #1)2013/05/29-23:52:42.41700 avtar DEBUG-ERROR 5372 9: 0x3fb31f9f (Log #1)2013/05/29-23:52:42.41700 avtar DEBUG-ERROR 5372 10: BaseThreadInitThunk()+0xd [0x778f652d] (Log #1)2013/05/29-23:52:42.41700 avtar DEBUG-ERROR 5372 11: RtlUserThreadStart()+0x21 [0x77b2c521] (Log #1)2013/05/29-23:52:42.41700 avtar DEBUG-ERROR 5372 1: 0x3fb9c55c (Log #1)2013/05/29-23:52:42.41700 avtar DEBUG-ERROR 5372 2: 0x3fbeeb4d (Log #1)2013/05/29-23:52:42.41700 avtar DEBUG-ERROR 5372 3: 0x3fbf08d0 (Log #1)2013/05/29-23:52:42.41700 avtar DEBUG-ERROR 5372 4: 0x3fb5d2cd (Log #1)2013/05/29-23:52:42.41700 avtar DEBUG-ERROR 5372 5: 0x3fb610b7 (Log #1)2013/05/29-23:52:42.41700 avtar DEBUG-ERROR 5372 6: 0x3fb61aa4 (Log #1)

    DB:2.46:Avamar Exchange 2010 Dag Backup Errors xa


    Alexis / Bonnu06,

    Thanks for the update. Is the bug fix included in SP1 or is it an out-of-bound patch?

    Thanks,

    -Ed

  • RELEVANCY SCORE 2.45

    DB:2.45:Getting Fatal Error Message While Installing Printer Hplaserjet 6500 s8



    Hi. I am getting Fatal error message after installing my printer Laserjet 6500 wireless, tried to re install the same message is coming out.

    DB:2.45:Getting Fatal Error Message While Installing Printer Hplaserjet 6500 s8


    Hi Nyakunga,

    I am not finding a Laserjet 6500. Can you verify the model number of you printer?

    What is the operating system on your computer?

    What fatal error code are you getting?

  • RELEVANCY SCORE 2.44

    DB:2.44:Getting Error At 5/43 When Installing Tizen Sdk For Werable md


    Hi, I'm getting the below error message when installing Tizen sdk for wearable.
    Fatal error occured while executing install script. (certificate-generator package)
    I'm using windows 7 home premium 32 bit.
    I've installed java in prior
    Kindly post me a suggestion.
    Thanks

    DB:2.44:Getting Error At 5/43 When Installing Tizen Sdk For Werable md

    the below link was relevant to me. thanks

    This content has been quoted from Parashurama.Govinds thought.
    check all the prerequisites are install properly
    also find the below link for your reference.https://developer.tizen.org/forums/sdk-ide/fatal-error-occurred-while-executing-install-script-wearable-sdk-installation

  • RELEVANCY SCORE 2.43

    DB:2.43:Thread: How To Troubleshoot Msi Bundle Fatal Error 79


    Hi All,

    I have repackaged an existing Zenworks 3 AXT file into an MSI.

    When the Bundle containing the MSI is opened from the desktop, I receive a message Error Installing NETSOFT.MSI. Fatal error during installation.

    I looked in the zmd-messages.log file in the local store and noted an [ERROR] MSI_ERR_1603, but couldn\'t see what caused it.

    Any insight would be greatly appreciated.

    Thanks in advance,

    Pam

    DB:2.43:Thread: How To Troubleshoot Msi Bundle Fatal Error 79

    Craig,

    Our eDIR LDAP object points to our AD server that uses identity manager. I\'m not sure where to add the LDAP mappings.

    Can you point me in the right direction?

    Thanks

    Pam

  • RELEVANCY SCORE 2.43

    DB:2.43:Fatal Error While Re-Installing Psc 1402 Aio fj



    Getting a fatal error message when i try reinstalling my OLD Hp PSC 1402 AIO, the printer was working well till about last week when it encountered spooling error, need help.

    DB:2.43:Fatal Error While Re-Installing Psc 1402 Aio fj


    Getting a fatal error message when i try reinstalling my OLD Hp PSC 1402 AIO, the printer was working well till about last week when it encountered spooling error, need help.

  • RELEVANCY SCORE 2.43

    DB:2.43:C4640 Fatal Error 89



    I've tried installing this printer 3 times now and it isn't working. Each time it gets to the installation process it says it's unable to write to D:\HP or D:HP\bin. Why it's even installing to the D drive is a mystery because I never specified it to. I've followed the instructions given, even removing the services at startup. No luck.

    Any suggestions would be great.

    DB:2.43:C4640 Fatal Error 89


    I'm not sure what kind of error message you had gotten. I am trying to install a printer driver and I am also getting a fatal error message. My message has to do with windows installer. I am going to try and created another profile. Thanks, maybe something so simple may work.

  • RELEVANCY SCORE 2.43

    DB:2.43:Build Error In Microsoft Visual C++ 2010 Express ! zc


    When I Want Built My Project Its Fail/Error .
    Its Say :
    1------ Build started: Project: juwendivb, Configuration: Release Win32 ------
    1 Base.cpp
    1Base.cpp(2): fatal error C1083: Cannot open include file: 'd3dx9.h': No such file or directory
    1 d3dfont.cpp
    1d3dfont.cpp(3): fatal error C1083: Cannot open include file: 'D3DX9.h': No such file or directory
    1 d3dmenu.cpp
    1c:\users\user\downloads\juwendibased\d3dmenu.h(5): fatal error C1083: Cannot open include file: 'd3dx9.h': No such file or directory
    ========== Build: 0 succeeded, 1 failed, 0 up-to-date, 0 skipped ==========

    DB:2.43:Build Error In Microsoft Visual C++ 2010 Express ! zc

    Hi,
    I have marked my reply as answer.
    If you disagree, please unmark it, and post your doubt.
    Regards,Elegentin Xie
    MSDN Community Support | Feedback to us
    Develop and promote your apps in Windows Store
    Please remember to mark the replies as answers if they help and unmark them if they provide no help.

  • RELEVANCY SCORE 2.43

    DB:2.43:Error Installing Service Pack 3 For Exchange Server 2010 (Hub Transport) 8f


    I get the following error;
    [ERROR] Couldn't remove product with code 4934d1ea-be46-48b1-8847-f1af20e892c1. Fatal error during installation. Error code is 1603.
    This is one of two Hub Transport only servers. The Client Access servers upgrade without a problem.
    Thanks,
    Randel

    DB:2.43:Error Installing Service Pack 3 For Exchange Server 2010 (Hub Transport) 8f

    Thanks all for the suggestions.
    I got so fed up for trying to reinstalling the Update Rollup 2 for Exchange Server 2010 Service Pack 2 (KB2661854), or uninstalling it using msiexec /x that I just went through the registry and deleted the install source keys.
    I really hope this doesn't bit me in the booba later. The project is to upgrade to Ex2013.

  • RELEVANCY SCORE 2.42

    DB:2.42:I Have Developed A Labwindows Cvi 5.5 Program And Am Having Trouble Installing It On Certain Windows 95 Machines. I Get, "Fatal Error At Script Line 653 Directory Not Found." x8


    From this first error message you can say OK and get another error message, "fatal error at script line 477 directory does not exist." and then, "Installation unsuccessful try again later."

    DB:2.42:I Have Developed A Labwindows Cvi 5.5 Program And Am Having Trouble Installing It On Certain Windows 95 Machines. I Get, "Fatal Error At Script Line 653 Directory Not Found." x8

    Hello. It sounds like this error occurs when you are trying to install a distribution kit from an application you have packaged up. What were your target and create distribution kit settings? Is there anything that sets these 95 machine apart from others that you have found the installation to be successful on? It obviously is trying to locate or write a file to a directory specified by the installer program that does not exist on your system.Thank you for posting your request to the Developer Zone, the best forum for information.Daniel McChaneApplication EngineerNational Instruments

  • RELEVANCY SCORE 2.42

    DB:2.42:Make Error 91


    I'm installing 8.1.7 on Solaris 9, I got a problem about linking in make.log for ins_otrace.mk :

    ld: warning: option -o appears more than once, first setting taken
    ld: fatal: library -lclntsh: not found
    ld: fatal: library -llu62: not found
    ld: fatal: library -llu62: not found
    ld: fatal: library -llu62: not found
    ld: fatal: library -llu62: not found
    ld: fatal: File processing errors. No output written to otrcfmt
    *** Error code 1
    make: Fatal error: Command failed for target `otrcfmt'

    how should I do next, is there any environment problem?

    DB:2.42:Make Error 91

    set the libraries paths correctly before installing the software according to documentation. you may be do some spelling mistake in your library configuration check it.

  • RELEVANCY SCORE 2.42

    DB:2.42:Fatal Error. Unhandled Msi Error 1627 When Installing Nidaq 7.3.1 9c


    Fresh win2k install. Error off CD or from downloaded zip files.

    DB:2.42:Fatal Error. Unhandled Msi Error 1627 When Installing Nidaq 7.3.1 9c

    Hello T. NI-DAQ 7.4 is out. I would strongly recommend it unless there is a particular reason you need 7.3.1.

  • RELEVANCY SCORE 2.42

    DB:2.42:Re: Error C1189 : Unknown Destination Paltform. f8


    hi!i am trying to build  the myjingle application in vs2005  in c++.after including many header files at last getting  the fatal errorc1189: unknown destination paltform.outputDirectXFullDuplexAudioDevice.cppc:\downloads\myjingle\references\beat\config.h(213) : fatal error C1189: #error :  Unknown destination platformJitterBuffer.cppc:\downloads\myjingle\references\beat\config.h(213) : fatal error C1189: #error :  Unknown destination platformSoundCapture.cppc:\downloads\myjingle\references\beat\config.h(213) : fatal error C1189: #error :  Unknown destination platformSoundPlay.cppc:\downloads\myjingle\references\beat\config.h(213) : fatal error C1189: #error :  Unknown destination platformBeatMediaChannel.cppc:\downloads\myjingle\references\beat\config.h(213) : fatal error C1189: #error :  Unknown destination platformBeatMediaEngine.cppc:\downloads\myjingle\references\beat\config.h(213) : fatal error C1189: #error :  Unknown destination platformerrors:Error    1    fatal error C1189: #error :  Unknown destination platform    c:\downloads\myjingle\references\beat\config.h       Error    2    fatal error C1189: #error :  Unknown destination platform    c:\downloads\myjingle\references\beat\config.h      Error    3    fatal error C1189: #error :  Unknown destination platform    c:\downloads\myjingle\references\beat\config.h      Error    4    fatal error C1189: #error :  Unknown destination platform    c:\downloads\myjingle\references\beat\config.h      Error    5    fatal error C1189: #error :  Unknown destination platform    c:\downloads\myjingle\references\beat\config.h      Error    6    fatal error C1189: #error :  Unknown destination platform    c:\downloads\myjingle\references\beat\config.h      Error    7    fatal error C1189: #error :  Unknown destination platform    c:\downloads\myjingle\references\beat\config.h      so help me to solve this error.

    DB:2.42:Re: Error C1189 : Unknown Destination Paltform. f8


    Hi,
     
    From the message, it seems that there is a “#error Unknown destination platform”directive in the 213 line of config.h. Maybe you can check the context of that line and add some proprocesser definitions. For detail information. ,I think you should ask the header file author.
     
    For Information about the #error directive, you can refer to
    http://msdn2.microsoft.com/en-us/library/c8tk0xsk(VS.80).aspx
     
    Hope this helps!
     

  • RELEVANCY SCORE 2.42

    DB:2.42:Errror While Installing Windows C000021a Fatal System Error 0x00000000 0xc0000001 0x001003a8 fd


    original title: Errror while installing windows :'(
    Windows= Vista (current)

    DB:2.42:Errror While Installing Windows C000021a Fatal System Error 0x00000000 0xc0000001 0x001003a8 fd

    Hey, Andre Da Costa... Look at the topic in question. The guy clearly said he gets this error when INSTALLING WINDOWS. That being the case, how does one boot into an operating system that has yet to be installed?

    Try reading the question next time before wasting everyone's time with answers like this.

  • RELEVANCY SCORE 2.42

    DB:2.42:Plesk 10.3.1 Fails Php Fatal Error: Class Vz Not Found In /Usr/Local/Psa/Admin/Pli 9a





    ---------------------------------------------------------------
    PRODUCT, VERSION, MICROUPDATE, OPERATING SYSTEM, ARCHITECTURE
    Plesk 10.3.1, Linux Centos 5 2.6.18-194.26.1.el5, i386
    PROBLEM DESCRIPTION

    Im getting this error by mail:

    subject: Cron xxxx@myserver /usr/local/psa/libexec/modules/watchdog/cp/clean-sysstats

    PHP Fatal error: Class vz not found in /usr/local/psa/admin/plib/PleskException.php on line 22

    And the server stops responding.

    STEPS TO REPRODUCE

    ACTUAL RESULT

    The server has to be rebooted.

    EXPECTED RESULT

    ANY ADDITIONAL INFORMATION
    --------------------------------------------------------------

    DB:2.42:Plesk 10.3.1 Fails Php Fatal Error: Class Vz Not Found In /Usr/Local/Psa/Admin/Pli 9a




    What about upgrade to latest version in 10.x - 10.4.4 or to latest version 11.0.9?

  • RELEVANCY SCORE 2.41

    DB:2.41:Problem While Installing Weblogic Server 10.0.3.2 k8


    Hi,

    I have downloaded wls1031_generic.jar getting fatal error while installing the same.

    DB:2.41:Problem While Installing Weblogic Server 10.0.3.2 k8

    Please consider discussing this in the WebLogic Server forum instead of the 'I have a problem obtaining a download' forum.

  • RELEVANCY SCORE 2.41

    DB:2.41:Arch Completely Hosed After Pacman -Syu fz



    I have a VPS machine that I decided to put arch on (my first time with arch). The server started with arch-2010-05-x86_64, which is out of date, so I decided to upgrade it. I ran pacman -Syu, which failed, and now any command gives an error about the kernel being too old.Is it possible to recover from this situation? I have two ssh connections open as root, but new ssh requests are denied.If not (and Im not too worried, I havent personalized the VPS yet, and reinstalling takes five minutes), how can I avoid this the next time? Installing from a later install media is not an option, as 2010-05 is the latest they offer.

    Here is the output. The three up to date lines near the top were download progress lines the first time I ran it, but I accidentally hit n and had to restart.
    [root@Zoidberg ~]# pacman -Syu
    :: Synchronizing package databases...
    core is up to date
    extra is up to date
    community is up to date
    :: The following packages should be upgraded first :
    pacman
    :: Do you want to cancel the current operation
    :: and upgrade these packages now? [Y/n] y

    resolving dependencies...
    looking for inter-conflicts...

    Targets (5): linux-api-headers-3.0.1-1 glibc-2.14.1-1 xz-5.0.3-1 libarchive-2.8.5-2 pacman-3.5.4-4

    Total Download Size: 9.43 MB
    Total Installed Size: 44.14 MB

    Proceed with installation? [Y/n] y
    :: Retrieving packages from core...
    linux-api-headers-3... 574.8K 554.9K/s 00:00:01 [#################################################################################] 100%
    glibc-2.14.1-1-x86_... 7.1M 901.5K/s 00:00:08 [#################################################################################] 100%
    xz-5.0.3-1-x86_64 314.6K 595.8K/s 00:00:01 [#################################################################################] 100%
    libarchive-2.8.5-2-... 608.8K 926.6K/s 00:00:01 [#################################################################################] 100%
    pacman-3.5.4-4-x86_64 855.0K 933.9K/s 00:00:01 [#################################################################################] 100%
    checking package integrity...
    (5/5) checking for file conflicts [#################################################################################] 100%
    (1/5) upgrading linux-api-headers [#################################################################################] 100%
    (2/5) upgrading glibc [#################################################################################] 100%
    warning: /etc/locale.gen installed as /etc/locale.gen.pacnew
    FATAL: kernel too old
    error: command failed to execute correctly
    (3/5) upgrading xz [#################################################################################] 100%
    (4/5) upgrading libarchive [#################################################################################] 100%
    (5/5) upgrading pacman [#################################################################################] 100%
    warning: /etc/pacman.conf installed as /etc/pacman.conf.pacnew
    FATAL: kernel too old
    error: command failed to execute correctly
    New optional dependencies for pacman
    curl: for rankmirrors usage
    FATAL: kernel too old
    error: command failed to execute correctly
    [root@Zoidberg ~]# ls
    FATAL: kernel too old
    [root@Zoidberg ~]# uname -a
    FATAL: kernel too old
    [root@Zoidberg ~]# pacman
    FATAL: kernel too old
    [root@Zoidberg ~]# diff /etc/pacman.conf /etc/pacman.conf.pacnew
    FATAL: kernel too old

    DB:2.41:Arch Completely Hosed After Pacman -Syu fz


    you do not use the arch kernel in openvz. openvz is just a container running the tools from arch and the kernel is used from host

    Last edited by wonder (2011-12-06 11:29:38)

  • RELEVANCY SCORE 2.41

    DB:2.41:Error-Rc-20200: Fatal: Could Not Find Unzip. At This Time Only Native Unzip m8


    Hi all,

    I am installing 12.1.1 in Oracle linux 6.1 server 64bit, while starting rapidwiz getting error

    "RC-20200: Fatal: Could not find Unzip. At this time only Native UnZip 5.X is supported.

    Please make sure you have UnZip 5.X in your path and try again...

    Unable to complete install of database

    RW-50010: Error: - script has returned an error: 1
    RW-50004: Error code received when running external process

    i am straggling for last two day, pleas help me move forward.

    Thanks a lot...

    Regard
    KSURESH

  • RELEVANCY SCORE 2.41

    DB:2.41:Fastethernet0: Fatal Transmit Error. Restarting... km



    I am having this kind of issue on my Cisco876.

    Has anybody experienced this before ? WAN is aDSL line and it has been lately

    checked by provider like five times. The main problem is that internet itself falls dows from 5 to 10 times a day. 

    Local cabling was tested with certified devices.

    Here`s ADSL:

    Capacity Used:   44%                             99%Noise Margin:    14.0 dB                          7.5 dBOutput Power:    11.0 dBm                        12.5 dBmAttenuation:     15.5 dB                          9.0 dB

     

    Here`s log:

    C876#sh log | i Fatal

    000040: Apr 10 18:46:01: %C870_FE-3-TXERR: FastEthernet0: Fatal transmit error. Restarting...000048: Apr 11 10:49:21: %C870_FE-3-TXERR: FastEthernet0: Fatal transmit error. Restarting...000058: Apr 11 11:30:37: %C870_FE-3-TXERR: FastEthernet0: Fatal transmit error. Restarting...000072: Apr 11 14:42:25: %C870_FE-3-TXERR: FastEthernet0: Fatal transmit error. Restarting...000087: Apr 11 16:36:54: %C870_FE-3-TXERR: FastEthernet0: Fatal transmit error. Restarting...000097: Apr 14 08:15:41: %C870_FE-3-TXERR: FastEthernet0: Fatal transmit error. Restarting...000116: Apr 14 08:27:28: %C870_FE-3-TXERR: FastEthernet0: Fatal transmit error. Restarting...000149: Apr 14 10:59:09: %C870_FE-3-TXERR: FastEthernet0: Fatal transmit error. Restarting...000159: Apr 14 11:00:46: %C870_FE-3-TXERR: FastEthernet0: Fatal transmit error. Restarting...000169: Apr 14 11:02:14: %C870_FE-3-TXERR: FastEthernet0: Fatal transmit error. Restarting...

     

    What sould I try, please ? Can somebody help with this ?

    Thanks in advance.

     

     

    DB:2.41:Fastethernet0: Fatal Transmit Error. Restarting... km


    I'm having this issue with one of my 877 routers and was told by TAC that it is caused by a hardware bug, not fixable in software.

    The CSCth20872 bug describes a fix that works around the hardware bug by using a watchdog to reset the interface (apparently the whole switch; the message says "FastEthernet0" regardless of port used). As such, this could be considered an "informational" log message.

    Without the fix applied the interface(s) just hang, requiring a device reload to restore functionality.

    Based on my experience, the interface hang + reset also results in lost packets, easily noticeable in video conferencing and even VoIP. However, at least in my environment this issue only surfaces on a router that has comparatively more packets going through it (servicing a public NTP server and a SIP PBX).

    The suggested fix is replacing the router with a model from a different series (e.g. 887 or 897).

  • RELEVANCY SCORE 2.40

    DB:2.40:Fatal Error Installing 3ds Max Sp1 (Latest) cm



    Manual or through App Manager install of latest SP1 wont install and returns Fatal error. Any fixes workarounds?










    Attachments:







    Capture.JPG ‏32 KB

    DB:2.40:Fatal Error Installing 3ds Max Sp1 (Latest) cm

    Moved to the Installation forum.There's already a thread on errors installing SP1 here (a few threads down from this one). You'll need to check your logs (info in that thread) to see if you have the same error as that one (your screenshot doesn't give sufficient information).



    Max 4.2 through 2015 (SP3+EXT2), Composite 2014.Win7Pro x64 (SP1). i5-3570K @ 4.4GHz, 8Gb Ram, DX11.nVidia GTX760 (2GB) (Driver 335.23).

  • RELEVANCY SCORE 2.40

    DB:2.40:Error 1935 Fatal Error Installing 87


    I keep getting this message every time I want to open a word document

    DB:2.40:Error 1935 Fatal Error Installing 87

    Hi Christine,
    Thank you for posting your query in the Microsoft Community forum. I understand that you get error “1935” while trying to open word document.
    Let me help you fix the issue.

    Before proceeding with the troubleshooting, provide us with the information.
    1. Is the issue confined to Microsoft word document?
    2. Did you make any changes to the computer prior to the issue?
    3. Which version of Microsoft Office is installed?

    Please provide us with more information to continue with the troubleshooting accordingly.

    Refer the link on how to ask questions or help on Forums.
    Suggestions for asking a question on help forums:
    http://support.microsoft.com/kb/555375
    Thanks.

  • RELEVANCY SCORE 2.39

    DB:2.39:Failure Installing Pse 9 On Osx 10.6.8 13



    I'm trying to install PSE 9 but it fails with the following error

    Exit Code: 7
    -------------------------------------- Summary --------------------------------------
    - 0 fatal error(s), 15 error(s), 1 warning(s)
    WARNING: Payload cannot be installed due to dependent operation failure
    ERROR: 1879 Unable to copy file from "/private/tmp/.tempdirMAQ9IjjZ/Assets1/Adobe Photoshop Elements.app/Contents/Required/PDFL/Fonts/AdobeGothicStd-Bold.otf" to "/Applications/Adobe Photoshop Elements 9/Adobe Photoshop Elements.app/Contents/Required/PDFL/Fonts/AdobeGothicStd-Bold.otf" Error 0
    ERROR: 1879 Command ARKCopyFileCommand failed.
    ERROR: 5 Unable to delete file copy at "/Applications/Adobe Photoshop Elements 9/Adobe Photoshop Elements.app/Contents/Info.plist" Error 0
    ERROR: 5 Error rolling back command ARKCopyFileCommand
    ERROR: 4 Unable to get permissions of "/Applications/Adobe Photoshop Elements 9/Adobe Photoshop Elements.app/Contents"
    ERROR: 4 Error rolling back command ARKCreateDirectoryCommand
    ERROR: 3 Unable to get permissions of "/Applications/Adobe Photoshop Elements 9/Adobe Photoshop Elements.app"
    ERROR: 3 Error rolling back command ARKCreateDirectoryCommand
    ERROR: 2 Unable to delete created symlink at "/Applications/Adobe Photoshop Elements 9/Adobe Photoshop Elements 9"
    ERROR: 2 Error rolling back command ARKCopySymlinkCommand
    ERROR: 1 Unable to get permissions of "/Applications/Adobe Photoshop Elements 9"
    ERROR: 1 Error rolling back command ARKCreateDirectoryCommand
    ERROR: The following payload errors were found during install:
    ERROR: - Adobe Photoshop Elements 9_LangPacken_US: Install failed
    ERROR: - Adobe Photoshop Elements 9: Failed due to Language Pack installation failure
    -------------------------------------------------------------------------------------

    any idea

    DB:2.39:Failure Installing Pse 9 On Osx 10.6.8 13


    I'm trying to install PSE 9 but it fails with the following error

    Exit Code: 7
    -------------------------------------- Summary --------------------------------------
    - 0 fatal error(s), 15 error(s), 1 warning(s)
    WARNING: Payload cannot be installed due to dependent operation failure
    ERROR: 1879 Unable to copy file from "/private/tmp/.tempdirMAQ9IjjZ/Assets1/Adobe Photoshop Elements.app/Contents/Required/PDFL/Fonts/AdobeGothicStd-Bold.otf" to "/Applications/Adobe Photoshop Elements 9/Adobe Photoshop Elements.app/Contents/Required/PDFL/Fonts/AdobeGothicStd-Bold.otf" Error 0
    ERROR: 1879 Command ARKCopyFileCommand failed.
    ERROR: 5 Unable to delete file copy at "/Applications/Adobe Photoshop Elements 9/Adobe Photoshop Elements.app/Contents/Info.plist" Error 0
    ERROR: 5 Error rolling back command ARKCopyFileCommand
    ERROR: 4 Unable to get permissions of "/Applications/Adobe Photoshop Elements 9/Adobe Photoshop Elements.app/Contents"
    ERROR: 4 Error rolling back command ARKCreateDirectoryCommand
    ERROR: 3 Unable to get permissions of "/Applications/Adobe Photoshop Elements 9/Adobe Photoshop Elements.app"
    ERROR: 3 Error rolling back command ARKCreateDirectoryCommand
    ERROR: 2 Unable to delete created symlink at "/Applications/Adobe Photoshop Elements 9/Adobe Photoshop Elements 9"
    ERROR: 2 Error rolling back command ARKCopySymlinkCommand
    ERROR: 1 Unable to get permissions of "/Applications/Adobe Photoshop Elements 9"
    ERROR: 1 Error rolling back command ARKCreateDirectoryCommand
    ERROR: The following payload errors were found during install:
    ERROR: - Adobe Photoshop Elements 9_LangPacken_US: Install failed
    ERROR: - Adobe Photoshop Elements 9: Failed due to Language Pack installation failure
    -------------------------------------------------------------------------------------

    any idea

  • RELEVANCY SCORE 2.39

    DB:2.39:- 0 Fatal Error(S), 3 Error(S) ----------- Payload: Adobe Photoshop Lightroom 5 5.6.0.0 Adobe_Lightroom_X64.Msi_5.6 ----------- Error: Key Not Valid For Use In Specified State. Error: Install Msi Payload Failed With Error: 1603 - Fatal Error Durin xx



    I keep getting this error code when trying to download

    - 0 fatal error(s), 3 error(s) ----------- Payload: Adobe Photoshop Lightroom 5 5.6.0.0 Adobe_Lightroom_x64.msi_5.6 ----------- ERROR: Key not valid for use in specified state. ERROR: Install MSI payload failed with error: 1603 - Fatal error during installation. MSI Error message: Key not valid for use in specified state. ERROR: Third party payload installer Adobe_Lightroom_x64.msi failed with exit code: 1603

    DB:2.39:- 0 Fatal Error(S), 3 Error(S) ----------- Payload: Adobe Photoshop Lightroom 5 5.6.0.0 Adobe_Lightroom_X64.Msi_5.6 ----------- Error: Key Not Valid For Use In Specified State. Error: Install Msi Payload Failed With Error: 1603 - Fatal Error Durin xx


    Generally this error happens because of an encrypted folder or insufficient permissions on that folder: http://support.microsoft.com/kb/834484 (MS Explanation)

    Adobe has a page here: Error 1603: A fatal error occurred during installation

  • RELEVANCY SCORE 2.39

    DB:2.39:Download Lightroom 5.5.6 Fails kx



    Installing of Lightroom by Creative Cloud fails- error message as follows:

    Exit Code: 7

    Please see specific errors below for troubleshooting. For example, ERROR:

    -------------------------------------- Summary --------------------------------------

    - 0 fatal error(s), 3 error(s)

    ----------- Payload: Adobe Photoshop Lightroom 5 5.6.0.0 Adobe_Lightroom_x64.msi_5.6 -----------

    ERROR: Nyckeln gr inte att anvnda i det angivna tillstndet.

    ERROR: Install MSI payload failed with error: 1603 - Ett allvarligt fel intrffade under installationen.

    MSI Error message: Nyckeln gr inte att anvnda i det angivna tillstndet.

    ERROR: Third party payload installer Adobe_Lightroom_x64.msi failed with exit code: 1603

    DB:2.39:Download Lightroom 5.5.6 Fails kx


    Hi peterlun72,

    Please try the following links.

    Link 1: Errors "Exit Code: 6," "Exit Code: 7" | CS5, CS5.5

    Link 2: Error 1603: A fatal error occurred during installation

    [Note] : Follow Solution- 4 to solution -7 while following link 2.

    Thanks,

    Atul Saini

  • RELEVANCY SCORE 2.39

    DB:2.39:Error Installing Labview 7 Drivers Cd mf


    fatal error occures while installing Labview device drivers cd.Error: Failed to open handle for D:\components\visa\ni-spy\NISpy.msi

    DB:2.39:Error Installing Labview 7 Drivers Cd mf

    Few things to check-First verify that the file exists (which i doubt it won't be). Launch that msi by itself by double clicking on it (don't install).-Try copying the contents of the CD to local drive and run from there.ARafiq

  • RELEVANCY SCORE 2.39

    DB:2.39:Instastall J6480 Vista Fatal Error 2203 Please Help ss



    When installing software for the J6480 (wireless) I get a fatal error 2203 MSI.BPDSW. This is on a new laptop with Windows Vista. I have been using the printer for a year with no trouple (networked with computers using both XP and Vista) I tried a level 3 install (which hung 60% of the way through) and tried deleting the HP applications throough the control panel.

    Got the error 2203 when subsequently trying to reinstall. Please help!

    DB:2.39:Instastall J6480 Vista Fatal Error 2203 Please Help ss


    Using scanner and camera wizard on a network printer w/o using the solution center

    Requirements:

    -PC should be able to ping the printer

    -Printer EWS should be working

    Adding the Scanner on device manager/Imaging device:

    (Printer installer)/setup/

    Try runningHpzdui01.exe – choose network printer, printer should be detected and will disappear

    Note if Hpzdui01 will not work, try net01.exe or nui01.exe it depends on the installer version

    On device manager show hidden device from the menu (View/show hidden devices)

    -look for Multifunction Adapter and right click and enable the printer model

    Note: vista will not ask for a reboot, you should manually reboot it

    Try scanning using scanner and camera wizard after the reboot

    Note: if it’s not working verify in the WIA driver is on "c:\windows\twain_32\wiatwain.ds" if not, look for it and copy it to twain_32 location.

  • RELEVANCY SCORE 2.39

    DB:2.39:Error Installing Lightroom 5 cm



    Exit Code: 7

    Please see specific errors below for troubleshooting. For example, ERROR:

    -------------------------------------- Summary --------------------------------------

    - 0 fatal error(s), 1 error(s)

    ----------- Payload: AdobeLightroom5CCMSetup-mul 5.2.0.0 {3f480018-d40f-429a-b939-d1a53276944f} -----------

    ERROR: Third party payload installer Install Lightroom 5 CCM.exe failed with exit code: 1619

    -------------------------------------------------------------------------------------

    Im running Windows 7 home 64 bit. im trying to install lightroom 5 downloading it from creative cloud. i was able to install illistrator with no problems, i tried to restart and uninstalled the old version of lightroom (3)

    DB:2.39:Error Installing Lightroom 5 cm


    Exit Code: 7

    Please see specific errors below for troubleshooting. For example, ERROR:

    -------------------------------------- Summary --------------------------------------

    - 0 fatal error(s), 1 error(s)

    ----------- Payload: AdobeLightroom5CCMSetup-mul 5.2.0.0 {3f480018-d40f-429a-b939-d1a53276944f} -----------

    ERROR: Third party payload installer Install Lightroom 5 CCM.exe failed with exit code: 1619

    -------------------------------------------------------------------------------------

    Im running Windows 7 home 64 bit. im trying to install lightroom 5 downloading it from creative cloud. i was able to install illistrator with no problems, i tried to restart and uninstalled the old version of lightroom (3)

  • RELEVANCY SCORE 2.38

    DB:2.38:Fatal Error During Install, Internal Error 2203 ff



    installing updated drivers and get error message internal error 2203. fatal error during install: MSI.DocProc. what do I do?

    DB:2.38:Fatal Error During Install, Internal Error 2203 ff


    Hello kb828,

    I would like to help with this issue, but need to know a couple things first:

    1. What operating system is on your computer?

    2. What make/model printer do you have?

  • RELEVANCY SCORE 2.38

    DB:2.38:Oracle Vm Linux 5 Guest Addition Installation"Panic,Not Syncing Fatal Error ac


    Hi Experts,

    I Installed Oracle VM Linux 5 also able to connect internet. Now I a was installing Guest Addition did below activity for the same.

    yum update
    yum install gcc kernel-uek-devel kernel-devel kernel-xen-devel dkms ...
    yum update kernel -y
    export KERN_DIR=/usr/src/2.6.18-308.11.1.0.1.el5xen-x86_64

    ./VBoxLinuxAdditions.run

    It went successfull system started reboot but than i stuck while booting with error 'Kernel panic,not syncing Fatal error".

    Help appreciated.

    Edited by: IgnitedMind on 19/07/2012 19:31

    DB:2.38:Oracle Vm Linux 5 Guest Addition Installation"Panic,Not Syncing Fatal Error ac

    try this out sudo chmod +x /var/lib/virtualbox/VirtualBox through root.Seems more like execution permission issue.

    Regards
    Shashank

  • RELEVANCY SCORE 2.38

    DB:2.38:Does Windows8 For Arm(Woa) Support Mfc/Win32. ms


    Hi,
    Does Windows8 for ARM(WOA) support MFC/WIN32 ?
    My project is MFC based SDI Application with Doc-View Architecture was created in VC8.0.
    Now I want to give support for WIN8(WOA).
    Iconverted the workspace to VS2011 from VS2005.
    Thencompile it for WIN32 X64 configuration it was successful.
    But when tried to compilefor arm configuration following linking error occurred.
    1. LINK : fatal error LNK1104: cannot open file Iphlpapi.lib.
    2. LINK : fatal error LNK1104: cannot open file msimg32.lib.
    3. LINK : fatal error LNK1104: cannot open file comctl32.lib.
    4. LINK : fatal error LNK1104: cannot open file shlwapi.lib.
    5. LINK : fatal error LNK1104: cannot open file uxtheme.lib.
    6. LINK : fatal error LNK1104: cannot open file dwmapi.lib.
    7. LINK : fatal error LNK1104: cannot open file dwmapi.lib.
    8. LINK : fatal error LNK1104: cannot open file oledlg.lib.
    9. LINK : fatal error LNK1104: cannot open file urlmon.lib.
    10. LINK : fatal error LNK1104: cannot open file ws2_32.lib.
    11. LINK : fatal error LNK1104: cannot open file mswsock.lib.
    12. LINK : fatal error LNK1104: cannot open file oleacc.lib.
    13. LINK : fatal error LNK1104: cannot open file gdiplus.lib.
    14. LINK : fatal error LNK1104: cannot open file propsys.lib.
    15. LINK : fatal error LNK1104: cannot open file imm32.lib.
    16. LINK : fatal error LNK1104: cannot open file 'winmm.lib'.
    17. LINK : fatal error LNK1104: cannot open file 'msxml2.lib'
    I think this all lib files are Framework libraries.So, for WOA are there any alternative to support MFC Application in WOA or need to developed same MFC fromScratch in WINRT/Metro
    style.

  • RELEVANCY SCORE 2.38

    DB:2.38:Version 5.0 Unexpected Fatal Errror 9c



    when i try to load the os 5.0 on my storm with the app loader it gives me an error before it finishes saying unexpected fatal error. try again

    ive tried 3 times and it does it everytime does anybody have any suggestions

    DB:2.38:Version 5.0 Unexpected Fatal Errror 9c

    stilltokin wrote:
    when i try to load the os 5.0 on my storm with the app loader it gives me an error before it finishes saying unexpected fatal error. try again

    ive tried 3 times and it does it everytime does anybody have any suggestions

    Many are getting that error. Pull the battery from the device first, good 30 seconds to even a minute. Also a PC reboot can't hurt. Try the upgrade through app loader again. Should be fine.




    If I or any one else helps resolve your issue, please click the KUDOS!!REMEMBER TO RESOLVE YOUR THREAD! PLEASE ALWAYS CHECK THE ACCEPTED SOLUTION ON THE POST THAT RESOLVES YOUR PROBLEM SO OTHERS MAY USE IT TOO!

  • RELEVANCY SCORE 2.38

    DB:2.38:Db_Runrecovery When Multi-Process Access The Same Dbenv df


    I have 5 process access the same db(dbenv) concurrently.
    I open dbenv using following flags :

    m_pDbEnv-open( m_strDBHome.c_str(), DB_CREATE | DB_INIT_MPOOL, 0 );

    open db using following flags :

    pDb-open ( NULL, pszDatabase, pszTable, type, DB_CREATE, 0666 );

    when all 5 process runs done, it seems work ok.

    BUT, when I run the 5 works again,
    2 of cry DB_RUNRECOVERY when open env:
    PANIC: fatal region error detected; run recovery
    bdb.cpp 77 open() : DbException : [-30975] DbEnv::open: DB_RUNRECOVERY: Fatal error, run database recovery
    bdb.cpp 738 create() : Fail to open DKV::BdbServer.
    Fail to create DKV::Server.

    3 of them cry DB_RUNRECOVERY when PUT

    PANIC: fatal region error detected; run recovery
    bdb.cpp 463 insert() : Fail to INSERT : [-30975] Db::put: DB_RUNRECOVERY: Fatal error, run database recovery
    PANIC: fatal region error detected; run recovery
    bdb.cpp 463 insert() : Fail to INSERT : [-30975] Db::put: DB_RUNRECOVERY: Fatal error, run database recovery
    PANIC: fatal region error detected; run recovery
    bdb.cpp 463 insert() : Fail to INSERT : [-30975] Db::put: DB_RUNRECOVERY: Fatal error, run database recovery

    what should I do In such a situation?

    thanks

    kuer

    DB:2.38:Db_Runrecovery When Multi-Process Access The Same Dbenv df

    kuer,

    I don't think that posting the same question in two separated threads, will give you a faster answer.

    If you have a support license for Berkeley DB with Oracle, you can also raise a Service Request on http://metalink.oracle.com , and this will give you speed.

    The duplicated thread is here ( how to improve performance of concurrent write? ) and I will try to solve the issue there.

    Best Regards,
    Bogdan Coman

  • RELEVANCY SCORE 2.38

    DB:2.38:Fatal Error Msi.512400 When Trying To Install Hp Flat Scanner G2140 xj


    Problems with installing software HP flatbedscanner G2140.

  • RELEVANCY SCORE 2.38

    DB:2.38:Installing Language Pack Or Templates mj





    Hello, If I try to install the language pack, I become this error:
    [FATAL] Error connecting to MySQL on localhost:3306
    Reason: Access denied for user admin@localhost (using password: YES)
    There were some configuration errors, check logs
    Logs saved to /usr/local/sitebuilder/tmp/sb_config-0803081421.log

    In the sb_config-0803081421.log I find:
    [2008 Mar 8 14:18:16] [FATAL] Error connecting to MySQL on localhost:3306
    Reason: Access denied for user admin@localhost (using password: YES)
    Fatal error encountered at /usr/local/sitebuilder/utils//SB/Logging.pm line 121
    SB::Logging::Log(SB::Logging=HASH(0x8170c28), 5, Error connecting to MySQL on localhost:3306\x{a}Reason: Access de...) called at /usr/local/sitebuilder/utils//SB/Utils.pm line 94
    SB::Utils::checkParameters() called at configure line 200
    main::main() called at configure line 287

    What can I do ?

    thanks for your help,
    Olivier

    DB:2.38:Installing Language Pack Or Templates mj




    Hello, If I try to install the language pack, I become this error:
    [FATAL] Error connecting to MySQL on localhost:3306
    Reason: Access denied for user admin@localhost (using password: YES)
    There were some configuration errors, check logs
    Logs saved to /usr/local/sitebuilder/tmp/sb_config-0803081421.log

    In the sb_config-0803081421.log I find:
    [2008 Mar 8 14:18:16] [FATAL] Error connecting to MySQL on localhost:3306
    Reason: Access denied for user admin@localhost (using password: YES)
    Fatal error encountered at /usr/local/sitebuilder/utils//SB/Logging.pm line 121
    SB::Logging::Log(SB::Logging=HASH(0x8170c28), 5, Error connecting to MySQL on localhost:3306\x{a}Reason: Access de...) called at /usr/local/sitebuilder/utils//SB/Utils.pm line 94
    SB::Utils::checkParameters() called at configure line 200
    main::main() called at configure line 287

    What can I do ?

    thanks for your help,
    Olivier

  • RELEVANCY SCORE 2.38

    DB:2.38:Installation Error With Pba-3.3.3-05.34 And Centos 5 p9





    When executing install.sh script and inmediately after the dialog box asking install option and paths we got the error: An error occurred when installing Parallels Bussines Automation - Standard. Fatal Error at file xmlPacket, line 1, column 1: Invalid document structure.

    DB:2.38:Installation Error With Pba-3.3.3-05.34 And Centos 5 p9




    When executing install.sh script and inmediately after the dialog box asking install option and paths we got the error: An error occurred when installing Parallels Bussines Automation - Standard. Fatal Error at file xmlPacket, line 1, column 1: Invalid document structure.

  • RELEVANCY SCORE 2.38

    DB:2.38:Microsoft Flight Simulator X - Fatal Error Wont Run sp


    After installing MFSX I keep getting error messages regarding a "Fatal Error." There is no other indication of what the problem is. The other message says "Windows is investigating" or something to that effect.

    DB:2.38:Microsoft Flight Simulator X - Fatal Error Wont Run sp

    it didn't work,

    when i bought fsx there was no problem but now it's a disaster!
    when it start fsx (some times) i hear the sound but after 10 sec it´s error. every time i try it´s the same result.

    please help me!

  • RELEVANCY SCORE 2.38

    DB:2.38:Error Installing Cloud Acrobat-Config.Msi Access sm


    I am a Creative Cloud member and am having trouble installing Acrobat X Pro. The following is a sample error.

    Exit Code: 6 Please see specific errors and warnings below for troubleshooting.

    For example, ERROR: DW050 ... -------------------------------------- Summary --------------------------------------

    - 0 fatal error(s), 3 error(s), 0 warning(s)

    ----------- Payload: {AC76BA86-1033-F400-7760-000000000005} Acrobat Professional 10.0.0.0 -----------

    ERROR: Error 1310.Error writing to file: C:\Config.Msi\4755a83.rbf.

    Verify that you have access to that directory.

    ERROR: Install MSI payload failed with error: 1603 -

    Fatal error during installation.

    MSI Error message: Error 1310.Error writing to file: C:\Config.Msi\4755a83.rbf.

    Verify that you have access to that directory.

    ERROR: DW050: The following payload errors were found during install

    : ERROR: DW050: - Acrobat Professional: Install failed

    -------------------------------------------------------------------------------------

    Usually when I get such an error, I open the Config.msi directory and that verifies that I have
    access, but it's not working in this case.

    --Katherine

    DB:2.38:Error Installing Cloud Acrobat-Config.Msi Access sm


    This may help. http://helpx.adobe.com/creative-suite/kb/error-1310-error-writing-file.html

  • RELEVANCY SCORE 2.38

    DB:2.38:Fatal Error 1603 When Installing My Printer Soltware. How Do I Fix This 1k


    When I insert my printer installation disk, installation is interrupted with Fatal Error 1603. What is the fix? I'm using Windows XP.

    DB:2.38:Fatal Error 1603 When Installing My Printer Soltware. How Do I Fix This 1k

    My printer is an HP Officejet J6480 All-in-One. Unfortunately,"msiexec/unreg." couldn't be found. Since the Windows Installer Service is fatally corrupted, it makes sense to re-register it. Any other suggetion? Thanks for your anwer!

  • RELEVANCY SCORE 2.37

    DB:2.37:Dreamweaver Error Installing - It Says "Your Installation Encountered An Error" ac



    I have Adobe Creative Suite 5 Master collection. I installed all programs when I first bought it in 2010. The Dreamweaver program recently stopped working. I uninstalled it and reinstalled

    it but I am getting this message and do not know what to do

    Exit Code: 7

    -------------------------------------- Summary --------------------------------------

    - 1 fatal error(s), 3 error(s), 0 warning(s)

    ERROR: Found payload conflicts and errors:

    ERROR: - Adobe Flash Catalyst CS5 depends on Flash Player to be installed.

    ERROR: - Adobe Flash CS5 depends on Flash Player to be installed.

    FATAL ERROR: Conflicts were found in the selected payloads. Halting installation.

    -------------------------------------------------------------------------------------

    Thank you for any one who can assist.

    DB:2.37:Dreamweaver Error Installing - It Says "Your Installation Encountered An Error" ac


    Remove Flash Player and then install CS5 Master collection

    Follow the Kb to remove the Flash player :-

    For Win :- http://helpx.adobe.com/flash-player/kb/uninstall-flash-player-windows.html

    For Mac :- http://helpx.adobe.com/flash-player/kb/uninstall-flash-player-mac-os.html

    and then install CS5 Master collection.

  • RELEVANCY SCORE 2.37

    DB:2.37:Fatal Error When Installing Officejet 4500 Wireless m9



    When I am trying to install the Officejet 4500 wireless all-in-one on my Windows 7 Professional, 32 bit computer, I keep receiving the following fatal error: Any idea how to overcome? Thanks.

    DB:2.37:Fatal Error When Installing Officejet 4500 Wireless m9


    Hi, Un-install or delete everything related to the printer and start over. Disable your "firewall" and re-insert and run theCD. This may solve your problem, it did mine.... it is worth a try. Good luck. Lucall =)

  • RELEVANCY SCORE 2.37

    DB:2.37:Fatal Installation Error On Expression Studio 3 sz


    Hello Again, I tried installing Expression Studio 3 on Vista Home Basic - and it won't install, is there a reason for this? I keep getting Fatal Error during installation If you would like any extra information etc - I'd be happy to oblige.

    DB:2.37:Fatal Installation Error On Expression Studio 3 sz


    Know the exact error message, it is difficult to determine the cause mothayeo.Pc specs look down to check first ..Supported Operating Systems:

    PC with 1 GHz or faster processor
    512 MB of RAM or more
    350 MB of available hard-disk space
    .NET Framework 3.5 with Service Pack 1
    Support for Microsoft DirectX 9.0 graphics with Windows Vista Display Driver Model (WDDM) Driver, 128 MB of graphics RAM or more, Pixel Shader 2.0 in hardware, 32-bits per pixel
    DVD compatible drive
    1024 x 768 or higher-resolution monitor with 24-bit color
    Actual requirements and product functionality may vary based on your system configuration and operating system.

  • RELEVANCY SCORE 2.37

    DB:2.37:After Installing Ios7 I Am Not Able To Take Backup. Message Shows Fatal Error.... jj


    I am not able to take backup after installing ios7.

  • RELEVANCY SCORE 2.37

    DB:2.37:Error When Installing Lightroom xd


    Exit Code: 7Please see specific errors below for troubleshooting. For example, ERROR: -------------------------------------- Summary -------------------------------------- - 0 fatal error(s), 2 error(s) ----------- Payload: Adobe Photoshop Lightroom 5 5.3.0.0 Adobe_Lightroom_x64.msi_5.3 -----------ERROR: Install MSI payload failed with error: 1624 - Error applying transforms. Verify that the specified transform paths are valid.MSI Error message: ERROR: Third party payload installer Adobe_Lightroom_x64.msi failed with exit code: 1624-------------------------------------------------------------------------------------

  • RELEVANCY SCORE 2.37

    DB:2.37:Fatal Error While Installing C7280 Software For Vista jc



    I have been unsuccessful installing the software/driver for the HP Photosmart C7280 printer. I am getting a fatal error message MSI.dot4wrp exit code 1603.

    DB:2.37:Fatal Error While Installing C7280 Software For Vista jc


    Hello keithkurts

    I would try the following articles. The should help to resolve your issue. Please let me know if you have any further difficulties.

    MSI.DOT4wrp Fatal Error

    Fatal Error 1603

  • RELEVANCY SCORE 2.36

    DB:2.36:Fatal Error During Installation ks


    For up grading to serverlight 2,
    step 1: I removed all the softwares related to silver light 2 beta 2
    step 2: Updated VS 2008.
    step 3: I installedsp1.
    Step 4: Installing Silverlight 2 tools
    while installing Silverlight 2 tools , I asked for silverlight.msi file then It is showing Silverlight Tool Installation Wizard as

    Installation failed -- Fatal error during installation
    and I am unable to install Silverlight Tool
    Can anybody can tell me, how to solve this issue.

    DB:2.36:Fatal Error During Installation ks

    I had the same issue. I got it fixed by uninstalling the beta 2 version of Silverlight and proceeded it with the new installation. It worked !

  • RELEVANCY SCORE 2.36

    DB:2.36:Deskjet F2410 Fatal Error On Install j8



    Trying to install brand new Deskjet F2410- install failed -"fatal error" message -not specific about what kind of error. Using Windows vista home basic on Dell laptop. Tried all 3 fix suggestions from HP, no change. Have tried installing, uninstalling, MS installer clean up, downloading latest driver from HP, followed all instructions exactly.Last option from HP is try this forum for a user's solution. Desperately need to print University papers! Old printer died - need solution urgently.

    DB:2.36:Deskjet F2410 Fatal Error On Install j8


    Trying to install brand new Deskjet F2410- install failed -"fatal error" message -not specific about what kind of error. Using Windows vista home basic on Dell laptop. Tried all 3 fix suggestions from HP, no change. Have tried installing, uninstalling, MS installer clean up, downloading latest driver from HP, followed all instructions exactly.Last option from HP is try this forum for a user's solution. Desperately need to print University papers! Old printer died - need solution urgently.

  • RELEVANCY SCORE 2.36

    DB:2.36:Fatal Error While Installing Skype Update ka



    While trying to install a Skype update, Ireceived error #2203, problem with the installer package. The update failed and I received fatal error #1603. Does anyone know what's happening here? Thanks.

    DB:2.36:Fatal Error While Installing Skype Update ka


    Hi,

    To Fix this issue, plz follow the given link, and might it helps -http://community.skype.com/t5/Windows-desktop-client/I-cannot-download-Skype-keep-getting-error-2203...

    Click theKudosThumbs-Up to show appreciation and say Thanks.

  • RELEVANCY SCORE 2.36

    DB:2.36:Fatal Error x1



    upon installing Skype, a "Fatal Error" box popped up which reads "Failed to get proc address for EncodePointer (KERNEL32.dll)....what do I do?????

    DB:2.36:Fatal Error x1


    You need to update your Windows XP to Service Pack 3 (SP3).

  • RELEVANCY SCORE 2.36

    DB:2.36:Fatal Error In Saleforce Lookup mk



    Hi All,

    We have a Informatica mapping runnign without any issues in production for the past 3 months.

    However, just last week, we had a fatal error in the mapping. The mappign completed its execution and 16K out of the 19K records were successfully loaded to the target.

    However, a few records were not loaded and the mapping failed with a Fatal Error.

    The same mapping is running without any error in the UAT environment. Also, this error occurs sparadically.

    Any help is appreciated!

    Regards,

    Sunil

    The sample error messages are given below:

    TRANSF_1_1_1 SFDC_31302 Fatal Error in Saleforce Lookup Query failed. SOQL Fatal Error in Saleforce Lookup. Fault code Fatal Error in Saleforce Lookup. Reason [SOAP Error : Fatal Error in Saleforce Lookup. Please Contact Informatica Customer support.].

    TRANSF_1_1_1 CMN_1761 Timestamp Event: Fatal Error in Saleforce Lookup

    TRANSF_1_1_1 EP_13248 DLL Error Msg: SOAP Error : Fatal Error in Saleforce Lookup. Please Contact Informatica Customer support.

    TRANSF_1_1_1 CMN_1761 Timestamp Event: Fatal Error in Saleforce Lookup

    TRANSF_1_1_1 TM_6085 A fatal error occurred at transformation Fatal Error in Saleforce Lookup, and the session is terminating.

    TRANSF_1_1_1 CMN_1761 Timestamp Event: Fatal Error in Saleforce Lookup

    TRANSF_1_1_1 TM_6085 A fatal error occurred at transformation Fatal Error in Saleforce Lookup, and the session is terminating.

    TRANSF_1_1_1 CMN_1761 Timestamp Event: Fatal Error in Saleforce Lookup

    TRANSF_1_1_1 TM_6085 A fatal error occurred at transformation Fatal Error in Saleforce Lookup, and the session is terminating.

    TRANSF_1_1_1 CMN_1761 Timestamp Event: Fatal Error in Saleforce Lookup

    TRANSF_1_1_1 TM_6085 A fatal error occurred at transformation Fatal Error in Saleforce Lookup, and the session is terminating.

    TRANSF_1_1_1 CMN_1761 Timestamp Event: Fatal Error in Saleforce Lookup

    TRANSF_1_1_1 TM_6085 A fatal error occurred at transformation Fatal Error in Saleforce Lookup, and the session is terminating.

    TRANSF_1_1_1 CMN_1761 Timestamp Event: Fatal Error in Saleforce Lookup

    TRANSF_1_1_1 TM_6085 A fatal error occurred at transformation Fatal Error in Saleforce Lookup, and the session is terminating.

    TRANSF_1_1_1 DBG_21511 TE: Fatal Transformation Error.

    WRITER_1_*_1 WRT_8333 Rolling back all the targets due to fatal session error.

    READER_1_1_1 CMN_1761 Timestamp Event: Fatal Error in Saleforce Lookup

    READER_1_1_1 SDKC_37015 Plug-in Error: IRdrBuffer[groupNum 0] could not obtain a new block due to internal error.

    READER_1_1_1 CMN_1761 Timestamp Event: Fatal Error in Saleforce Lookup

    READER_1_1_1 SDKS_38200 Partition-level Fatal Error in Saleforce Lookup: Plug-in #310600 failed in run().

    WRITER_1_*_1 WRT_8325 Final rollback executed for the target Fatal Error in Saleforce Lookup at end of load

    WRITER_1_*_1 WRT_8035 Load complete time: Fri Apr 30 18:29:36 2010

    DIRECTOR TM_6252 Source Load Summary.

    DIRECTOR CMN_1740 Table: Fatal Error in Saleforce Lookup (Instance Name: Fatal Error in Saleforce Lookup)

    Output Rows Fatal Error in Saleforce Lookup, Affected Rows Fatal Error in Saleforce Lookup, Applied Rows Fatal Error in Saleforce Lookup, Rejected Rows Fatal Error in Saleforce Lookup

    DIRECTOR TM_6253 Target Load Summary.

    DIRECTOR CMN_1740 Table: Fatal Error in Saleforce Lookup (Instance Name: Fatal Error in Saleforce Lookup)

    Output Rows Fatal Error in Saleforce Lookup, Affected Rows Fatal Error in Saleforce Lookup, Applied Rows Fatal Error in Saleforce Lookup, Rejected Rows Fatal Error in Saleforce Lookup

    DIRECTOR CMN_1740 Table: Fatal Error in Saleforce Lookup (Instance Name: Fatal Error in Saleforce Lookup)

    Output Rows Fatal Error in Saleforce Lookup, Affected Rows Fatal Error in Saleforce Lookup, Applied Rows Fatal Error in Saleforce Lookup, Rejected Rows Fatal Error in Saleforce Lookup

    DIRECTOR CMN_1740 Table: Fatal Error in Saleforce Lookup (Instance Name: Fatal Error in Saleforce Lookup)

    Output Rows Fatal Error in Saleforce Lookup, Affected Rows Fatal Error in Saleforce Lookup, Applied Rows Fatal Error in Saleforce Lookup, Rejected Rows Fatal Error in Saleforce Lookup

    DIRECTOR TM_6023

    DB:2.36:Fatal Error In Saleforce Lookup mk


    Hi Sunil..

    Then i dont think its data issue..

    But, are you sure that the SOAP version that you are using is fully compatible with SalesForce lookup..?

    I am not sure which SOAP versions are compatible with SFDC lookup... but i know that there is some known issue with SOAP versions...

    I am trying to simulate the similar issue.. will update you ..

    --Prashant

  • RELEVANCY SCORE 2.36

    DB:2.36:Fatal Error When Installing C4780 In Windows 7 64-Bit 8f



    When I try to install the Software for HP C4780 I receive a Fatal Error and the program is deleted.

    DB:2.36:Fatal Error When Installing C4780 In Windows 7 64-Bit 8f


    Hi There!

    Kindly follow this link C4780and follow the troubleshooting steps on the page for this printer.

    Hope that helps thanks! =)

  • RELEVANCY SCORE 2.36

    DB:2.36:Visual Studio 2013 Professional With Update 4 Fatal Error Kb2829760 While Updating From Vs Ultimate Update 3 kj


    i am using VS 2013 Ultimate with update 3 and i downloaded vs 2013 professional update while installing the update i got an error like this
    Fatal Error during installation
    KB2829760

    and i could not find any solution common error list ... pls help me....

    thanks in advance ...

    DB:2.36:Visual Studio 2013 Professional With Update 4 Fatal Error Kb2829760 While Updating From Vs Ultimate Update 3 kj

    Hi saratcharan,
    i am using VS 2013 Ultimate with update 3 and i downloaded vs 2013 professional update while installing the update
    Could you please clarify this? Since you use VS2013 Ultimate, why you download VS2013 Professional update?
    As far as I know, VS2013 Ultimate and VS2013 Professional can't be installed in one machine.
    Best regards,We are trying to better understand customer views on social support experience, so your participation in this interview project would be greatly appreciated if you have time. Thanks for helping make community forums a great place.

    Click
    HERE to participate the survey.

  • RELEVANCY SCORE 2.36

    DB:2.36:Admin , Node Managed Server Error xd


    We are having two servers and in each server nodemanaged server is running. Both servers are controlled by one admin server. When admin server is running
    we are getting following errors in each of the nodemanaged logs, if any one knows please update us , what is the reason to display the following error message every 5 minutes

    [Fatal Error] :-1:-1: Premature end of file.
    [Fatal Error] :1:23: Content is not allowed in prolog.
    [Fatal Error] :1:23: Content is not allowed in prolog.
    [Fatal Error] :1:23: Content is not allowed in prolog.
    [Fatal Error] :1:23: Content is not allowed in prolog.
    [Fatal Error] :1:23: Content is not allowed in prolog.
    [Fatal Error] :1:23: Content is not allowed in prolog.
    [Fatal Error] :1:23: Content is not allowed in prolog.
    [Fatal Error] :1:23: Content is not allowed in prolog.
    [Fatal Error] :1:23: Content is not allowed in prolog.
    [Fatal Error] :1:23: Content is not allowed in prolog.
    [Fatal Error] :1:23: Content is not allowed in prolog.
    [Fatal Error] :1:23: Content is not allowed in prolog.
    [Fatal Error] :1:23: Content is not allowed in prolog.
    [Fatal Error] :1:23: Content is not allowed in prolog.
    [Fatal Error] :1:23: Content is not allowed in prolog.
    [Fatal Error] :1:23: Content is not allowed in prolog.
    [Fatal Error] :1:23: Content is not allowed in prolog.
    [Fatal Error] :1:23: Content is not allowed in prolog.
    [Fatal Error] :1:23: Content is not allowed in prolog.
    [Fatal Error] :1:23: Content is not allowed in prolog.
    [Fatal Error] :1:23: Content is not allowed in prolog.
    [Fatal Error] :1:23: Content is not allowed in prolog.
    [Fatal Error] :1:23: Content is not allowed in prolog.
    [Fatal Error] :1:23: Content is not allowed in prolog.
    [Fatal Error] :1:23: Content is not allowed in prolog.
    [Fatal Error] :1:23: Content is not allowed in prolog.
    [Fatal Error] :1:23: Content is not allowed in prolog.
    [Fatal Error] :1:23: Content is not allowed in prolog.
    [Fatal Error] :1:23: Content is not allowed in prolog.
    [Fatal Error] :1:23: Content is not allowed in prolog.
    [Fatal Error] :1:23: Content is not allowed in prolog.
    [Fatal Error] :1:23: Content is not allowed in prolog.
    [Fatal Error] :1:23: Content is not allowed in prolog.
    [Fatal Error] :1:23: Content is not allowed in prolog.
    [Fatal Error] :1:23: Content is not allowed in prolog.
    [Fatal Error] :1:23: Content is not allowed in prolog.
    [Fatal Error] :1:23: Content is not allowed in prolog.
    [Fatal Error] :1:23: Content is not allowed in prolog.
    [Fatal Error] :1:27: The markup in the document preceding the root element must be well-formed.
    [Fatal Error] :1:23: The markup in the document preceding the root element must be well-formed.
    [Fatal Error] :1:32: XML document structures must start and end within the same entity.
    [Fatal Error] :1:72: XML document structures must start and end within the same entity.
    [Fatal Error] :-1:-1: Premature end of file.
    [Fatal Error] :1:23: Content is not allowed in prolog.
    [Fatal Error] :1:23: Content is not allowed in prolog.
    [Fatal Error] :1:23: Content is not allowed in prolog.
    [Fatal Error] :1:23: Content is not allowed in prolog.
    [Fatal Error] :1:23: Content is not allowed in prolog.
    [Fatal Error] :1:23: Content is not allowed in prolog.
    [Fatal Error] :1:23: Content is not allowed in prolog.
    [Fatal Error] :1:23: Content is not allowed in prolog.
    [Fatal Error] :1:23: Content is not allowed in prolog.
    [Fatal Error] :1:23: Content is not allowed in prolog.
    [Fatal Error] :1:23: Content is not allowed in prolog.
    [Fatal Error] :1:23: Content is not allowed in prolog.
    [Fatal Error] :1:23: Content is not allowed in prolog.
    [Fatal Error] :1:23: Content is not allowed in prolog.
    [Fatal Error] :1:23: Content is not allowed in prolog.
    [Fatal Error] :1:23: Content is not allowed in prolog.
    [Fatal Error] :1:23: Content is not allowed in prolog.
    [Fatal Error] :1:23: Content is not allowed in prolog.
    [Fatal Error] :1:23: Content is not allowed in prolog.
    [Fatal Error] :1:23: Content is not allowed in prolog.
    [Fatal Error] :1:23: Content is not allowed in prolog.
    [Fatal Error] :1:23: Content is not allowed in prolog.
    [Fatal Error] :1:23: Content is not allowed in prolog.
    [Fatal Error] :1:23: Content is not allowed in prolog.
    [Fatal Error] :1:23: Content is not allowed in prolog.
    [Fatal Error] :1:23: Content is not allowed in prolog.
    [Fatal Error] :1:23: Content is not allowed in prolog.
    [Fatal Error] :1:23: Content is not allowed in prolog.
    [Fatal Error] :1:23: Content is not allowed in prolog.
    [Fatal Error] :1:23: Content is not allowed in prolog.
    [Fatal Error] :1:23: Content is not allowed in prolog.
    [Fatal Error] :1:23: Content is not allowed in prolog.
    [Fatal Error] :1:23: Content is not allowed in prolog.
    [Fatal Error] :1:23: Content is not allowed in prolog.
    [Fatal Error] :1:23: Content is not allowed in prolog.
    [Fatal Error] :1:23: Content is not allowed in prolog.
    [Fatal Error] :1:23: Content is not allowed in prolog.
    [Fatal Error] :1:23: Content is not allowed in prolog.
    [Fatal Error] :1:23: Content is not allowed in prolog.
    [Fatal Error] :1:23: Content is not allowed in prolog.
    [Fatal Error] :1:27: The markup in the document preceding the root element must be well-formed.
    [Fatal Error] :1:23: The markup in the document preceding the root element must be well-formed.
    [Fatal Error] :1:32: XML document structures must start and end within the same entity.
    [Fatal Error] :1:72: XML document structures must start and end within the same entity.

    DB:2.36:Admin , Node Managed Server Error xd

    Hi,

    One of our customers is facing similar issue. We've developed a monitor that uses JMX to collect performance metrix from the WebLogic. The customer is complaining that the AdminServer.stderr is filled with these errors whenever he runs the monitor. So i'm very curious to know what changes were made in this case to fix the problem. Please let me know on this.

    Thanks,
    Krishna

  • RELEVANCY SCORE 2.36

    DB:2.36:Error While Installing R12.1.1 On Windows 2003 d9


    Dear all,i have error while Installing ebs on stage 3-5log file here : http://www.mediafire.com/download/fc91007a6rcaj09/ebslog.rar | 3% completed / 3% completed - 3% completed \ 3% completed | 3% completed / 3% completed - 3% completed \ 3% completed | 3% completed / 3% completed - 3% completed \ 3% completed RC-50004: Fatal: Error occurred in ApplyAppsTechStack: RC-50013: Fatal: Failed to instantiate driver C:\oracle\VIS\apps\tech_st\10.1.3\appsutil\driver\regclone.drvC:\DOCUME~1\EBS\LOCALS~1\Tempif 1 == 0 goto :REG_OK C:\DOCUME~1\EBS\LOCALS~1\Tempecho Cannot execute registration of Applications Techstack Cannot execute registration of Applications TechstackC:\DOCUME~1\EBS\LOCALS~1\Tempif "" == "TRUE" goto :INSIAS_OK RW-50010: Error: - script has returned an error: 1RW-50004: Error code received when running external process. Check log file for details.Running APPL_TOP Install Driver for VIS instance

    DB:2.36:Error While Installing R12.1.1 On Windows 2003 d9

    Hi,Did you check my previous reply.The timeout issue is specified in your logfile "vis-inst-apps-vis-admin-log-ApplyAppsTechStack_06171702"Regards

  • RELEVANCY SCORE 2.36

    DB:2.36:Officejet F4280, Fatal Error 2753 On Install dj



    When installing the software I got the message "Fatal error 2753. Fatal error. msi.dot.4wrp.

    Help Please

    DB:2.36:Officejet F4280, Fatal Error 2753 On Install dj


    Hi smokie1201,

    Thank you for visiting the HP Support Forums. This is a user-to-user community, and not a venue to receive direct
    help or feedback from HP. If you need to contact HP directly HP about their products or services, please use the link below:http://welcome.hp.com/country/us/en/wwcontact_us.h​tmlIf you have any further questions or concerns, please feel free to send me a Private Message. Thanks!

  • RELEVANCY SCORE 2.36

    DB:2.36:Ucs Vm Installation Fails - Fatal Error 1p



    Hi

    While installing VMWare 4.0.0 on UCS-C210M2, installation fails with error message - Installation operation has encountered fatal error.

    Here I have attached, error message screenshot.

    Pls. suggest what could be wrong.

    DB:2.36:Ucs Vm Installation Fails - Fatal Error 1p


    Rajesh,

    Sorry, I have no other input at this time.

    Regards,

    Bill

  • RELEVANCY SCORE 2.36

    DB:2.36:Photosmart Essential 3.5 Download Button j8



    Hi,

    Trying upadate Photoessential software to version 3.5..

    The site says to click on the download button!

    There is NO download button...only a selection

    for a Mac download...

    Is there something I am missing?

    I have :

    Windows Vista SP2

    Photosmart 3210 printer

    Photosmart Essential 2.0

    thanks

    Tony

    DB:2.36:Photosmart Essential 3.5 Download Button j8


    Hi,

    Trying upadate Photoessential software to version 3.5..

    The site says to click on the download button!

    There is NO download button...only a selection

    for a Mac download...

    Is there something I am missing?

    I have :

    Windows Vista SP2

    Photosmart 3210 printer

    Photosmart Essential 2.0

    thanks

    Tony

  • RELEVANCY SCORE 2.36

    DB:2.36:Installation 2908 Windows 7 64 3z


    I tried installing Expression Studio (MSDN) on Windows 7 64 bit and it fails with a 2908 error. Here is the important parts of the log:Property(S): ProductToBeRegistered = 1MSI (s) (E0:E8) [17:49:30:411]: Product: Microsoft Expression Encoder 3 -- Installation failed.
    MSI (s) (E0:E8) [17:49:30:412]: Windows Installer installed the product. Product Name: Microsoft Expression Encoder 3. Product Version: 3.0.1332.0. Product Language: 1033. Manufacturer: Microsoft Corporation. Installation success or error status: 1603.
    === Logging stopped: 8/13/2009  17:49:30 ===5:49:26 PM Thursday, August 13, 2009: Info: Config_Products_InstallNew: Product: Microsoft Expression Encoder 3 Params: F:\Setup\Encoder_en.msi ADDLOCAL=ALL HASLICENSE=********** APPID=********** PIDREGISTRYKEY=********** SUITEPIDREGISTRYKEY=********** ARPNOMODIFY=********** ARPNOREPAIR=**********5:49:30 PM Thursday, August 13, 2009: An error occurred installing the Encoder_en.msi package. Error: The installer has encountered an unexpected error installing this package. This may indicate a problem with this package. The error code is 2908. .5:49:30 PM Thursday, August 13, 2009: An error occurred installing the Encoder_en.msi package. Error: The installer has encountered an unexpected error installing this package. This may indicate a problem with this package. The error code is 2908. .5:49:30 PM Thursday, August 13, 2009: An error occurred installing the Encoder_en.msi package. Error: An error occured during the installation of assembly component {32E87714-C2CA-4931-B3A2-0CF0697B33F0}. HRESULT: 0x8002802F. .5:49:30 PM Thursday, August 13, 2009: Error: Config_Products_Install: Installation of Product Microsoft Expression Encoder 3 (failed): Fatal error during installation. Stack:    at Microsoft.WindowsInstaller.Installer.InstallProduct(String packagePath, String commandLine)    at XSetup.MsiPackage.ConfigureNewInstall(Product product)    at XSetup.Product.ConfigureNewProduct()5:49:30 PM Thursday, August 13, 2009: Info: Config_Products_InstallNew: End installation of new product: Microsoft Expression Encoder 35:49:30 PM Thursday, August 13, 2009: Info: Expecting to find local release notes at 'C:\Program Files (x86)\Microsoft Expression\Studio 3\Release Notes.html'.Hope that someone has seen thisjohn mcfetridge

    DB:2.36:Installation 2908 Windows 7 64 3z

    I tried installing Expression Studio (MSDN) on Windows 7 64 bit and it fails with a 2908 error. Here is the important parts of the log:Property(S): ProductToBeRegistered = 1MSI (s) (E0:E8) [17:49:30:411]: Product: Microsoft Expression Encoder 3 -- Installation failed.
    MSI (s) (E0:E8) [17:49:30:412]: Windows Installer installed the product. Product Name: Microsoft Expression Encoder 3. Product Version: 3.0.1332.0. Product Language: 1033. Manufacturer: Microsoft Corporation. Installation success or error status: 1603.
    === Logging stopped: 8/13/2009  17:49:30 ===5:49:26 PM Thursday, August 13, 2009: Info: Config_Products_InstallNew: Product: Microsoft Expression Encoder 3 Params: F:\Setup\Encoder_en.msi ADDLOCAL=ALL HASLICENSE=********** APPID=********** PIDREGISTRYKEY=********** SUITEPIDREGISTRYKEY=********** ARPNOMODIFY=********** ARPNOREPAIR=**********5:49:30 PM Thursday, August 13, 2009: An error occurred installing the Encoder_en.msi package. Error: The installer has encountered an unexpected error installing this package. This may indicate a problem with this package. The error code is 2908. .5:49:30 PM Thursday, August 13, 2009: An error occurred installing the Encoder_en.msi package. Error: The installer has encountered an unexpected error installing this package. This may indicate a problem with this package. The error code is 2908. .5:49:30 PM Thursday, August 13, 2009: An error occurred installing the Encoder_en.msi package. Error: An error occured during the installation of assembly component {32E87714-C2CA-4931-B3A2-0CF0697B33F0}. HRESULT: 0x8002802F. .5:49:30 PM Thursday, August 13, 2009: Error: Config_Products_Install: Installation of Product Microsoft Expression Encoder 3 (failed): Fatal error during installation. Stack:    at Microsoft.WindowsInstaller.Installer.InstallProduct(String packagePath, String commandLine)    at XSetup.MsiPackage.ConfigureNewInstall(Product product)    at XSetup.Product.ConfigureNewProduct()5:49:30 PM Thursday, August 13, 2009: Info: Config_Products_InstallNew: End installation of new product: Microsoft Expression Encoder 35:49:30 PM Thursday, August 13, 2009: Info: Expecting to find local release notes at 'C:\Program Files (x86)\Microsoft Expression\Studio 3\Release Notes.html'.Hope that someone has seen thisjohn mcfetridge

  • RELEVANCY SCORE 2.36

    DB:2.36:Fatal Error During Installation ds



    Hi

    I keep getting the following message when installing skype " fatal error during installation " and on top of the small error message square it shows " Problem With Shortcut ".

    I have deleted Skype and tried numerous times to reinstall but no luck.

    Ideas??

    DB:2.36:Fatal Error During Installation ds


    What exactly is the error message that you are receiving when installing the Portable version?

  • RELEVANCY SCORE 2.35

    DB:2.35:Fatal: Ds003 a8



    Trying to install suite 5 and evry time after installing it states not installed because:

    Exit Code: 6

    Please see specific errors and warnings below for troubleshooting. For example, ERROR: DS003, DW050 ...

    -------------------------------------- Summary --------------------------------------

    - 1 fatal error(s), 2 error(s), 0 warning(s)

    ----------- Payload: {02362998-480C-4191-885A-A25B917C0D80} Adobe FrameMaker 11 11.0.0.0 -----------

    FATAL: DS003: Cannot extract 'V:\Adobe Technical Communication Suite 4\payloads\AdobeFrameMaker11_LI\Assets1_1.zip' to 'C:\Program Files\Common Files\Adobe\Installers\adobeTemp\{02362998-480C-4191-885A-A25B917C0D80}'. Error: Error 183 Cannot create a file when that file already exists.

    ERROR: DW050: The following payload errors were found during install:

    ERROR: DW050: - Adobe FrameMaker 11: Failed due to Language Pack installation failure

    ERROR: DW050: - Adobe FrameMaker 11_AdobeFrameMaker11_en_US: Install failed

    ANY IDEA HOW I CAN INSTALL? ALREADY TRIED ADOBE CLEANER, RECOPYING ORIGINAL PROGRAM, INSTALLING UNDER A DIFFERENT ADOBE USER, RESTARTING SEVERAL TIMES, ETC.

    ANY HELP GREATLY APPRECIATED, MANY THANKS FOR LOOKING

    DB:2.35:Fatal: Ds003 a8


    Hi claryfrederick,

    Please refer the Kb Doc : http://helpx.adobe.com/creative-suite/kb/error-exit-6-exit-7.html.

    Please see Troubleshoot with install logs | CS5, CS5.5, CS6 - http://helpx.adobe.com/creative-suite/kb/troubleshoot-install-logs-cs5-cs5.html for information on how to review your installation logs

  • RELEVANCY SCORE 2.35

    DB:2.35:Fatal Error cf



    I cannot get past 96% installing hp c4280 on hp vista laptop. I get fatal error. What can I do

    DB:2.35:Fatal Error cf


    I cannot get past 96% installing hp c4280 on hp vista laptop. I get fatal error. What can I do

  • RELEVANCY SCORE 2.35

    DB:2.35:Hiq 4.5 Examples Don't Work za


    After installing HiQ 4.5 on Win2000 SP4 machine none of the examples work, most give error message"Fatal error in line 1"

    DB:2.35:Hiq 4.5 Examples Don't Work za

    I got a same error.I simply solved it by calling HiQ into the explorer(c:\program files\National Instruments\HiQ\program)This method seems magic.After I can call HiQ by this shortcut and all scripts are OK.Let me know if you get also success!

  • RELEVANCY SCORE 2.35

    DB:2.35:Fatal Error During Install .Net 4.0 c3


    Stops me from installing as soon as the download part ends
    Log:
    OS Version = 5.1.2600, Platform 2, Service Pack 3
    OS Description = WinXP - x86 Professional Service Pack 3

    DB:2.35:Fatal Error During Install .Net 4.0 c3

    Hi SkyCrank11,

    Welcome to the MSDN forum.

    Could you please remove the WIC first? If you have any questions about removing WIC, I recommend you go to Microsoft Answer to ask for help.
    Microsoft Answer Forum:
    http://answers.microsoft.com/en-us/windows/forum/windows_xp

    After you have remove WIC, I recommend you download it again from here:
    http://www.microsoft.com/downloads/en/details.aspx?FamilyId=8E011506-6307-445B-B950-215DEF45DDD8displaylang=en

    If the above suggestion doesn't work, you might be required a machine to be restored or an in-place upgrade to be performed to recover it. For one quicker
    way to repair OS or restore the OS configuration to an earlier point.

    If you have any concern, please feel free to let me know.

    Best Regards,

    Alexander Sun [MSFT]
    MSDN Community Support | Feedback to us
    Get or Request Code Sample from Microsoft
    Please remember to mark the replies as answers if they help and unmark them if they provide no help.

  • RELEVANCY SCORE 2.35

    DB:2.35:Error 3103 File Manager Fatal Error mk


    Need help resolving error #3012 and 3103 file manager fatal error. Recieved the error after un-installing and re-installing PSQL pervasive and starting database application. TCP/IP database connection is working. Any idea as to what I can do to fix error

    DB:2.35:Error 3103 File Manager Fatal Error mk

    Hi Amritha,

    Thanks for responding. The links were useful

  • RELEVANCY SCORE 2.35

    DB:2.35:"Fatal Error" And "Msi.Netdevicemanager40" While Installing Photosmart B110a dj



    I am unable to install Hp printer software and it is showing"fatal error" and "MSI.netdevicemanager40" while installing photosmart B110a....please help

    DB:2.35:"Fatal Error" And "Msi.Netdevicemanager40" While Installing Photosmart B110a dj


    I am unable to install Hp printer software and it is showing"fatal error" and "MSI.netdevicemanager40" while installing photosmart B110a....please help

  • RELEVANCY SCORE 2.35

    DB:2.35:L7680 Networkprinter Windows7 Fatal.Error md



    While installing the networkprinter I get a fatal error: msi.netdevicemanager40 ongeldig station t:\.

    What to do?

    DB:2.35:L7680 Networkprinter Windows7 Fatal.Error md


    While installing the networkprinter I get a fatal error: msi.netdevicemanager40 ongeldig station t:\.

    What to do?

  • RELEVANCY SCORE 2.35

    DB:2.35:Error Loading Lightroom ad


    Hi I am getting this error when I try and load lightroom -Exit Code: 7 Please see specific errors below for troubleshooting. For example, ERROR: -------------------------------------- Summary -------------------------------------- - 0 fatal error(s), 3 error(s) ----------- Payload: Adobe Photoshop Lightroom 5 5.6.0.0 Adobe_Lightroom_x64.msi_5.6 ----------- ERROR: Key not valid for use in specified state. ERROR: Install MSI payload failed with error: 1603 - Fatal error during installation. MSI Error message: Key not valid for use in specified state. ERROR: Third party payload installer Adobe_Lightroom_x64.msi failed with exit code: 1603 -------------------------------------

  • RELEVANCY SCORE 2.35

    DB:2.35:Fatal Error When Installing Officejet L7680, Help jp



    installing my officejet on older laptop that runs XP. Getting a fatal error message.... invalid drive X:\ says ask hp about "fatal error" and "MSI.BPD_Scan" but when I go to HP support there is no help for this type of error, can anybody help with this? thanks !

    DB:2.35:Fatal Error When Installing Officejet L7680, Help jp


    installing my officejet on older laptop that runs XP. Getting a fatal error message.... invalid drive X:\ says ask hp about "fatal error" and "MSI.BPD_Scan" but when I go to HP support there is no help for this type of error, can anybody help with this? thanks !

  • RELEVANCY SCORE 2.35

    DB:2.35:Ucs Vmware Installation - Fatal Error am



    Hi

    I have UCS-C210M2

    Installing VMWare 4.0.0 through CIMC console.

    While starting the installation, I am getting error message - Installation operation has encountered fatal error.

    Here I have attached, RAID configuration screenshot, firmware virsion. BIOS version and bootoption screenshot

    and error message screenshot.

    Pls. suggest.

    DB:2.35:Ucs Vmware Installation - Fatal Error am


    Hi

    I have UCS-C210M2

    Installing VMWare 4.0.0 through CIMC console.

    While starting the installation, I am getting error message - Installation operation has encountered fatal error.

    Here I have attached, RAID configuration screenshot, firmware virsion. BIOS version and bootoption screenshot

    and error message screenshot.

    Pls. suggest.

  • RELEVANCY SCORE 2.35

    DB:2.35:Scanning 3055 Error 2753 Aec Ver 3 fm



    I've been having problem re installing the software for my laser jet 3055. I kept getting a fatal error 2753. I down loaded the AEC version 3 software but the scanner wont work correctly. will only scan 1 page and wont scan into PDF files.

    Please help.

    DB:2.35:Scanning 3055 Error 2753 Aec Ver 3 fm


    I've been having problem re installing the software for my laser jet 3055. I kept getting a fatal error 2753. I down loaded the AEC version 3 software but the scanner wont work correctly. will only scan 1 page and wont scan into PDF files.

    Please help.

  • RELEVANCY SCORE 2.34

    DB:2.34:Solaris 8 Install On Ultra 5 da


    Hello,

    I have an Ultra 5 with SunOS 5.8 installed. There is one 9Gb internal disk. I am installing Solaris 8 on the Ultra5 and get the following errors repeatedly for different Requested Blocks. They start after the "- Reboot After Installation?" page is confirmed..(last step on disk 1 of install cds). The system is meant to configure its disk here but this error starts.....

    WARNING:/pci@1f,0/pci@1,1/ide@3/sd@2,0 (sd0):

    Error for Command: read(10)Error Level: Retryable/Fatal

    Requested Block:166735Error Block:166735Vendor:LG

    Serial Number:Sense Key:Media Error

    ASC: 0x2 (no seek complete), ASCQ: 0x0, FRV: 0x0

    all suggestions welcome,
    g

    DB:2.34:Solaris 8 Install On Ultra 5 da

    thanks for the replies.....it ran the second time without issues.....i'll check those diagnostics and see how it looks...

  • RELEVANCY SCORE 2.34

    DB:2.34:Fatal Error In Vxd Au30wave (01) ss


    After installing DirectX8, some of my older games will not work, they crash out after running through the video clip intro's for each game (Driver, The SIMS) and I end up with a blue screen Fatal error message in VXD AU30WAVE (01). I have downloaded the updated drivers from DELL... it took 3 hours.. and installed them today.. but still the games will not work. Can anyone help?

    DB:2.34:Fatal Error In Vxd Au30wave (01) ss

    tried re-installing from original drivers... still getting fatal error messages

  • RELEVANCY SCORE 2.34

    DB:2.34:Problems Installing Exchange 2010 Unified Messaging Role ja


    I am trying to install UM Role on an Exchange Server 2010 SP1 and I get the following error.

    Summary: 3 item(s). 1 succeeded, 1 failed.
    Elapsed time: 00:00:27

    Preparing Setup
    Completed

    Elapsed Time: 00:00:18

    Unified Messaging Role
    Failed

    Error:
    The following error was generated when $error.Clear();

    install-MsiPackage -PackagePath $RolePackagePath -LogFile $RoleLogFilePath -UpdatesDir $RoleUpdatesDir -PropertyValues (INSTALLDIR=` $RoleInstallPath ` ESE=1);

    was run: Installing product D:\en\UMLanguagePack.en-US.msi failed. Fatal error during installation. Error code is 1603. Last error reported by the MSI package is 'Could not find any previously installed compliant products on the machine for installing
    this product.'..

    Installing product D:\en\UMLanguagePack.en-US.msi failed. Fatal error during installation. Error code is 1603. Last error reported by the MSI package is 'Could not
    find any previously installed compliant products on the machine for installing this product.'.

    Fatal error during installation
    Click here for help... http://technet.microsoft.com/en-US/library/ms.exch.err.default(EXCHG.141).aspx?v=14.1.218.11e=ms.exch.err.Ex88D115l=0cl=cp

    Elapsed Time: 00:00:09

    Finalizing

    Cancelled
    All of the prerequisites pass. I have tried to install UMLanguagePack.en-US.msi seperatly on its own and it fails as well.
    Here is the exchange Setup log as well

    [10/24/2010 03:34:03.0748] [2] Installing MSI package 'D:\en\UMLanguagePack.en-US.msi'.
    [10/24/2010 03:34:03.0764] [2] Installing a new product. Package: D:\en\UMLanguagePack.en-US.msi. Property values: INSTALLDIR=C:\Program Files\Microsoft\Exchange Server\V14\ ESE=1 REBOOT=ReallySuppress
    [10/24/2010 03:34:10.0090] [2] [ERROR] Unexpected Error
    [10/24/2010 03:34:10.0090] [2] [ERROR] Installing product D:\en\UMLanguagePack.en-US.msi failed. Fatal error during installation. Error code is 1603. Last error reported by the MSI package is 'Could not find any previously installed compliant products on
    the machine for installing this product.'.
    [10/24/2010 03:34:10.0090] [2] [ERROR] Fatal error during installation
    [10/24/2010 03:34:10.0200] [2] Ending processing install-MsiPackage
    [10/24/2010 03:34:10.0262] [1] The following 1 error(s) occurred during task execution:
    [10/24/2010 03:34:10.0278] [1] 0. ErrorRecord: Installing product D:\en\UMLanguagePack.en-US.msi failed. Fatal error during installation. Error code is 1603. Last error reported by the MSI package is 'Could not find any previously installed compliant products
    on the machine for installing this product.'.
    [10/24/2010 03:34:10.0278] [1] 0. ErrorRecord: Microsoft.Exchange.Configuration.Tasks.TaskException: Installing product D:\en\UMLanguagePack.en-US.msi failed. Fatal error during installation. Error code is 1603. Last error reported by the MSI package is
    'Could not find any previously installed compliant products on the machine for installing this product.'. --- System.ComponentModel.Win32Exception: Fatal error during installation
    --- End of inner exception stack trace ---
    [10/24/2010 03:34:10.0309] [1] [ERROR] The following error was generated when $error.Clear();
    install-MsiPackage -PackagePath $RolePackagePath -LogFile $RoleLogFilePath -UpdatesDir $RoleUpdatesDir -PropertyValues (INSTALLDIR=` $RoleInstallPath ` ESE=1);
    was run: Installing product D:\en\UMLanguagePack.en-US.msi failed. Fatal error during installation. Error code is 1603. Last error reported by the MSI package is 'Could not find any previously installed compliant products on the machine for installing
    this product.'..
    [10/24/2010 03:34:10.0309] [1] [ERROR] Installing product D:\en\UMLanguagePack.en-US.msi failed. Fatal error during installation. Error code is 1603. Last error reported by the MSI package is 'Could not find any previously installed compliant products on
    the machine for installing this product.'.
    [10/24/2010 03:34:10.0309] [1] [ERROR] Fatal error during installation
    [10/24/2010 03:34:10.0309] [1] [ERROR-REFERENCE] Id=UmLanguagePackComponent___98c7f337c1334ef59c2ac59e52813c12 Component=EXCHANGE14:\Current\Release\Client Access\Unified Messaging
    [10/24/2010 03:34:10.0309] [1] Setup is stopping now because of one or more critical errors.
    [10/24/2010 03:34:10.0309] [1] Finished executing component tasks.
    [10/24/2010 03:34:10.0450] [1] Ending processing Install-UnifiedMessagingRole

    Any help is appreciated.

    Jim

    DB:2.34:Problems Installing Exchange 2010 Unified Messaging Role ja

    Jim,

    Thanks for posting your response. Iexperienced the same thing; trying to install the MS Exchange UM role on an existing Exchange server. After beating my head against the proverbial wall for a few hours, I found this post and was able to install the
    role using Programs and Features.

    Thanks!

    Dave Dave Schuck

  • RELEVANCY SCORE 2.34

    DB:2.34:Fatal Error 17


    I get a fatal error during instalation message, when I try to uninstal program. microsoft .NET Framework 2.0 Service Pack 2+3.

    DB:2.34:Fatal Error 17


    http://support.microsoft.com/kb/KB976982

    See if the above info helps.

    Cheers.

    Mick Murphy - Microsoft Partner

  • RELEVANCY SCORE 2.34

    DB:2.34:Rc-20200: Fatal: Could Not Find Unzip. At This Time Only Native Unzip 5.X I 8m


    Hi,

    I getting the error as below while installing 11i on Oralce Linux Server 6

    RC-20200: Fatal: Could not find Unzip. At this time only Native UnZip 5.X is supported.

    Please make sure you have UnZip 5.X in your path and try again...

    Unzip version is UnZip 5.52

    Thanks
    Regards
    GSM

  • RELEVANCY SCORE 2.34

    DB:2.34:While Installing Labview 7 Express On Ms2000, I Get "Fatal Error Unhandled Msi Error" 31


    Setup program fails after the second aceptance screen.

    DB:2.34:While Installing Labview 7 Express On Ms2000, I Get "Fatal Error Unhandled Msi Error" 31

    Chris,The MSI Error implies that the Microsoft Installer(MSI) Engine crashed. This is the software that handles all installation and uninstallation on your computer.I am assuming you are using Windows 2000. If so you can download and install the MSI engine from Microsoft here.Just download and run the installer and it will install MSI engine 2.0

  • RELEVANCY SCORE 2.34

    DB:2.34:Issues After Installing Service Pack 3 For Xp 9f


    I have just installed service pack 3 for XP - restarted the computer as required now after the windows start up screen shows as loading I get a fatal exception error (blue screen of death) and it restarts itself - HELP I cant get my computer to turn on
    now!

    DB:2.34:Issues After Installing Service Pack 3 For Xp 9f

    Might be an AMD system I think. If youre near Otahuhu, I could have a look

  • RELEVANCY SCORE 2.34

    DB:2.34:Exit Code 15: Installation Failed. 0 Fatal 1 Error. Error: Media Db Error : 12 While Installing Premiere Pro And Photoshop Through Cloud a1


    Exact error message as follows:There was a problem installing Premiere Pro 2014.... Installation failed. Installation encountered an error. Please restart system and try again (15) Exit code 15 0 fatal 1 error. Error: media DB : 12

    DB:2.34:Exit Code 15: Installation Failed. 0 Fatal 1 Error. Error: Media Db Error : 12 While Installing Premiere Pro And Photoshop Through Cloud a1

    Ahparks I reviewed case 0185834615 and there is a pending message to you from our support team on August 26. If you can please update your case regarding your status it will allow the issues you are facing to be resolved. Please make sure to check the inbox of the e-mail address associated with your account. If you do not see the message then I would recommend checking your SPAM folder.

  • RELEVANCY SCORE 2.34

    DB:2.34:Cannot Install Expand zs





    Just downloaded: expand_installer-2.7.3-5.sh and attempted to run the script but received the following error:

    A fatal error occurred when installing Plesk Expand. Unable to determine which is OS release CentOS release 5.2 (Final)

    DB:2.34:Cannot Install Expand zs




    I am sorry, install of Expand by autoinstaller on CentOS 5.2 is not supported.

  • RELEVANCY SCORE 2.34

    DB:2.34:Lightroom 5 Not Installing f3



    Exit Code: 7

    Please see specific errors below for troubleshooting. For example, ERROR: DW006 ...

    -------------------------------------- Summary --------------------------------------

    - 0 fatal error(s), 2 error(s)

    ----------- Payload: AdobeLightroom5CCMPkg-mul 5.2.0.0 {4b06fc24-6249-4c57-9830-6008a3ce9a80} -----------

    ERROR: DW006: Apple Package failed to install successfully.

    ERROR: Third party payload installer Adobe Photoshop Lightroom 5.pkg failed with exit code: 1

    -------------------------------------------------------------------------------------

    DB:2.34:Lightroom 5 Not Installing f3


    Hi donaldmullaney,

    Please specify the version of MAC you are using. Refer the kb for Exit Code 7: http://helpx.adobe.com/creative-suite/kb/errors-exit-code-6-exit.html .

    Regards,

    Romit Sinha

  • RELEVANCY SCORE 2.34

    DB:2.34:Fatal Error Message m7



    How can I fix the fatal error message "acrobat failed to load its core DLL" for Windows 7. I have tried installing an older version - nothing is working.

    DB:2.34:Fatal Error Message m7


    See the below forum link : http://forums.adobe.com/message/5204430#5204430

  • RELEVANCY SCORE 2.34

    DB:2.34:Error Write To Cwindowsinstaller1397b.Msi. Fatal Error Msi.Net Device Manager 40 While Installing Hp Printer Software x8


    Original title: MSI.net device manager fatal error

    I get this message when installing HP C4780 printer software on Windows 7 home premium. "write to c:\windows\installer\1397b.msi Fatal Error MSI.NET device manager 40. The installation program fails to load and uninstalls. I spent 5 hours with HP support.
    No joy. Had this problem with another HP printer on the same HP laptop. There is a solution involving changing 2 dll's as I remember, but anyone know which ones and how to fix this?

    DB:2.34:Error Write To Cwindowsinstaller1397b.Msi. Fatal Error Msi.Net Device Manager 40 While Installing Hp Printer Software x8

    Hi HOtrains,

    Follow the methods listed below:

    Method 1:

    Step 1:

    Unregister and then reregister Windows Installer. To do this, follow these steps:

    a.ClickStart, type
    cmd, right-click and select Run as administrator.
    b.Type the following commands and hit Enter after each command:

    msiexec /unreg
    msiexec /regserver

    Method 2:

    Step 1: Uninstall the printer software completely and reinstall the latest printer drivers

    Refer the following article for instructions on uninstalling printer software from your computer.

    Uninstalling the Printer Software

    Step 2:

    After uninstalling the printer software, download and install the latest drivers from the link below:

    HP Photosmart C4780 All-in-One Printer Software Driver Downloads

    Note: Select the appropriate version (32-bit/64-bit) of Windows 7 and proceed to the download page.

    Method 3:

    If method 1 and 2fail, I’d suggest you to temporarilydisable antivirus software (and other security software) andfirewall
    on the computer as a test.

    Once disabled, try and install the drivers and check if that fixes the issue.

    If disabling the antivirus software fixes the issue, you may have to configure the settings of the antivirus program accordingly. Please contact the software vendor for further assistance in this regard.

    Note: Make sure you enable the antivirus software, other security programs, and firewall.

    Warning

    Antivirus software can help protect your computer against viruses and other security threats. In most cases, you shouldn't disable your antivirus software. If you have to temporarily disable it to install other software, you should re-enable it as
    soon as you're done. If you're connected to the Internet or a network while your antivirus software is disabled, your computer is vulnerable to attacks.

    Hope this information helps.

    Gokul - Microsoft Support

    [If this post was helpful, please click the "Vote as Helpful" (green triangle) button. If it helps in resolving your issue, click "Propose As Answer" or "Mark as Answer" button. By proposing/marking a post as Answered, or Helpful you help others find the answer
    faster.]

  • RELEVANCY SCORE 2.34

    DB:2.34:Error Messages Installing Photoshop And Lightroom pk


    Trying to install Lightroom and Photoshop CC - getting this error message on both:Exit Code: 7 Please see specific errors below for troubleshooting. For example, ERROR: -------------------------------------- Summary -------------------------------------- - 0 fatal error(s), 3 error(s) ----------- Payload: Adobe Photoshop Lightroom 5 5.4.0.0 Adobe_Lightroom_x64.msi_5.4 ----------- ERROR: An error occurred during the installation of assembly component {5C21D397-1DA5-3749-8C1F-165F21DE9E3E}. HRESULT: 0x80070BC9. ERROR: Install MSI payload failed with error: 1603 - Ett allvarligt fel intrffade under installationen. MSI Error message: An error occurred during the installation of assembly component {5C21D397-1DA5-3749-8C1F-165F21DE9E3E}. HRESULT: 0x80070BC9. ERROR: Third party payload installer Adobe_Lightroom_x64.msi failed with exit code: 1603 -------------------------------------------------------------------------------------

    DB:2.34:Error Messages Installing Photoshop And Lightroom pk

    Miath71 please see Error "Exit 6" or "Exit 7" | Install log | Read, write, system file errors | CS5, CS5.5 - http://helpx.adobe.com/creative-suite/kb/error-exit-6-exit-7.html for information on how to resolve Exit Code 7.

  • RELEVANCY SCORE 2.33

    DB:2.33:Qmail Problem: Qmail-Inject: Fatal Mail Server Permanently Rejected Message (#5.3.0) zs





    Another bug since upgrade. Sometimes I cant send mails over our server and get this error message in outlook

    Code:

    DB:2.33:Qmail Problem: Qmail-Inject: Fatal Mail Server Permanently Rejected Message (#5.3.0) zs




    We were having some issues with the qmail reject message.

    What originally happened, was that we were subjected to a large spam flood, either directly or as a result of backscatter where a spammer used a spoofed email address at one of the hosted domains and poorly configured email servers sent bounce messages to that from address instead of the originating mailserver.

    This resulted in a huge backlog of mails on the server. The queue was so large that Plesk freezed when we tried to open the mail queue through the Plesk interface.

    This was the queue:

    # /var/qmail/bin/qmail-qstat
    messages in queue: 433547
    messages in queue but not yet preprocessed: 0

    Clearing of the mail queue took longer than expected. The mail queue was cleared and mail services were expected be functioning normally.

    However, the server used an outside service to scrub the incoming mail for SPAM and malware. And after pushing out the queue it seems that our mail server was now rejecting emails from our cleaning server.

    The server providing the scrubbing services received the following message when it attempted to forward the clean mail to the mail server:

    (we changd the IPs and domain names when pasting this message)

    Fri 2008-06-13 10:16:14: ----------
    Fri 2008-06-13 10:16:14: Session 7267; child 1
    Fri 2008-06-13 10:16:12: Parsing message c:\mdaemon\queues\remote\pd50001352590.msg
    Fri 2008-06-13 10:16:12: * From: user@comcast.net
    Fri 2008-06-13 10:16:12: * To: user@blah.com
    Fri 2008-06-13 10:16:12: * Subject: RE: Peninsula Power website - Contact Us info not updatable
    Fri 2008-06-13 10:16:12: * Message-ID: 001101c8cd5f$9b9f6180$6701a8c0@DadsMachine
    Fri 2008-06-13 10:16:12: * Route slip host: 1.1.1.1
    Fri 2008-06-13 10:16:12: * Route slip port: 25
    Fri 2008-06-13 10:16:12: Attempting SMTP connection to [1.1.1.1]
    Fri 2008-06-13 10:16:12: Attempting SMTP connection to [1.1.1.1:25]
    Fri 2008-06-13 10:16:12: Waiting for socket connection...
    Fri 2008-06-13 10:16:13: * Connection established (1.1.1.1:1716 - 1.1.1.1:25)
    Fri 2008-06-13 10:16:13: Waiting for protocol to start...
    Fri 2008-06-13 10:16:13: -- 220 itoniq.com ESMTP
    Fri 2008-06-13 10:16:13: -- EHLO blah.mailcleaner.com
    Fri 2008-06-13 10:16:13: -- 250-blah.com
    Fri 2008-06-13 10:16:13: -- 250-AUTH=LOGIN CRAM-MD5 PLAIN
    Fri 2008-06-13 10:16:13: -- 250-AUTH LOGIN CRAM-MD5 PLAIN
    Fri 2008-06-13 10:16:13: -- 250-STARTTLS
    Fri 2008-06-13 10:16:13: -- 250-PIPELINING
    Fri 2008-06-13 10:16:13: -- 250 8BITMIME
    Fri 2008-06-13 10:16:13: -- MAIL From:user@comcast.net
    Fri 2008-06-13 10:16:13: -- 250 ok
    Fri 2008-06-13 10:16:13: -- RCPT To:user@blah.com
    Fri 2008-06-13 10:16:13: -- 250 ok
    Fri 2008-06-13 10:16:13: -- DATA
    Fri 2008-06-13 10:16:13: -- 354 go ahead
    Fri 2008-06-13 10:16:13: Sending c:\mdaemon\queues\remote\pd50001352590.msg to [1.1.1.1]
    Fri 2008-06-13 10:16:13: Transfer Complete
    Fri 2008-06-13 10:16:14: -- qmail-inject: fatal: mail server permanently rejected message (#5.3.0)
    Fri 2008-06-13 10:16:14: -- QUIT
    Fri 2008-06-13 10:16:14: -- 554 mail server permanently rejected message (#5.3.0)
    Fri 2008-06-13 10:16:14: -- QUIT
    Fri 2008-06-13 10:16:14: Socket connection closed by the other side (how rude!)
    Fri 2008-06-13 10:16:14: SMTP session terminated (Bytes in/out: 316/29174)
    Fri 2008-06-13 10:16:14: ----------

    These are the steps we followed to solve the issue:

    1. disable Dr.Web and your email will work while you fix this.
    2. login to your server and su -
    3. cd /var/qmail/bin
    3. cp qmail-queue.origin qmail-queue.orig
    4. chown qmailq qmail-queue.orig
    5. restart DrWeb and smtp server from the control panel and it will work.

    Apparently, Plesk and Dr. Web has issues working together.

    We hope you find this information useful.

  • RELEVANCY SCORE 2.33

    DB:2.33:Error On 6506 1d



    We got the below message from 6506 and I am not sure what does this means. Can anyone help me in understanding the below error

    Feb  5 13:18:17 EST: %EARL_L3_ASIC-SP-3-INTR_WARN: EARL L3 ASIC: Non-fatal interrupt Decision Engine block interrupt

    Feb  5 13:19:17 EST: %EARL_L3_ASIC-SP-3-INTR_WARN: EARL L3 ASIC: Non-fatal interrupt Decision Engine block interrupt

    Feb  5 13:20:17 EST: %EARL_L3_ASIC-SP-3-INTR_WARN: EARL L3 ASIC: Non-fatal interrupt Decision Engine block interrupt

    Feb  5 13:21:17 EST: %EARL_L3_ASIC-SP-3-INTR_WARN: EARL L3 ASIC: Non-fatal interrupt Decision Engine block interrupt

    Feb  5 13:22:17 EST: %EARL_L3_ASIC-SP-3-INTR_WARN: EARL L3 ASIC: Non-fatal interrupt Decision Engine block interrupt

    Feb  5 13:23:17 EST: %EARL_L3_ASIC-SP-3-INTR_WARN: EARL L3 ASIC: Non-fatal interrupt Decision Engine block interrupt

    Feb  5 13:24:17 EST: %EARL_L3_ASIC-SP-3-INTR_WARN: EARL L3 ASIC: Non-fatal interrupt Decision Engine block interrupt

    Feb  5 13:25:17 EST: %EARL_L3_ASIC-SP-3-INTR_WARN: EARL L3 ASIC: Non-fatal interrupt Decision Engine block interrupt

    Feb  5 13:26:17 EST: %EARL_L3_ASIC-SP-3-INTR_WARN: EARL L3 ASIC: Non-fatal interrupt Decision Engine block interrupt

    Feb  5 13:27:17 EST: %EARL_L3_ASIC-SP-3-INTR_WARN: EARL L3 ASIC: Non-fatal interrupt Decision Engine block interrupt

    Feb  5 13:28:18 EST: %EARL_L3_ASIC-SP-3-INTR_WARN: EARL L3 ASIC: Non-fatal interrupt Decision Engine block interrupt

    Feb  5 13:29:18 EST: %EARL_L3_ASIC-SP-3-INTR_WARN: EARL L3 ASIC: Non-fatal interrupt Decision Engine block interrupt

    Feb  5 13:30:18 EST: %EARL_L3_ASIC-SP-3-INTR_WARN: EARL L3 ASIC: Non-fatal interrupt Decision Engine block interrupt

    Feb  5 13:31:18 EST: %EARL_L3_ASIC-SP-3-INTR_WARN: EARL L3 ASIC: Non-fatal interrupt Decision Engine block interrupt

    Feb  5 13:32:18 EST: %EARL_L3_ASIC-SP-3-INTR_WARN: EARL L3 ASIC: Non-fatal interrupt Decision Engine block interrupt

    Feb  5 13:33:18 EST: %EARL_L3_ASIC-SP-3-INTR_WARN: EARL L3 ASIC: Non-fatal interrupt Decision Engine block interrupt

    Feb  5 13:34:18 EST: %EARL_L3_ASIC-SP-3-INTR_WARN: EARL L3 ASIC: Non-fatal interrupt Decision Engine block interrupt

    DB:2.33:Error On 6506 1d


    http://www.cisco.com/en/US/products/hw/switches/ps708/products_tech_note09186a00801b42bf.shtml#EARL

  • RELEVANCY SCORE 2.33

    DB:2.33:Error 1 Fatal Error Rc1015: Cannot Open Include File String 3f


    Hi,I program the project with Virtual Studio 2008. I do not know how the error is thrown. can someone help me?Error 1 fatal error RC1015: cannot open include file 'string'. d:\Visual Studio 2008 Projects\SemNet\SemNet\Stdafx.h 5 SemNet
     

    1
    #include string 

    2
    #include map 

    3
    #include vector 

    4
     

    5
    using namespace std; 

    DB:2.33:Error 1 Fatal Error Rc1015: Cannot Open Include File String 3f

    Your .rc file is #including stdafx.h somehow.  Right-click it in Solution Explorer, Open With, Source Code Editor.  Verify the #includes you see. Hans Passant.