• RELEVANCY SCORE 3.06

    DB:3.06:Error Al Ejecutar Windows Anytime Upgrade En Windows 7 7p




    Recibo un error al ejecutar Windows Anytime Upgrade en Windows 7

    DB:3.06:Error Al Ejecutar Windows Anytime Upgrade En Windows 7 7p

    Esto se debe a archivos de configuración que permanecen en el sistema tras una instalación anterior incorrecta de
    Service Pack 1. Sigue los pasos de este artículo paso a paso del sitio de soporte de Microsoft para solucionarlo:
    http://support.microsoft.com/kb/2660015

  • RELEVANCY SCORE 3.06

    DB:3.06:Error 0x8007002 Al Ejecutar Solucionador De Problemas En W7 87




    error 0x8007002 al ejecutar solucionador de problemas en W7

  • RELEVANCY SCORE 3.04

    DB:3.04:Al Ejecutar Windpws Update Con Xp Sale El Error 0x80240036 3m




    No puedo instalar actualizaciones de Windows porque al ejecutar Wind0ws update con XP sale el error 0x80240036

    DB:3.04:Al Ejecutar Windpws Update Con Xp Sale El Error 0x80240036 3m

    Hola AngelesRobles León

    Lamento que tengas este código de error 0x80240036, al tratar de instalar actualizaciones de Windows Update. Este código de error tiene relación directa con la falta de instalación del Service Pack 3 de Windows XP.
    Procede con la instalación del mismo, mira los requisitos http://support.microsoft.com/kb/936929

    Inténtalo y déjanos saber si la solución fue útil o si por el contrario tienes más inquietudes, quedamos atentos a tu respuesta.
    Actualice su sistema operativo a Windows 8.
    Clic aquí.

    Responde a las consultas que te realice la comunidad, tanto si con ella obtienes una solución, como si no .Si crees que un comentario aporta a la consulta, votando como útil en
    la opción ubicada a la izquierda de la publicación. Utiliza la opción Marcar como respuesta si con un comentario has llegado a una solución. Si has encontrado la respuesta a tu consulta fuera de este sitio, comparte la misma para ayudar a otros
    con el mismo problema.

    Ingeniero de soporte Microsoft LATAM

  • RELEVANCY SCORE 2.97

    DB:2.97:Error Al Ejecutar Dcpromo En Un Servidor Windows 2008 R2 83


    Al ejecutar DCPROMO para dar de baja un servidor de dominio Windows Server 2008 R2, me aparece el siguiente mensaje:

    DB:2.97:Error Al Ejecutar Dcpromo En Un Servidor Windows 2008 R2 83

    Basicamente el problema ha sido que al no poder validarse el producto , el mismo no se reconocia como Windows Server 2008 R2. Por eso el error.

  • RELEVANCY SCORE 2.95

    DB:2.95:Problemaa Con Dns, Urgente!!! 3k


    al intentar jugar wining eleven 9, no puedo ya k el DNS me lanza un error, hay veces que me puedo conectar y otras k no, en este momento sufro de la opcion 2.

    en un topico k hay abajo de este, sobre el mismo tema lei k hay un problema similar, pero no lo entendi, quisas por que tengo una conexion con ip dinamico

    tengo una conexion de terrra, vivo en chile, mi ip es dinamico.

    me podrian ayudar lo antes posible porfavor ?

    de antemano gracias

    DB:2.95:Problemaa Con Dns, Urgente!!! 3k

    Si teneis router, probar a poner en dns primeria la direccion del router (suele ser 192.168.1.1) y la en la dns secundaria dejarla en blanco.

  • RELEVANCY SCORE 2.94

    DB:2.94:Al Ejecutar La Aplicacin Bsmobilecs.Exe Recibe El Mensaje Falta Svrpack.Dll En El Equipo pj


    BsMobileCS.exe - error del sistema

    x el programa no puede iniciarse por que falta svrpack. dll en el equipo.
    intente reinstalar el programa para corregir este problema

    sos ayudememe por fa vor

    DB:2.94:Al Ejecutar La Aplicacin Bsmobilecs.Exe Recibe El Mensaje Falta Svrpack.Dll En El Equipo pj

    ¿La aplicación es compatible con Windows 7? Intenta utilizar la misma en modo de compatibilidad como se explica en

    este sitio o de reinstalarla.

    ¿Utilizas un sistema de 32bits o 64bits? Muchas aplicaciones no pueden instalarse en 64bits si son diseñadas exclusivamente para 32bits.

    Saludos!

  • RELEVANCY SCORE 2.90

    DB:2.90:Error De Sintaxis (Falta Operador) En La Expresin De Consulta Avance Pesaje pp


    Tengo el siguiente codigo y al ejecutar, al llegar a tabla.Load(cmd.ExecuteReader) salta la excepcion del ttulo

  • RELEVANCY SCORE 2.89

    DB:2.89:Correccisn Implicita De Querys En Bd Oracle 9.2,0 ss


    Al ejecutar una query desde visual basic o sqlplus, como la que se muestra a continuacisn en una bd oracle 9i v9.2.0:
    select * from prueba where id=10order by numero

    "No devuelve ningzn tipo de error en la bd oracle 9i v9.2.0 pero al ejecutar esta
    misma query en la versisn de base de datos 9.0.1 falla la aplicacisn."

    ?La base de datos 9.2.0 hace algzn tipo de correccisn implicita de querys?

    NOTA : La query se ejecuta utilizando el mismo drives oracle oraoledb en las
    dos versiones de base de datos oracle, lo que me hace pensar que no
    es un tema del driver nativo oraoledb.

    DB:2.89:Correccisn Implicita De Querys En Bd Oracle 9.2,0 ss

    Correction:

    Pienso que Usted tiene razon. Solmanete 9,0,1 es diferentes.

    I tried the translator at http://babelfish.altavista.com when I posted my previous response. I had some Spanish classes a long time ago and it didn't look quite right, but I figured I was probably wrong and it was probably right. Then I tried translating the Spanish it provided back to English and it definitely wasn't right. It was saying I think I am right, instead of I think you are right, so I tried entering what I thought it should have been in Spanish and it translated correctly to English. The above is what it should have said. But it is a nice little site and provides a quick translation. Translating it back again is a good way to find errors. Justin, thanks for providing it.

  • RELEVANCY SCORE 2.85

    DB:2.85:Error Al Ejecutar El Asistente De Descarga De El Photoshop Cs6 La Version De Prueba. pm



    al ejecutar el instalador me sale:se ha producido un error, no se puede instalar la aplicacion, este instalador no se ha configurado correctamente.

    ya tengo el adobe air actualizado.

    DB:2.85:Error Al Ejecutar El Asistente De Descarga De El Photoshop Cs6 La Version De Prueba. pm


    Quiere decir que ya lo tienes instalado, abrelo desde Programas o dale en Inicio / Iniciar bsqueda / Adobe Download Assitant asegurate de elegir el idioma de la aplicacin antes de iniciar la descarga

  • RELEVANCY SCORE 2.85

    DB:2.85:Al Ejecutar Access 2010.Me Da El Error Error Al Iniciar La Aplicacin La Configuracin En Paralelo No Es Correcta. Consulte El Registro De Eventos De La Aplicacin Para Obtener Mas Detalles am


    Al ejecutar access 2010. Me da el error:

    Me da el error: error al iniciar la aplicación; la configuración en paralelo no es correcta. Consulte el registro de eventos de la aplicación para obtener mas detalles

    DB:2.85:Al Ejecutar Access 2010.Me Da El Error Error Al Iniciar La Aplicacin La Configuracin En Paralelo No Es Correcta. Consulte El Registro De Eventos De La Aplicacin Para Obtener Mas Detalles am

    Al ir al registro de eventos:
    Nombre de registro:Application
    Origen: SideBySide
    Fecha: 24/05/2011 23:17:35
    Id. del evento:78
    Categoría de la tarea:Ninguno
    Nivel: Error
    Palabras clave:Clásico
    Usuario: No disponible
    Equipo: Admin1
    Descripción:
    Error al generar el contexto de activación para "C:\Program Files\Microsoft Office\Office14\MSACCESS.EXE.Manifest". Error en el archivo de manifiesto o directiva "" en la línea . Una versión de componente requerida por la aplicación está en conflicto con la
    versión de otro componente activo. Los componentes en conflicto son:. Componente 1: C:\Windows\WinSxS\manifests\x86_microsoft.vc90.crt_1fc8b3b9a1e18e3b_9.0.30304.0_none_d9c474bda3593bfa.manifest. Componente 2: C:\Windows\WinSxS\manifests\x86_microsoft.vc90.crt_1fc8b3b9a1e18e3b_9.0.30729.1_none_e163563597edeada.manifest.
    XML de evento:
    Event xmlns="http://schemas.microsoft.com/win/2004/08/events/event"
    System
    Provider Name="SideBySide" /
    EventID Qualifiers="49409"78/EventID
    Level2/Level
    Task0/Task
    Keywords0x80000000000000/Keywords
    TimeCreated SystemTime="2011-05-24T21:17:35.000Z" /
    EventRecordID137640/EventRecordID
    ChannelApplication/Channel
    ComputerAdmin1/Computer
    Security /
    /System
    EventData
    DataC:\Windows\WinSxS\manifests\x86_microsoft.vc90.crt_1fc8b3b9a1e18e3b_9.0.30304.0_none_d9c474bda3593bfa.manifest/Data
    DataC:\Windows\WinSxS\manifests\x86_microsoft.vc90.crt_1fc8b3b9a1e18e3b_9.0.30729.1_none_e163563597edeada.manifest/Data
    Data
    /Data
    Data
    /Data
    Data
    /Data
    Data
    /Data
    Data
    /Data
    Data
    /Data
    Data
    /Data
    Data
    /Data
    DataC:\Program Files\Microsoft Office\Office14\MSACCESS.EXE.Manifest/Data
    Data
    /Data
    Data
    /Data
    Data
    /Data
    Data
    /Data
    Data
    /Data
    Data
    /Data
    Data
    /Data
    Data
    /Data
    Data
    /Data
    /EventData
    /Event

  • RELEVANCY SCORE 2.84

    DB:2.84:Problemas Al Ejecutar Internet Explorer 8 9f


    Tengo el siguiente error al iniciar internet explorer firma del error
    archivo ejecutable y hace mensión al tbagro.dll
    lo desintale y reinstale denuevo a la ultima version el problema sigue
    gracias

    DB:2.84:Problemas Al Ejecutar Internet Explorer 8 9f

    Hola!
    ¿Estás seguro que ese es el nombre del DLL? En primer lugar sigue los pasos deeste post. Coméntanos
    el resultado de todos los pasos.
    Si el problema persiste intenta este procedimiento:
    1-Abra un símbolo del sistema elevado. Para ello, haga clic en Inicio, haga clic en Todos los programas, Accesorios, haga clic con el botón derecho en Símbolo del sistema y, a continuación, haga clic en Ejecutar como administrador.
    Si se le pide una contraseña de administrador o una confirmación, escriba la contraseña o haga clic en Permitir.
    2-En la pantalla negra del símbolo del sistema escriba el siguiente comando y presione ENTER:
    sfc /scannow
    3-El comando sfc /scannow examina todos los archivos de sistema protegidos y reemplaza las versiones incorrectas por versiones correctas de Microsoft.
    Coméntanos si encontró errores y pudo o no repararlos.

    Saludos.

    . Responde a las consultas que te realice la comunidad, tanto si con ella obtienes una solución, como si no.
    . Si crees que un comentario aporta a la consulta, vótalo como útil en la opción ubicada a la izquierda del post.
    . Utiliza la opción Marcar como respuesta si con un comentario has llegado a una solución.
    . Si has encontrado la respuesta a tu consulta fuera de este sitio, comparte la misma para ayudar a otros con el mismo problema.

  • RELEVANCY SCORE 2.84

    DB:2.84:Error Al Intentar Ejecutar Proy. pp


    Favor informar que significa Error al Intentar ejecutar el proyecto. No se puede iniciar la Depuracin. El Identificador de enlace no es valido.- Mi correo es:
    martidavid987@hotmail.com

    DB:2.84:Error Al Intentar Ejecutar Proy. pp

    Mensaje de error cuando intenta ejecutar un proyecto de C# en el IDE de Visual Studio 2005: el identificador de enlace
    no es vlida
    http://support.microsoft.com/kb/922276/esSaludos ... Morgan 8-)

  • RELEVANCY SCORE 2.84

    DB:2.84:Error Al Ejecutar Desde El Dispositivo fd


    Hola comunidad estoy tratando de ejecutar un a aplicación de Windows pone 8 en el Nokia lumia 610 y me arroja este error al ejecutar desde el blend

    Sergio Fernandez Cruz Life Run's of Code

    DB:2.84:Error Al Ejecutar Desde El Dispositivo fd

    Hola,
    Por el texto del error, no está desplegando la aplicación en el LUmia 610. Lo está intentando hacer en el emulador. Y por lo que parece tu Sistema no es compatible con los emuladores.
    Dicho esto, no vas a poder ejecutar una aplicación de Windows Phone 8 en tu Lumia 610, porque el Lumia 610 tiene Windows Phone 7, no 8, y las apps de windows phone 8 no son compatibles con tu lumia 610.
    Un saludoMCTS - .NET 4.0 Windows Applications
    MCTS - .NET 4.0 Data Access
    MCTS - .NET 4.0 Service Communication Applications
    MCPD - .NET 4.0 Windows Developer
    Visita mi Blog en Geeks.ms
    Sigueme en Twitter

  • RELEVANCY SCORE 2.83

    DB:2.83:Error Al Querer Ejecutar Powerpivot md


    Buenas tardes a todos lo que pertenecen a la comunidad, bien he tratado de ejecutar powepivot desde excel 2013 profesional. y me aparece el siguente mensaje.

    Agradeceré alguna que otra ayuda.

    DB:2.83:Error Al Querer Ejecutar Powerpivot md

    Me alegro Edgar, tu mensaje servirá para quien tenga el mismo problema.

    Saludos,

    Xavier

  • RELEVANCY SCORE 2.83

    DB:2.83:Error Reporting Services Al Ejecutar Cualquier Report x7


    Hola a todos
     
     
    Sobre un Windows Server 2003 x64, SQL 2005 standar x64.
     
    Cuando intento ejecutar cualquier informe me aparece un mensaje de error similar a:
     
    No se encuentra la ejecución 'ybzp5enji2ezdg55j3y5vw55'

     
    He intentado cargar el informe desde el entorno de web , VS2005..
     
    Gracias
     
     
    Saludos
    vfelip

    DB:2.83:Error Reporting Services Al Ejecutar Cualquier Report x7

    Hola,
     
    ¿Si lo pruebas desde vista previa en Visual Studio.net 2.005 te funciona? ¿o has probado desde http://localhost/reports?
     
    Un Saludo

  • RELEVANCY SCORE 2.83

    DB:2.83:Aparece El Mensaje De Error No Se Puede Ejecutar Bho.Dll Al Iniciar El Sistema cj



    El primer mensaje es que no se puede ejecutar BHO.DLL__-Luego mensaje de error al cargar, no se puede encontrar módulo C:\\users\JC(usuario)\AppData\Roaming\czbwgmho.dll__-Y mensaje IE3SH dejó de funcionar

    DB:2.83:Aparece El Mensaje De Error No Se Puede Ejecutar Bho.Dll Al Iniciar El Sistema cj

    Hola Alexandra, el mensaje de error que indicas puede estar relacionado a Malware.
    ¿Que antivirus tienes instalado en tu sistema?
    Prueba a realizar un inicio limpio del sistema para descartar que uno de los elementos de terceros que carga al inicio sea el causante del error, como se indica en estanota técnica .
    Coméntanos el resultado del inicio limpio.
    Saludos!

    . Responde a las consultas que te realice la comunidad, tanto si con ella obtienes una solución, como si no.
    . Si crees que un comentario aporta a la consulta, vótalo como útil en la opción ubicada a la izquierda del post.
    . Utiliza la opción Marcar como respuesta si con un comentario has llegado a una solución.
    . Si has encontrado la respuesta a tu consulta fuera de este sitio, comparte la misma para ayudar a otros con el mismo problema.

  • RELEVANCY SCORE 2.83

    DB:2.83:Error Al Ejecutar Archivos .Bat pa


    No puedo ejecutar ningún archivo con extensión .bat, al ejecutarlos me da el error : Windows no puede encontrar el archivo C\(direccion del archivo que intento ejecutar). Asegúrese de que el nombre esta escrito correctamente e inténtelo de nuevo.
    Tengo: Windows 7 Home Premium 64bits.
    - Gracias.

  • RELEVANCY SCORE 2.80

    DB:2.80:Error Al Ejecutar Un Juego Para Pc jz


    Hola! Lo que pasa es que yo instalé un juego para pc (original, es Yo Matías Sueños Peligrosos), pero cuando lo quiero ejecutar me aparece un cartel de error que dice: "No puedo inicializar Mezclador de sonidos. (-1002)".
    Si alguien me puede ayudar, se lo agradecería mucho.

    DB:2.80:Error Al Ejecutar Un Juego Para Pc jz

    Lo acabo de intentar, pero me sigue apareciendo el mismo cartel de error:
    https://www.dropbox.com/s/vkxsaetrmdt1hsh/Foto%201.png

  • RELEVANCY SCORE 2.80

    DB:2.80:Error Al Ejecutar Aplicacion cs


    Hola una consulta pq? al ejecutar una aplicacion me sale error de que señale la ruta de la db
    ?xml version=1.0 encoding=utf-8 ?
    configuration
    connectionStrings
    add name=default
    connectionString=Data Source=.;Initial Catalog=DBLeandro;Integrated Security=True
    providerName=System.Data.SqlClient /
    /connectionStrings
    /configuration
    Pedro Avila

    DB:2.80:Error Al Ejecutar Aplicacion cs

    Ya funciono Leandro gracias estoy analizando ese códigoPedro Avila

  • RELEVANCY SCORE 2.80

    DB:2.80:Microsoft Visual C++ Runtime Error Al Ejecutar Un Exe De Labview sp



    Buenos dias,

    Al intentar ejecutar una aplicacion que he creado en Labview 2009 me sale el siguiente error. Microsot Visual C++ Runtime Library. This application has requested the runtime to terminate it in an unusual way. Please contact thethe application's support team for more information.

    Para asegurarme que no era un problema de codigo, he hecho una aplicacion que solo tien un control de tipo texto y aun asi me sigue dando el error.

    Espero que me podais ayudar,

    Muchas gracias,

    DB:2.80:Microsoft Visual C++ Runtime Error Al Ejecutar Un Exe De Labview sp


    Hola,

    Te recomendaría reinstalar el Run-Time Engine de LabVIEW:

    http://joule.ni.com/nidu/cds/view/p/id/1383/lang/e​n

    Es posible que se haya corrompido algún componente y de ahí el error.

    Un saludo.

  • RELEVANCY SCORE 2.79

    DB:2.79:Al Ejecutar Ie9 En Windows Se Queda Congelado Y Me Tira Pantalla Azul De Error k1


    Hola espero me ayuden con mi inconveniente con internet explorer 9:

    DB:2.79:Al Ejecutar Ie9 En Windows Se Queda Congelado Y Me Tira Pantalla Azul De Error k1

    si amigo ya lo probe, segun el codigo de error en la pantalla azul me sale esto "igdpmd64.sys" segun investigue en algunos foros es un error del driver de la tarjetagráficaen este
    caso de Intel ya hice las actualizaciones del driver y de todo pero el problema persiste tambien todas las actualizaciones de windows update,pero tampoco el problema sigue sucediendo cuando utilizo internet Exporer 9 o 10

  • RELEVANCY SCORE 2.78

    DB:2.78:Error 0x80070005 Al Ejecutar Microsoft Security Essentials 8z


    Mi sistema es Windows Home Edition version 2002 con Service Pack 3. Tenía instalado Microsoft Security Essencias y tras actualizar Windows ha desaparecido. Lo he vuelto a intentar instalar y cuando está actualizándose me aparece el siguiente error:

    DB:2.78:Error 0x80070005 Al Ejecutar Microsoft Security Essentials 8z

    Hola!
    Ejecuta la herramienta de limpieza para todo programa antivirus
    que hayas tenido alguna vez instalado en tu sistema. Con la desinstalación normal, los remanentes de configuración que dejan este tipo de programas pueden generar mal funciones de todo tipo.
    Adicionalmente realiza los pasos de la siguiente
    ayuda online.

    Saludos!

  • RELEVANCY SCORE 2.78

    DB:2.78:Error Query Sum Case When Sql 2005 ax


    Estoy tratando de ejecutar este query pero me da este error ,

    DB:2.78:Error Query Sum Case When Sql 2005 ax


    Bingooo!!! Si me funciono!! Muchas Gracias!!
    Saludos,

  • RELEVANCY SCORE 2.77

    DB:2.77:An Error Occurred In The Application You Were Using ff


    Buenos dias, me esta dando este error al ejecutar la aplicacin WPF web, alguien me podria decir como solucionarlo, lo que hice fue copiar unos recursos entre paginas y a partir de alli no puedo ejecutar la aplicacin por mas que compila bien.
    gracias

    DB:2.77:An Error Occurred In The Application You Were Using ff

    hola claudio.
    Como y donde te sale este error?.
    Como copiaste los recursos, copiaste los archivos, los moviste ..?Saludos
    David González
    MCP, MCTS
    Visita mi Blog en: http://www.dgzornoza.com/

  • RELEVANCY SCORE 2.77

    DB:2.77:Al Iniciar Sesin En Msn Sale Erro De Biblioteca De Vinculos Dinamico cd


    al iniciar seccion en msm me sale q hay un error el biblioteca de vinculos dinamico , como soluciono el problema

    DB:2.77:Al Iniciar Sesin En Msn Sale Erro De Biblioteca De Vinculos Dinamico cd

    Hola Paula

    Para los problemas relacionados con productos de Windows Live te recomiendo también formular tu inquietud en el
    Windows Live Solution Center;
    1. Allí puedes dirigirte a la sección
    Messenger.
    2. Una vez allí en la sección
    Foros haz clic en Iniciar sesión en Windows Live Messenger
    3. Clic en el vínculo Realiza una pregunta.

    Espero que esta información te resulte útil, cuéntanos como te va con la ayuda que allí te prestan o si necesitas asesoría con algún producto Microsoft.

    Oscar T.

  • RELEVANCY SCORE 2.77

    DB:2.77:Problema Al Ejecutar Skydrive En Vista No Se Puede Ejecutar Skydrive Con Derechos De Administrador Completos dk


    No puedo ejecutar SkyDrive de escritorio para Windows Vista Home Basic. Al ejecutar el archivo SkyDrive.exe me aparece el siguiente error "No se puede ejecutar SkyDrive con derechos de administrador completos".
    Espero su respuesta.

    DB:2.77:Problema Al Ejecutar Skydrive En Vista No Se Puede Ejecutar Skydrive Con Derechos De Administrador Completos dk

    Hola SebastiánPombo Mott

    Hemos verificado con nuestros expertos los mismo nos indica que debe tener instalado el Service Pack 2 de su Windows Vista para que realice los pasos indicados por nuestra moderadora.

    Si tiene instalado el SP2 en su Vista necesitamos que nos envié captura de pantallas con el error que le indica al sistema al momento de realizar la instalación.

    Le agradecemos enviar las capturas de pantalla por el mensaje privado.

    Saludos,
    Ricardo G.

  • RELEVANCY SCORE 2.77

    DB:2.77:Error Al Ejecutar Solucionador De Problemas De Conexin A Internet 8k


    me quiero conectar a una red de wii fii y se tarda yohabitualmenteabríael solucionador de problemas y se solucionaba todo y me conectaba y ahora me salta este cartel:
    ERROR AL SOLUCIONAR PROBLEMAS:

    DB:2.77:Error Al Ejecutar Solucionador De Problemas De Conexin A Internet 8k

    Hola

    Empieza por lo básico, reinstalar el driver de red...

    Este computador está tratandose de conectar a una red de dominio?

  • RELEVANCY SCORE 2.76

    DB:2.76:Insufficient System Memory mp


    Hola, buenas tardes.
    Espero me puedan orientar estoy trabajando con SLQ Server 2008 R2 Express.
    El detalle es que al ejecutar un store procedure me esta marcando este error
    There is insufficient system memory in resource pool 'internal' to run this query.
    El error es intermitente no siempre marca.
    Alguien sabe como lo puedo solucionar? alguna sugerencia?
    El store procedure hace un query de una vista. La vista tiene alrededor de 300 mil registros... y dentro de la estructura hay varios inner, no se si esto interfiera?,
    Gracias de Antemano.

    Mayra

  • RELEVANCY SCORE 2.74

    DB:2.74:No Se Puede Cargar El Archivo O Ensamblado sx


    tengo un problema con el visual studio 2010.....al ejecutar el proyecto me sale este error....
    error al intentar ejecutar el proyecto.no se puede cargar el archivo o ensamblado 'nombre del proyecto'.se esperaba que el modulo tuviera un manifiesto de ensamblado

    porfavor necesito una solucion....

    DB:2.74:No Se Puede Cargar El Archivo O Ensamblado sx

    tengo un problema con el visual studio 2010.....al ejecutar el proyecto me sale este error....
    error al intentar ejecutar el proyecto.no se puede cargar el archivo o ensamblado 'nombre del proyecto'.se esperaba que el modulo tuviera un manifiesto de ensamblado

    porfavor necesito una solucion....

  • RELEVANCY SCORE 2.72

    DB:2.72:Error Grave Al Ejecutar Fsx f1


    Al ejecutar mi FSX (gold edition con acceleration y todo) me sale una ventanita y me dice error grave antes funcionaba perfectamente pero ahora no hay manera de ejecutarlo. ¿que hago? (ya lo he desinstalado y vuelto a instalar) tengo Windows 7, por se
    acaso.

    DB:2.72:Error Grave Al Ejecutar Fsx f1

    Pues el juego es comprado los CDs estan bien no estan rayados y no sale ningun codigo de error solo pone ERROR GRAVE y es cuando das doble click se pone a pensar y sale la ventanita.

  • RELEVANCY SCORE 2.72

    DB:2.72:Al Ejecutar Un Cd Interactivo Aparece Un Error Que Dice Audiodriver Unsupported Format, Rate 22050, Bps 16 c3


    Que tal a todos

    DB:2.72:Al Ejecutar Un Cd Interactivo Aparece Un Error Que Dice Audiodriver Unsupported Format, Rate 22050, Bps 16 c3

    Hola!

    Seguramente se trata de una incompatibilidad del programa con Windows 7.

    Los fabricantes de los programas son los encargados de adaptar sus aplicaciones a los nuevos sistemas operativos. El que ese software no funcione en Windows 7 no es un inconveniente del sistema operativo (que es la base en donde se ejecutan los programas)
    sino del fabricante que no ha adecuado su programación a las nuevas tecnologías.
    Verifica en la página web del creador del mismo si posee alguna actualización que corrija la incompatibilidad o prueba lo comentado en

    este thread de Technet.

    En caso de no encontrar solución, deberás utilizar esa aplicación en el sistema operativo para el que fue creada.

    Saludos!

  • RELEVANCY SCORE 2.72

    DB:2.72:Error Al Ejecutar Una Macros c7


    Al ejecutar una macros me sale el error: " error 57121. error definido por la aplicacion o el objeto"
    al querer quitar check en Referencias a la libreria q tiene (FALTA). no me deja

    DB:2.72:Error Al Ejecutar Una Macros c7

    Tienes que buscar la referencia que te falta e instalarla.

  • RELEVANCY SCORE 2.72

    DB:2.72:Al Ejecutar Aplicaciones Como Office, Indica El Mensaje Cwindowsmicrosoft.Netframeworkv2.0.50727could Not Be Loaded zm


    Buenas tardes. Cuando intento ejecutar algunos programas como el office, teniendo instalado el windows 7, me sale el error c/windows/microsoft.net/framework/v2.0.50727/could not be loaded y no se abre el programa. ¿como podria solucionarlo?

    Gracias

    DB:2.72:Al Ejecutar Aplicaciones Como Office, Indica El Mensaje Cwindowsmicrosoft.Netframeworkv2.0.50727could Not Be Loaded zm

    ¿Has utilizado alguna aplicación de "optimización" como cCleaner, TuneUp o similares? Este tipo de aplicaciones pueden causar este tipo de incidentes. EVITA EL USO DE LAS MISMAS.

    Como primer paso intenta restaurar el sistema a un punto previo a cuando funcionaba correctamente, adicionalmente instala todas las actualizaciones del sistema que se encuentren disponibles.

    Saludos!

  • RELEVANCY SCORE 2.71

    DB:2.71:Query Dinamico k7


    hola,

    DB:2.71:Query Dinamico k7

    hola,

    Gracias a todo por su colaboracion el ejemplo de Hunchback me ayudo mucho ,

    Daniel

    Daniel el codigo que tu me esta dando no es dinamico por que si yo quiero pasarle un parrametro Null no me trae nada por eso no te marco como valido tu propuesta

    Willy

    Gracias por tu gran esfuero muy interesante tu codigo pero para lo que busco no me ayudo gracias

  • RELEVANCY SCORE 2.71

    DB:2.71:Al Ejecutar El Anti Virus Avast Free Me Indica Que ms


    c:\windows\installer\9d8cda.msilfl_realview.djvu error 42127 dañado necesito saber que significa esto y como puedo solucionarlo

    DB:2.71:Al Ejecutar El Anti Virus Avast Free Me Indica Que ms

    mi hermana dice que cada pc es un mundo... y razón no le falta.
    avast da muchos problemas en máquinas determinadas que obligan a formateos.

    mi consejo es que cambies de antivirus -nod y kaspersky- son los mejores.

    un saludo

  • RELEVANCY SCORE 2.70

    DB:2.70:Error Al Ejecutar Solucionar Problemas De Conectarse A Internet Codigo De Error 0x80070057 78


    ERROR AL EJECUTAR SOLUCIONAR PROBLEMAS DE CONECTARSE A INTERNET CODIGO DE ERROR 0X80070057 VERSION DEL ARCHIVO 9.0.8112.16457

    DB:2.70:Error Al Ejecutar Solucionar Problemas De Conectarse A Internet Codigo De Error 0x80070057 78

    Hola
    Claudia

    Es posible que el error se presente porque algún programa de terceros como un antivirus, firewall o programas de limpieza de registro estén bloqueando el acceso a internet del solucionador de problemas.

    Si los tienes te recomiendo desinstalarlos y probar nuevamente, puedes usar la herramienta de desinstalación de antivirus de

    este post.

    Déjanos saber si la información suministrada fue útil para resolver tu consulta.

    Aproveche la
    promoción de lanzamiento y
    actualice su sistema operativo a Windows 8.
    Click Aqui

  • RELEVANCY SCORE 2.70

    DB:2.70:Tengo Un Error Al Ejecutar La Instalacion Del Office Hogar Y Estudiantes 2013 jd


    buenas!
    me da un error al ejecutar la descarga del Office Hogar y estudiantes 2013.
    ¿que puedo hacer?
    Marian

    DB:2.70:Tengo Un Error Al Ejecutar La Instalacion Del Office Hogar Y Estudiantes 2013 jd

    Tengo un error al dar inicio a los programas del office, como lo soluciono

  • RELEVANCY SCORE 2.69

    DB:2.69:Error Al Ejecutar .Exe s9


    Hola dmontero. Me gustaría que me dijeras como has exo para que no desaparezca la consola al ejecutar el .exe desde el ordenador no desde el Visual. Yo no lo consigo. Gracias y salu2
     
    nachomacian@hotmail.com
     
    Gracias

    DB:2.69:Error Al Ejecutar .Exe s9

    Pon al final de tu programa una línea de entrada, como:
     
    char ch;
    cinch;
     
    o
     
    getch();

  • RELEVANCY SCORE 2.69

    DB:2.69:Al Ejecutar Net View Me Da Error De Sistma 6118 Que Hago 7f


    decime que puedo hacer soy novato en esto

    DB:2.69:Al Ejecutar Net View Me Da Error De Sistma 6118 Que Hago 7f

    Hola, esto sucede porque el nombre del grupo de trabajo es diferente del nombre del dominio.
    Modificar el archivo System.ini en el directorio de red (normalmente C:\NET), no edite el archivo System.ini de Windows (normalmente en el directorio C:\Windows).
    En la sección [network] buscará las entradas para "grupo de trabajo ="y"logondomain =." Estas entradas deben ser el mismo, ambos con el nombre de dominio.

    Fuente
    http://support.microsoft.com/kb/139910/es

    Suerte

  • RELEVANCY SCORE 2.68

    DB:2.68:Job Da Un Error Al Ejecutar k8


    Estimados,

    DB:2.68:Job Da Un Error Al Ejecutar k8

    Hola.
    El error del inicio hace referencia a un error con un servidor vinculado. ¿Puedes verificar que puedes leer datos desde ese servidor vinculado, con tu cuenta y desde el servidor de bases de datos? Es posible que simplemente esté mal creado ese linked server
    o que falte vincular tu usuario.
    Revísalo y nos dices.
    Alberto Lpez Grande
    SQL Server MVP

    Visita mi blog en
    http://qwalgrande.com
    Sígueme en twitter en
    http://twitter.com/qwalgrande

  • RELEVANCY SCORE 2.68

    DB:2.68:Intento Descargar Internet 9 Beta, Y Comienza La Descarga Normal, Al Ir La Descarga En 2.3 Megas, Sale La Ventana De Ejecutar, Al Dar Click En Ejecutar, Me Dice Que No Se Una Aplicacion Win32. x9


    no he podido instalar la version de internet explorer 9 beta, ya que cuando la descarga va por los 2 megas, sale la ventane de ejecutar, al ejecutar sale error que no es una version valida win32.

    DB:2.68:Intento Descargar Internet 9 Beta, Y Comienza La Descarga Normal, Al Ir La Descarga En 2.3 Megas, Sale La Ventana De Ejecutar, Al Dar Click En Ejecutar, Me Dice Que No Se Una Aplicacion Win32. x9

    Hola de nuevo!
    Es conocido que una vez caducado el antivirus que mencionas ocurren fallas de conexión y permisos entre otras, allí puede estar el inconveniente.
    Desinstala todo programa de seguridad que poseas, luegoejecuta la herramienta de limpieza para ese y todo antivirusque hayas tenido alguna vez instalado en tu sistema . Con la desinstalación normal, los
    remanentes de configuración que dejan este tipo de programas pueden generar mal funciones de todo tipo.
    Si deseas probar otro programa de seguridad, te recomiendo utilizarMicrosoft Security Essentials , que te ofrece protección antivirus y antispyware y su uso es gratuito. Puedes descargarlodesde
    este enlace .

    Saludos!

    . Responde a las consultas que te realice la comunidad, tanto si con ella obtienes una solución, como si no.
    . Si crees que un comentario aporta a la consulta, vótalo como útil en la opción ubicada a la izquierda del post.
    . Utiliza la opción Marcar como respuesta si con un comentario has llegado a una solución.
    . Si has encontrado la respuesta a tu consulta fuera de este sitio, comparte la misma para ayudar a otros con el mismo problema.

  • RELEVANCY SCORE 2.68

    DB:2.68:Error Al Ejecutar Una Aplicacin Creada Con Visual Foxpro 6.0 8x


    Al ejecutar una aplicacin creada con visual foxpro 6.0 me tira el siguiente error: Resource file versin mismath, luego aparece otro informe de error: dice,... : Visual
    foxpro cannot start could not load resources.
    La nica forma de ejecutar el proyecto es ejecutando primero Visual Foxpro y dentro de Fox optar por la opcin ejecutar y desde all, si se puede sin problemas.
    Gracias ,,, si alguien se encontr con este problema, gracias por compartirlo.

    DB:2.68:Error Al Ejecutar Una Aplicacin Creada Con Visual Foxpro 6.0 8x

    Tu problema es que tienes dos archivos de diferentes idiomas en el directorio que quieres distribuir estos son:
    vfp6renu.dll y vfp6resn.dll, cada uno es el driver de fox requerido para ejecutar los ejecutables en maquinas u ordenadores que no tienen instalado visual foxpro.Generalmente el paquete de instalacion lo coloca en c:\windows.000. De cualquier manera, si deseas
    correr tus ejecutables en espaol, borra del computador el archivo vfp6renu.dll; si deseas correrlo en ingles elimina entonces vfp6resn.dll.Si no lo encuentras en la carpeta que te indiqu, buscalo con el buscador de archivos y carpetas de windows
    y elimina el que no necesitas.

    Atentamente,
    Peter Concha R.
    Developer
    Mail: peter.concha@fcmf.ug.edu.ec
    Twitter: @PeterConchaR
    *** Colabora con el foro ***
    Si la respuesta te es de utilidad marca la pregunta como respondida.

  • RELEVANCY SCORE 2.68

    DB:2.68:Error Al Ejecutar Crystal Reports En Windows 7 Utimate zd


    Hola, tengo instalado Crystal Reports 2008 en mi PC con Windows 7 Ultimate, pero cuando trato de ejecutar el programa me aparece un error que dice: Runtime Error (Microsoft Visual C Runtime Library)

    DB:2.68:Error Al Ejecutar Crystal Reports En Windows 7 Utimate zd

    Hola!
    Tal vez no sea la misma versión con la que fue programada la aplicación, consulta la ayuda de su desarrollador.

    Saludos!

    . Responde a las consultas que te realice la comunidad, tanto si con ella obtienes una solución, como si no.
    . Si crees que un comentario aporta a la consulta, vótalo como útil en la opción ubicada a la izquierda del post.
    . Utiliza la opción Marcar como respuesta si con un comentario has llegado a una solución.
    . Si has encontrado la respuesta a tu consulta fuera de este sitio, comparte la misma para ayudar a otros con el mismo problema.

  • RELEVANCY SCORE 2.68

    DB:2.68:Error Al Ejecutar Una Macro dd


    Excel 2003 me devuelve el error 445 al ejecutar With Application.FileSearch en una macro generada en un version anterior.

    DB:2.68:Error Al Ejecutar Una Macro dd

    Hola. Supongo que en realidad el error te lo da en Excel 2007. El dilema es que la instruccion FileSearch ya no funciona en el VBA de dicho Excel. Quizas si comentas que es lo que deseas hacer seria mas facil ayudarte

    Saludos

    Abraham

  • RELEVANCY SCORE 2.68

    DB:2.68:Error 80070643 Al Instalar Una Actualizacin De Microsoft Security Essentialst sp


    Buenos días,
    Desde hace unos días al intentar ejecutar las actualizaciones de windows recibo mensajes de error. El último ha sido al intentar ejecutar una actualización de microsoft security essentials y el código del error es el indicado en el encabezado.

    DB:2.68:Error 80070643 Al Instalar Una Actualizacin De Microsoft Security Essentialst sp

    Buenos días,
    Desde hace unos días al intentar ejecutar las actualizaciones de windows recibo mensajes de error. El último ha sido al intentar ejecutar una actualización de microsoft security essentials y el código del error es el indicado en el encabezado.

  • RELEVANCY SCORE 2.68

    DB:2.68:Mi Nokia 5130xpressmusic Se Reinicia Al Ejecutar L... ac



    las aplicaciones no se ejecutan..se reinicia el equipo o me sale un mensaje de error que dice algo de java..intente reinstalar el firmware(v7.95) a travez del nokia suite 3.7.22 pero no se soluciono..que mas puedo hacer?

    DB:2.68:Mi Nokia 5130xpressmusic Se Reinicia Al Ejecutar L... ac


    Hola hernan89,

    Agradecemos su participación en nuestro Foro de Ayuda, sitio donde puedes encontrar noticias y soporte para los dispositivos Nokia.

    No está de más que lleves el móvil al Centro Autorizado Nokia más cercano, donde ellos evaluaran el dispositivo para dictaminar si es viable una reparación o como nos comentas, sea más factible adquirir otro dispositivo.

    Espero logres resolver esto sin mayores contratiempos y no dudes en contactarte nuevamente si así lo requieres.

    Un cordial saludo,

    AlvarSa




  • RELEVANCY SCORE 2.68

    DB:2.68:Error 80096002 xc


    Hola al ejecutar elWindows Update me sale el error de codigo 80096002

    DB:2.68:Error 80096002 xc

    le pasa con todas las cuentas?

  • RELEVANCY SCORE 2.68

    DB:2.68:Error Al Ejecutar Un Query ds


    Buenas tardes expertos perdone estoy ejecutando un query en SAP pero me muestra el siguiente error y no que que es este errorel query que quiero ejecutar es simple es el siguienteselect *from nomina1where TaxDate = [%0]no se porque no me deja y si le en vez del [%0] coloco una fecha si funciona.por si alguien me puede ayudar a resolver esto se los agradecera.De antemano muy agradecido por la ayuda.Saludos

    DB:2.68:Error Al Ejecutar Un Query ds

    nomina1 que tabla es? es de usuario?si es de usuario a de ser que te falta poner comillas simples en '[%0]'

  • RELEVANCY SCORE 2.67

    DB:2.67:Microfono Dinamico pa


    HOLA TENGO UN PROBLEMA INTENTO CONECTAR UN MICROFONO DINAMICO EN MI LAPTOP PERO NO FUNCIONA. AL CONECTARLO DETECTA UN CONECTOR PERO NO LO RECONOCE COMO MICROFONO VOY A LA CONFIGURACION Y EL UNICO MICROFONO QUE FUNCIONA ES EL QUE ESTA INTEGRADO A LA LAPTOP

    DB:2.67:Microfono Dinamico pa

    ¡Hola
    Nicolas!

    Bienvenido a la Comunidad Microsoft. Es un gusto poder ayudarte a resolver el inconveniente que presentas con el Micrófono dinámico y Windows 8.

    Para que el dispositivo sea reconocido por Windows hay que ver qué tipo de conexión estas usando, si es a través del conector de entrada de audio o a través de algún otro puerto del ordenador. Para ver si el dispositivo es
    reconocido por Windows verificaremos el administrador de dispositivos para saber si es por falta de algún controlador, para ello sigue estos pasos:

    Usa la combinación de teclas Windows+R y escribe
    DEVMGMT.MSC y presiona en aceptar.Verifica los elementos que están en la opción Audio de entrada y salida, o si hay algún elemento con alguna alerta amarilla en toda la lista.En caso de encontrar algún elemento con alguna alerta amarilla y que haga referencia a entrada de audio o similar, se necesita instalar el controlador del dispositivo. Para ello puedes verificar haciendo clic derecho sobre el elemento y seleccionar
    la opción Actualizar controlador.Sigue los pasos del asistente. En caso que la instalación falle es necesario que descargues el controlador desde la página del dispositivo (si es compatible con Windows 8) e instalarlo.
    También puedes seguir las siguientes instrucciones para realizar la configuración del Microsoft:

    Usa la combinación de teclas Windows+W, escribe
    configurar micrófono y selecciona el acceso directo que indica
    Instalar micrófono.Selecciona un tipo de micrófono de la lista de micrófonos con auriculares,
    micrófono para escritorio u otros. Luego haz clic en
    Siguiente.Asegúrate de que el silencio esté desactivado y que tu boca no esté muy cerca del micrófono.Di la frase en voz alta que viene en la pantalla. La barra se llenará para mostrar el volumen. Cuando estés satisfecho con el volumen y cuando esté a cierto rango, puedes hacer clic en
    Siguiente para continuar.Presiona el botón de Terminar para guardar los ajustes y cerrar la ventana.
    Inténtalo y déjanos saber si los procesos te ayudan en la configuración del micrófono dinámico. Estaremos atentos a tu respuesta para conocer los resultados.

    ____________________________________________________________________________________________________________________
    Responde a las consultas que te realice la comunidad, tanto si con ella obtienes una solución, como también si necesitas asistencia adicional. Si crees que un comentario aporta a la consulta,
    vótala como útil en la opción ubicada a la izquierda de la publicación. Utiliza la opción
    Marcar como respuesta si con un comentario has llegado a una solución. Si has encontrado la respuesta a tu consulta fuera de este sitio, compártela para ayudar a otros usuarios con la misma situación.
    ____________________________________________________________________________________________________________________

  • RELEVANCY SCORE 2.67

    DB:2.67:Execute Sp_Executesql Error Al Convertir Una Cadena A Smalldatetime 89


    Hola compañeros,
    Quisiera aprovechar sus conocimientos y que me den una ayuda por favor con este error que se me presenta:
    El asunto es que tengo una tabla donde quiero enviar unos datos ejecutando un query dinamico conEXECUTE SP_EXECUTESQL, pero estoy teniendo problemas con los valores smalldatetime.
    digamos por ejemplo que la tabla es la tabla_prueba que tiene como campos:
    id (int)
    descripcion (varchar(100))
    fecha (smalldatetime)
    Para llenarla utilizo lo siguiente:
    Declaro unas variables:
    DECLARE @FECHA NVARCHAR(MAX);
    DECLARE @CADENA NVARCHAR(MAX);
    DECLARE @QUERY NVARCHAR(MAX);
    DECLARE @QUERY_ENC NVARCHAR(MAX);
    DECLARE @QUERY_FINAL NVARCHAR(MAX);
    DECLARE @PARAMETROS NVARCHAR(MAX);
    Establezco unos valores:
    SET @FECHA = NULL
    SET @CADENA = 'HOLA MUNDO'
    Les comento que también he probado con GETDATE() y obtengo el mismo resultado.

    Luego armo los querys:
    SET @QUERY_ENC = 'INSERT INTO CC_PRUEBAS SELECT '

    SET @QUERY = @CADENA ', 1, ' @FECHA

    SET @QUERY_FIN = @QUERY_ENC @QUERY

    En esta parte también he intentado con
    SET @QUERY = @CADENA ', 1, @FECHA'SET @QUERY = @CADENA ', 1, @FECHA'SET @QUERY = @CADENA ', 1, ' cast(@FECHA as smalldatetime)

    Y obtengo el mismo resultado.
    Por ultimo establezco los parametros:
    SET @PARAMETROS = N'@CADENA VARCHAR(MAX), @FECHA SMALLDATETIME';
    Y ejecuto la instrucción:
    EXECUTE SP_EXECUTESQL @QUERY_FIN,@PARAMETROS,@CADENA,@FECHA;
    Y el resultado es el mismo:
    Conversion failed when converting character string to smalldatetime data type. SQL.sql 16 1
    No he podido encontrar la manera de ejecución o armado correcto de este EXECUTE, por eso les pido ayuda con este problemita.
    Gracias por su ayuda.

    DB:2.67:Execute Sp_Executesql Error Al Convertir Una Cadena A Smalldatetime 89

    Bueno al final he encontrado una manera de resolverlo, aunque no es lo que tenía pensado.
    El problema no se encontraba en el query especificado, sino en otro que necesita del valor de este primer query.
    Lo que hice fue reemplazar el parametro en el segundo query por el primer query completo, es decir, sería algo como esto:
    QUERY1: SELECT A FROM TABLA
    VALOR1: VALOR1 = QUERY1
    QUERY2: SELECT B FROM TABLA2 WHERE X = VALOR1
    En este punto generaba el error, me parece que al momento de hacer el reemplazo de VALOR1 (que en ese momento tiene un query como valor) no logra sustituirlo
    Por lo tanto, terminé colocando a QUERY2 comoSELECT B FROM TABLA2 WHERE X = (SELECT A FROM TABLA)
    En otras palabras poniendo los querys completos.
    Saludos

  • RELEVANCY SCORE 2.66

    DB:2.66:Error Imposible Ejecutar Archivo En La Carpeta Temporal. 3m


    Buenas

    al instalar un programa me sale el siguiente error:

    ERROR

    Imposible ejecutar el archivo en la carpeta temporal.Instalacion interrumpida.

    Error 5: Acceso denegado.

    e buscado por la red y no encuentro una solucion.espero vuestra ayuda.

    muchas gracias

    DB:2.66:Error Imposible Ejecutar Archivo En La Carpeta Temporal. 3m

    Cesar, No lom puedio ejecutar como tu dices. Obtengo una respuesta extraña: "Debe ser administrador con una consola activa para poder ejectucar la utilidad sfc."
    Soy el administrados así que no lo entiendo.

    ¿Me ayudas, por favor?
    Gracias

  • RELEVANCY SCORE 2.66

    DB:2.66:Solucion Al Error 0x0800700005 Al Ejecutar Restauracion Del Sistema 1k


    sistema operativo windows 7 ultimate

    DB:2.66:Solucion Al Error 0x0800700005 Al Ejecutar Restauracion Del Sistema 1k

    La restauracion de sistema la realizaste desde el mismo sistema operativo?? te recomiendo realizar la restauracion de sistema desde antes del inicio del sistema, debes encender el equipo y apenas lo enciendes debes oprimir varias veces la tecla F8 para que
    se habilite el menu de inicio selectivo
    En que momento se genera el error, cuando mencionas este error es un problema de instalacion, es decir que algun proceso que esta realizando el asistente de restauracion de sistema es el que puede estar generando el problema
    Tembien la causa es que el punto de restauracion esta corrupto o dañado y no es poible como tal realizar la restauracion en ese punto.
    Estare el tanto de lo que indiques para poder darte mayor informacion

  • RELEVANCY SCORE 2.66

    DB:2.66:Es Posible Devolver Una Respuesta En Un Procedimiento Almacenado De Consulta, En Donde Uso Varias Veces Sp_Executesql. sd


    Señores buen dia.
    Los pongo en situacion, tengo un procedimiento almacenado en donde estoy utilizando sql dinamico, el sql dinamico es necesario para mi consulta, el problema radica en que para ejecutar ese sql dinamico, tengo que utilizar la sentencia
    EXECUTE sp_executesql.
    Al ejecutar esta sentencia me muestra en la ventana de resultados el resultado de ese sql dinamico que acabo de ejecutar, devolviendome inmediatamente esa respuesta en mi llamado desde mi codigo C#, y no terminando el procedimiento almacenado
    Al final de mi procedimiento almacenado tengo una Tabla temporal que es la que me gustaria poder devolver.
    mi Pregunta, es basicamente si puedo decirle al procedimiento almacenado que me devuelva unicamente esa tabla temporal.
    Adjunto Codigo de mi procedimiento.

    DECLARE
    @pIdTipoDocumento bigint,
    @pFiltroKw nvarchar(50)

    SET @pIdTipoDocumento=22
    SET @pFiltroKw = ''

    --BORRA LA TABLA TEMPORAL DONDE ESTAN TODAS LAS KEYWORD
    IF OBJECT_ID(N'tempdb..#Kws', N'U') IS NOT NULL
    BEGIN
    DROP TABLE #kws
    IF (@@error 0)
    BEGIN
    ROLLBACK TRAN
    RETURN
    END
    END

    --BORRA LA TABLA TEMPORAL DONDE ESTAN TODAS LAS KEYWORD
    IF OBJECT_ID(N'tempdb..#dataDocumento', N'U') IS NOT NULL
    BEGIN
    DROP TABLE #dataDocumento
    IF (@@error 0)
    BEGIN
    ROLLBACK TRAN
    RETURN
    END
    END

    --BORRA LA TABLA TEMPORAL DONDE ESTA FILTRADA LA INFORMACION
    IF OBJECT_ID(N'tempdb..#infoFiltrada', N'U') IS NOT NULL
    BEGIN
    DROP TABLE #infoFiltrada
    IF (@@error 0)
    BEGIN
    ROLLBACK TRAN
    RETURN
    END
    END

    --CREA LA TABLA TEMPORAL DONDE ESTAN TODAS LAS KEYWORD
    CREATE TABLE #kws(
    Consecutivo int,
    nombreTabla varchar(20)
    )

    --CREA LA TABLA TEMPORAL EN DONDE ESTAN TODOS LOS DATADOCUMENTO QUE CUMPLEN CON EL IDDOCUMENTO SELECCIONADO
    CREATE TABLE #dataDocumento(
    Consecutivo int,
    idDocumento bigint,
    nombreDocumento nvarchar(200),
    idTipoDocumental bigint
    )

    --CREA LA TABLA TEMPORAL EN DONDE ESTA FILTRADA LA INFORMACION
    CREATE TABLE #infoFiltrada(
    idDataDocumento INT,
    nombreFormulario nvarchar(100),
    PRIMARY KEY (idDataDocumento)
    )

    --LLENA LA TABLA TEMPORAL CON LA INFORMACION DE LOS NOMBRES DE LAS TABLAS QUE EMPIEZAN POR KEYWORD
    INSERT INTO #Kws (Consecutivo, NombreTabla) (SELECT ROW_NUMBER() over(ORDER BY TABLE_NAME) as Consecutivo, TABLE_NAME FROM INFORMATION_SCHEMA.TABLES
    WHERE TABLE_NAME LIKE 'keyword%')

    --LLENA LA TABLA TEMPORAL CON LOS FORMULARIOS QUE CUMPLEN CON EL TIPO DOCUMENTAL SELECCIONADO
    INSERT INTO #dataDocumento (Consecutivo, idDocumento,nombreDocumento,idTipoDocumental)
    SELECT ROW_NUMBER() over(ORDER BY idDocumento) as Consecutivo, doc.dataDocumento.idDocumento, doc.dataDocumento.nombreDocumento, doc.dataDocumento.idTipoDocumental
    FROM doc.dataDocumento RIGHT OUTER JOIN
    form.Formulario ON doc.dataDocumento.idTipoDocumental = form.Formulario.idTipoDocumental
    WHERE (form.Formulario.activo = 'True') AND (doc.dataDocumento.idTipoDocumental = @pIdTipoDocumento)

    --VARIABLES DE SQL DINAMICO
    DECLARE @sql nvarchar(max);

    --VARIABLES DE RECORRIDO TABLA KEYWORDS
    DECLARE @tNombreKw varchar(20), --Variable que me indica el nombre de la tabla
    @contadorKw int, -- Variable contador
    @regsKw int -- Variable para el Numero de Registros a procesar

    SET @contadorKw = 1 --Contador recorre las filas de la tabla Temporal
    SET @regsKw = (SELECT COUNT(*) FROM #Kws)

    --VARIABLES DE RECORRIDO TABLA TEMPORAL DATADOCUMENTO
    DECLARE @regDataDocumento int,
    @contadorDataDocumento int,
    @tIdDocumento int,
    @tNombreFormulario nvarchar(100)

    SET @regDataDocumento = (SELECT COUNT(*) FROM #dataDocumento)
    SET @contadorDataDocumento = 1

    --VERIFICO QUE HAYAN FORMULARIOS ASOCIADOS A ESE TIPO DOCUMENTAL
    IF @regDatadocumento 0
    BEGIN
    --BUCLE DE LA TABLA #DATADOCUMENTO
    WHILE(@contadorDataDocumento = @regDataDocumento)
    BEGIN

    --OBTENGO EL VALOR DEL PRIMER IDDDOCUMENTO
    SET @tIdDocumento = (SELECT idDocumento FROM #dataDocumento WHERE Consecutivo = @contadorDataDocumento)

    SET @tNombreFormulario = (SELECT nombreDocumento FROM #dataDocumento WHERE Consecutivo = @contadorDataDocumento)
    --BUSCO EN LA TABLA DE KEYWORD CUAL DE ELLAS TIENE ASOCIADO ESE DATADOCUMENTO
    WHILE (@contadorKw = @regsKw)
    BEGIN
    --OBTENGO EL PRIMER NOMBRE DE LA TABLA DE LAS KEYWORDS
    SET @tNombreKw = (SELECT nombreTabla FROM #kws WHERE Consecutivo = @contadorKw)

    SET @sql = 'SELECT valor, idDocumento
    FROM kw.' CONVERT(NVARCHAR(MAX),@tNombreKw)
    ' WHERE (idDocumento = ' CONVERT(NVARCHAR(MAX),@tIdDocumento) ')'

    IF @pFiltroKw ''
    BEGIN
    SET @sql = @sql ' AND valor LIKE ''%' CONVERT(NVARCHAR(MAX),@pFiltroKw) '%'''
    END

    EXECUTE sp_executesql @sql

    IF @@ROWCOUNT 0
    BEGIN
    --TIENE ASOCIACION CON UNO DE LOS DATADOCUMENTOS QUE ESTOY BUSCANDO
    --MIRO SI YA SE ENCUENTRA EL DATADOCUMENTO EN MI TABLA FILTRO
    SELECT idDataDocumento FROM #infoFiltrada WHERE idDataDocumento = @tIdDocumento

    DECLARE @sqlAlter nvarchar(1000), --SQL QUE ME MODIFICA LA TABLA FILTRO
    @sqlVerificaColumna nvarchar(1000)
    IF @@ROWCOUNT 0
    BEGIN --ACTUALIZO

    SET @sqlVerificaColumna = '(SELECT * FROM TEMPDB.INFORMATION_SCHEMA.COLUMNS AS C1 WHERE C1.COLUMN_NAME =
    ''' CONVERT(NVARCHAR(100),@tNombreKw) '''
    AND C1.TABLE_NAME LIKE ''#infoFiltrada%'')'
    EXECUTE sp_executesql @sqlVerificaColumna

    IF @@ROWCOUNT = 0
    BEGIN
    --MODIFICO MI TABLA FILTRO
    SET @sqlAlter = 'ALTER TABLE #infoFiltrada ADD ' CONVERT(NVARCHAR(100),@tNombreKw) ' VARCHAR(20) NULL ;'
    EXECUTE sp_executesql @sqlAlter
    END

    --ACTUALIZO
    DECLARE @sqlUpdate nvarchar(1000)
    SET @sqlUpdate = 'UPDATE #infoFiltrada
    SET ' CONVERT(NVARCHAR(100),@tNombreKw) ' =
    (SELECT valor FROM kw.' CONVERT(NVARCHAR(MAX),@tNombreKw)
    ' WHERE (idDocumento = ' CONVERT(NVARCHAR(MAX),@tIdDocumento) '))
    WHERE idDataDocumento = ' CONVERT(NVARCHAR(100),@tIdDocumento)

    EXECUTE sp_executesql @sqlUpdate
    END
    ELSE --INSERTO
    BEGIN

    SET @sqlVerificaColumna = '(SELECT * FROM TEMPDB.INFORMATION_SCHEMA.COLUMNS AS C1 WHERE C1.COLUMN_NAME =
    ''' CONVERT(NVARCHAR(100),@tNombreKw) '''
    AND C1.TABLE_NAME LIKE ''#infoFiltrada%'')'
    SELECT * FROM #infoFiltrada

    EXECUTE sp_executesql @sqlVerificaColumna

    IF @@ROWCOUNT = 0
    BEGIN
    --MODIFICO MI TABLA FILTRO
    SET @sqlAlter = 'ALTER TABLE #infoFiltrada ADD ' CONVERT(NVARCHAR(100),@tNombreKw) ' VARCHAR(20) NULL ;'
    EXECUTE sp_executesql @sqlAlter
    END

    --INSERTO
    DECLARE @sqlInsert nvarchar(1000)

    SET @sqlInsert = 'INSERT INTO #infoFiltrada (idDataDocumento,nombreFormulario,' CONVERT(NVARCHAR(100),@tNombreKw) ')
    VALUES (' CONVERT(NVARCHAR(100),@tIdDocumento) ',''' CONVERT(NVARCHAR(100),@tNombreFormulario) ''',
    (SELECT valor FROM kw.' CONVERT(NVARCHAR(MAX),@tNombreKw)
    ' WHERE (idDocumento = ' CONVERT(NVARCHAR(MAX),@tIdDocumento) ')))'

    EXECUTE sp_executesql @sqlInsert

    END
    END

    SET @contadorKw = @contadorKw 1
    END
    SET @contadorkw = 1
    SET @contadorDataDocumento = @contadorDataDocumento 1
    END
    SET @contadorDataDocumento = 1
    SELECT * FROM #infoFiltrada
    END

    Muchas gracias por su respuesta.

    DB:2.66:Es Posible Devolver Una Respuesta En Un Procedimiento Almacenado De Consulta, En Donde Uso Varias Veces Sp_Executesql. sd

    Aunque no esta la forma en como lo solucione si me diste la idea para poder hacerlo mediantes UPDATES
    Gracias.

  • RELEVANCY SCORE 2.66

    DB:2.66:Reducir El Log En Bd Sql Server 2008 R2 18


    Necesito reducir los ficheros .ldf , lo maximo posible, pero las sentencias que funcionaban en 2005 ya no funcionan en 2008

    BACKUP

    log NombreBD
    WITH NO_LOG

    ERROR AL EJECUTAR: One or more of the options (no_log) are not supported for this statement. Review the documentation for supported options.

    BACKUP

    LOG AdCom2010GC00001
    WITH TRUNCATE_ONLY

    DBCC

    SHRINKFILE(AdCom2010GC00001)
    Error al ejecutar:
    'TRUNCATE_ONLY' is not a recognized BACKUP option.

    BACKUP

    LOG AdCom2010GC00001

    DBCC

    SHRINKFILE(AdCom2010GC00001)

    Error al ejecutar:
    The statement BACKUP LOG is not allowed while the recovery model is SIMPLE. Use BACKUP DATABASE or change the recovery model using ALTER DATABASE.

    Alguien me puede decir cual es la query que me reduce el fichero de log?
    Gracias

    DB:2.66:Reducir El Log En Bd Sql Server 2008 R2 18

    Hola
    A modo muy de rusumen, te comento:
    backup log bbdd with no_log -- borra la parte no activa del log, pero no reduce el log.
    DBCC SHRINKFILE(bbdd_log, 1024) -- Reduce ek log a e Mb

    Importante: Si no se deja comprimir o borrar el log por que no tiene sus trasacciones como distribuidas hay que ponerlas, de la forma:
    EXEC sp_repldone @xactid = NULL, @xact_segno = NULL, @numtrans = 0, @time = 0, @reset = 1
    --
    Si tu log esta a full:
    Antes de hacer esto, tendras que saber, que si tienes secuencias de backps del log, al cambiar el log de la bbdd a simple, rompes la secuencia.
    Al volver a full, tendras que hacer backup completo de la bbdd, para que pudea continuar una coherente secuencia de los backps del log...
    alter database bbdd set recovery simple
    go
    checkpoint -- Vuelca los datos del log a disco (para que no pierdas datos...)
    go
    checkpoint -- Mi mana, es repertirlo un par de veces...
    go
    checkpoint
    go
    checkpoint
    go
    alter database bbdd set recovery full
    go
    -- Por si las moscas, haz backup de la bbdd. Puedes saltarte este paso:
    backup database bbdd to disk = 'c:\bbdd.bak' with init
    go
    -- Y por fin!!! No te dar error!!!:
    DBCC SHRINKFILE(BBDD_log, 1024)
    go

    Norman M. Pardell
    ||Microsoft Certified IT Professional|| Database Administrator. Database Developer. SQL Server 2008

  • RELEVANCY SCORE 2.66

    DB:2.66:Ayuda Con Chkdsk Se Ejecuta Automticamente 91


    Tenemos varias PC desktop HP, y algunas de ellas después de hacer windows update empezaron a ejecutar chkdsk al reinicio del sistema y lo hacen automáticamente, ejecuté: fsutil dirty query c:, y me dice que el disco contiene errores, ejecuté un
    diagnóstico del disco desde el Bios y no me arrojó error alguno,realicé un chkdsk /f/r, pero sigue con el problema, a 1 de ellas la formateé y reinstalé todo, al principio funcionó sin problemas, pero hoy volvió a ejecutar el chkdsk al reinicio,
    usando chkdsk c: /x/c dejó de iniciarse, pero no entiendo dónde está el problema, ¿existe un hotfix que solucione esto?

    DB:2.66:Ayuda Con Chkdsk Se Ejecuta Automticamente 91

    Ayer Danielnos dio el siguiente KB de Microsoft, aunque se comenta otros problemas, todo debe estar relacionado, lo importante es que Microsoft ya esta trabajando en ello:
    Recibe un identificador de evento 55 o un error de detención 0xc000021 en Windows 7 después de instalar la actualización de seguridad 2823324

  • RELEVANCY SCORE 2.66

    DB:2.66:Problemas Al Ejecutar Sysprep En Win7 ad


    porque al ejecutar sysprep en Win7 al arrancar el equipo manda error y no inicia, manda un mensaje que es necesario reiniciar el equipo y de ahí no pasa

    DB:2.66:Problemas Al Ejecutar Sysprep En Win7 ad

    Reinicia y con F8 entra en modo "seguro con funciones de red"

    Cuando te lo pida vuelve a reiniciar en modo normal y problema semi-resuelto.

    Digo semi porque lo ideal seria evitar tener que hacer nada.

    Saludos.

  • RELEVANCY SCORE 2.66

    DB:2.66:Recovery Manager Al Ejecutar Menciona Error De Que Dejo De Funcionar. 18


    Tengo una Hp pavilion y no funciona el programa Hp recovery manager que anteriormente funcionaba.

    DB:2.66:Recovery Manager Al Ejecutar Menciona Error De Que Dejo De Funcionar. 18

    Pero envia un error q dice Appcrash, lo mas raro esque al principio funciona pero despues de un tiempo deja de funcionar, osea al inicia me refiero al acabar de haber realizado un formateo.

    Lo que sucede es que como es una aplicación propia de HP los códigos de error pueden no corresponder a Windows, sin embargo puedes hacer clic en Inicio, teclear MSCONFIG y ENTER
    En la ventana de configuración del sistema dale a la pestaña General y selecciona Inicio de diagnóstico, reinicia el sistema y fíjate si sigue saliendo el error.

  • RELEVANCY SCORE 2.66

    DB:2.66:Me Sale Este Error Al Ejecutar Cualquier Juego Online mk


    se produjo la excepcion unknown software exception (0x40000015) en la ubicacion 0x0048302f

    DB:2.66:Me Sale Este Error Al Ejecutar Cualquier Juego Online mk

    Hola BrianOrtega

    Este tipo de mensajes hacen referencia a problemas con un programa que esta interfiriendo con la funcionalidad del sistema.

    Si recientemente instalaste un programa que consideres sea la causa del problema debes realizar la

    desinstalación del mismo.

    Adicional intenta realizar la ejecución de un punto de restauración antes de la falla, realizando los pasos que se documentan en el siguiente

    enlace.

    Inténtalo y déjanos saber si la solución fue útil o si por el contrario tienes más inquietudes, quedamos atentos a tu respuesta.

  • RELEVANCY SCORE 2.66

    DB:2.66:Error Al Ejecutar El Lote sm


    Buen día, estoy ejecutando una serie de consultas y se presenta el siguiente error error al ejecutar el lote. mensaje de error: este archivo ya existe, podrían informarme porque ocurre?, muchas gracias!!

    DB:2.66:Error Al Ejecutar El Lote sm

    Al parecer, el OP perdió interés por el tema o lo resolvió por él mismo. Doy el hilo por cerrado.Alberto Lpez Grande
    SQL Server MVP

    Visita mi blog en
    http://qwalgrande.com
    Sígueme en twitter en
    http://twitter.com/qwalgrande

  • RELEVANCY SCORE 2.66

    DB:2.66:Al Ejecutar Macros En Excel 2010 Me Da El Siguiente Mensaje De Error Se Ha Producido El Error 9 En Tiempo De Ejecucionsubindice Fuera Del Intervalo. k8


    Estimados,
    Al ejecutar macros en Excel 2010 me da el siguiente mensaje de error "se ha producido el error '9' en tiempo de ejecucion:subindice fuera del intervalo". Cualquier informacion y/o solucion que me puedan brindar estaré muy agradecido.

    DB:2.66:Al Ejecutar Macros En Excel 2010 Me Da El Siguiente Mensaje De Error Se Ha Producido El Error 9 En Tiempo De Ejecucionsubindice Fuera Del Intervalo. k8

    Hola Efrita,
    celda contiene 56 valores (0-55) y tu bucle recorre desde 0 hasta
    63, por tanto; cuando i toma el valor 56 está fuera del intervalo de
    celda.

    Hola Oscar, si
    ficherodondeimportar es el nombre de tu libro, le falta la extensión y delimitarlo entre comillas.

  • RELEVANCY SCORE 2.66

    DB:2.66:Recibo El Siguiente Error Al Ejecutar Juegos Memoria Insuficiente En El Equipo. Guarde Los Archivos Y Cierre Estos Programas 8z


    El ejecutar algunos juegos en modo de pantalla completa, el juego es eventualmente interrumpido con el siguiente mensaje:

    Cierre programas para impedir la pérdida de información.
    Memoria insuficiente en el equipo. Guarde los archivos y cierre estos programas:
    Nombre del programa

    DB:2.66:Recibo El Siguiente Error Al Ejecutar Juegos Memoria Insuficiente En El Equipo. Guarde Los Archivos Y Cierre Estos Programas 8z

    Puede recibir este error al ejecutar un programa que utilice DirectX 11 con una resolución de pantalla distinta a la resolución nativa de la pantalla siendo utilizada.

    Microsoft reconoce esta situación y está investigando para determinar la fuente del problema.

    Para resolver este problema, ejecute el juego en la resolución nativa de la pantalla siendo utilizada. Para hacer esto, revise cual es la resolución nativa de la pantalla en Configuración de PC:

    Deslice el dedo desde el borde derecho de la pantalla, toque
    Configuración y luego Cambiar configuración de PC. (Si está utilizando un mouse, mueva el cursor a la esquina inferior derecha de la pantalla, mueva el cursor hacia arriba, seleccione
    Configuración y luego Cambiar configuración de PC.)Toque o haga clic en PC y dispositivos y luego
    Pantalla.Toque o haga clic en la barra de resolución y arrástrela hasta encontrar la resolución que indique
    (Recomendada). Esta es la resolución nativa de su monitor – usualmente la más alta que su monitor puede soportar.
    Toque o haga clic en Aplicar.
    Luego asegúrese que el juego este configurado para ejecutar la misma resolución.

    Si ya está ejecutando el juego a la resolución nativa, pueden existir otros factores causando el problema. Puede encontrar más información acerca de problemas de memoria insuficiente aquí:
    http://windows.microsoft.com/es-xl/windows/preventing-low-memory-problems

  • RELEVANCY SCORE 2.66

    DB:2.66:Error Al Ejecutar Aplicacin kf


    Al ejecutar el navegador muestra el siguiente mensaje de error con visual studio express 2013 lo que no me ocurria en versiones anteriores

    No se pudo asignar la ruta de acceso '/App_GlobalResources/'.
    A qué puede ser debido? Cómo solucionarlo?

    DB:2.66:Error Al Ejecutar Aplicacin kf

    Ejecuto la aplicación para verla localmente en IIS. La aplicación si se ejecuta en el servidor web. Un saludo y gracias Leandro

  • RELEVANCY SCORE 2.66

    DB:2.66:Al Intentar Ejecutar Algunas Aplicaciones 7x


    aveces al ejecutar aplicacion o instalar aparece este mismo mensaje de error y la aplicacion que ejecute se cuelga

    DB:2.66:Al Intentar Ejecutar Algunas Aplicaciones 7x

    Hola
    ian_94,

    Nos encanta que participes en los Foros de Microsoft, es posible que tengas alguna infección de virus.

    Prueba realizar un escaneo completo con el Microsoft Safety Scanner disponible
    aquí.

    Descárgalo y ejecútalo en el modo seguro con conexión a internet.

    Reinicia y antes de que aparezca el logotipo de Windows presione varias veces la tecla F8 hasta que aparezca el menú de opciones avanzadas del inicio, selecciona

    Modo Seguro con funciones de red y presiona entrar.

    Prueba ejecutar el comando SFC para intentar reparar el sistema.

    1. Has clic en Inicio y en el campo de texto de búsqueda vacío, escribe CMD

    2. te aparecerá una lista desplegable de posibles resultados, selecciona CMD con el botón derecho, y presione “ejecutar como administrador”

    3. En el símbolo del sistema, escriba SFC /SCANNOW y, a continuación, presiona ENTRAR.

    Déjanos saber si esta información te resultó útil, si tienes más dudas sigue en el Foro.

    Saludos,

  • RELEVANCY SCORE 2.66

    DB:2.66:Error Al Intentar Ejecutar El Administrador De Tareas sd


    Aparece mensaje de error: UTILLDLL.dll is either not designed to run in windows or it contains an error.

    DB:2.66:Error Al Intentar Ejecutar El Administrador De Tareas sd

    El COMANDO (SFC /SCANNOW) indicado es perfecto para el problema aun así si este no llega a funcionar te recomiendo realices una restauración de sistema

  • RELEVANCY SCORE 2.66

    DB:2.66:Error Al Particionar Base De Datos 1x


    Saludos,
    Al particionar una base de datos que era formada desde su inicio en la configuracion por default con un .mdf y un .ldf se generaron varios filegroups para los indices y tablas principales. El detalle fue que al ejecutar el query de creacion de los archivos
    adicionales, los nombres estaban con extension .mdf y no con .ndf que es lo recomendado. Dando como resultado una base particionada pero con todos los archivos con extension .mdf y un .ldf
    La interrogante va en el sentido de si el rendimiento se ver afectado por tener todos los archivos en ese formato y no en .ndf. En caso de ser necesario cambiar el tipo de archivos, habr alguna manera de renombrarlos sin ejecutar todo el
    proceso de particionamiento desde cero? Este proceso demor alrededor de 5 horas en un equipo crtico.
    De antemano quedo agradecido,
    JBL

    DB:2.66:Error Al Particionar Base De Datos 1x

    Gracias por responder.
    Al momento de la creacion de los filegroups se determino al cuatro como filegroup por default. La estructura quedo como sigue:
    Antes:
    Filegroup PRIMARY archivo: base.mdf
    Archivo de log base_log.ldf
    Luego de particionar:
    Filegroup PRIMARY archivo: base.mdf
    Filegroup Dos archivo: Dos.mdf
    Filegroup Dos_INDEX archivo: Dos_INDEX.mdf
    Filegroup Tres archivo: Tres.mdf
    Filegroup Tres_INDEX archivo: Tres_INDEX.mdf
    Filegroup Cuatro archivo: Cuatro.mdf (Default)
    Filegroup Cuatro_INDEX archivo: Cuatro_INDEX.mdf
    Archivo de log base_log.ldf
    Al momento de cambiar las extensiones de los archivos por .ndf me mostraba un error al hacerle un attach a la base. Revisando con un trace donde se generaba el error, notamos que las tablas de sistema de la base llamadas sysfiles y sysfiles1 contienen las
    rutas y nombres de los archivos fisicos. Asi tambien en la masterla tabla sysaltfiles mantiene las rutas y nombres fisicos de los archivos.
    Al tratar de modificar dichos registros mediante
    Use master
    go
    sp_configure 'allow updates',1
    go
    reconfigure with override
    go
    Tampoco me permite simplemente renombrar.
    El procedimiento sera:
    1. cambiar los datos de las rutas en las 3 tablas
    2. hacer un detach de la base
    3. renombrar los archivos cambiando las extensiones fisicamente
    4. hacer un attach de la base
    Pero al parecer la cosa no es tan sencilla.

  • RELEVANCY SCORE 2.66

    DB:2.66:Mensaje Al Finalizar Aplicacin 33


    Buenas noches,
    Estoy desarrollando una aplicación de tipo Windows Form con C#. Básicamente lo que hace es ejecutar varios stored procedures y recibir unos los valores que retornan éstos.
    La aplicación aparentemente trabaja bien y hace lo que debería de hacer, el problema que es al cerrar la aplicación, se lee en pantalla un mensaje que dice: LectorDePlanillas dejó de funcionar.
    El mensaje anterior aparece cuando ejecuto el .exe en una máquina de 64 bits, en mi máquina, de 32 bits, lo que me aparece a veces es que la aplicación se debería de ejecutar con permisos de administrador.
    Me he asegurado que mi proyecto incluya de manera local las dll necesarias para ejecutar la aplicación, así como también me aseguréque la opción x86 este seleccionada en el destino de la plataforma en las propiedades del proyecto.

    Unas de las pruebas fue quitar un método el cual se encarga de ejecutar uno de los Stored Procedure, al comentar este método y ejecutar para luego cerrar la aplicación entonces este mensaje al finanlizar ya no aparece más. Qué parte de mi código podrá estar
    generando una excepción?
    private string ValidacionPlanilla(string idPlanilla)
    {
    string Parametro1 = ConfigurationManager.AppSettings[Parametro1];
    string Parametro2 = ConfigurationManager.AppSettings[Parametro2];
    string codigo = ;

    try
    {
    using (iDB2Connection conIBM = new iDB2Connection(Data Source= Parametro1 ;User Id= Parametro2 ;Password= Parametro2 ;DataCompression=True;))
    {
    conIBM.Open();
    string query = DPODEDAT.SPENCPLAN;

    iDB2Command cmdIBM = new iDB2Command(query, conIBM);
    cmdIBM.CommandType = CommandType.StoredProcedure;

    cmdIBM.Parameters.Add(@idPlanilla, iDB2DbType.iDB2Char);
    cmdIBM.Parameters[@idPlanilla].Value = idPlanilla;

    cmdIBM.Parameters.Add(@parametro, iDB2DbType.iDB2Integer);
    cmdIBM.Parameters[@parametro].Direction = ParameterDirection.Output;

    cmdIBM.ExecuteScalar();
    codigo = Convert.ToString(cmdIBM.Parameters[@parametro].Value);

    }
    }
    catch (Exception ex)
    {
    DisplayTextBox.AppendText(*Se produjo un problema al validar la planilla. Método ValidacionPlanilla() ex.Message);
    DisplayTextBox.AppendText(Environment.NewLine);
    }

    Lo que hace el método es retornar el código de error que devuelve el Stored Procedure, qué estarágenerarndo el mensaje al finalizar la aplicación? la aplicación nunca se va al catch. solo es al cerrar el formulario que ejecuta este método.

    Carlos Márquez

    DB:2.66:Mensaje Al Finalizar Aplicacin 33

    Hola, Tuttini.
    Finalmente lo resolví, bastó con instalar un service pack iSeries DB2 y eso solucionó el problema.Carlos Márquez

  • RELEVANCY SCORE 2.66

    DB:2.66:Se Me Presenta Un Error Al Ejecutar Microsoft Sql Management Studio Error 0x8002801d s3


    tengo instalado w8 pro . instale sql server 2012 cuando ejecutomicrosoft sql management studio e intento abrir consulta con la conexion actual me aparece:

  • RELEVANCY SCORE 2.65

    DB:2.65:Ejecutar Pivot Dinamico xp


    Hola a todos, resulta que tengo una consulta que lo que hace es pivotear los datos que tengo en filas a columna.la tabla es la siguiente, con algunos datos de ejemplo:

    TABLA NOTA:
    ID_NOTA | NOTA_NOMBRE | NOTA | ASIG_ID
    1 Nota 1 6,5 1
    2 Nota 1 6,2 1
    3 Nota 2 6.3 1

    string al = @SELECT NOTA_ID, [Nota 1] as Test
    FROM(SELECT NOTA_ID, NOTA_NOMBRE, NOTA FROM Nota WHERE ASIG_ID = @idasignatura) AS SourceTable
    PIVOT(AVG(NOTA) FOR NOTA_NOMBRE IN([Nota 1])) AS PivotTable;

    string consultaNotas = @SELECT DISTINT NOTA_NOMBRE FROM Nota WHERE ASIG_ID = @idasignatura;

    DB:2.65:Ejecutar Pivot Dinamico xp

    Leandro, luego de probar y probar la instruccion, sin EXECUTE, no me resultaba hasta que al fin la puse, sin embargo, ahora me dice que debo declarar la variable, @asignatura, sin embargo ya esta, te muestro el codigo para que lo veas:

    string al = @DECLARE @cols NVARCHAR(4000)
    SELECT @cols = COALESCE(@cols +,[+NOTA_NOMBRE+], [+NOTA_NOMBRE+])
    FROM Nota
    ORDER BY NOTA_NOMBRE

    DECLARE @query VARCHAR(8000)
    SET @query=
    SELECT *
    FROM(SELECT * FROM Nota WHERE ASIG_ID = @idasignatura) as p
    PIVOT(MAX(NOTA) FOR NOTA_NOMBRE IN(+@cols+)) AS PivotTable
    EXECUTE(@query);

    using (SqlConnection connection = new SqlConnection(ConfigurationManager.ConnectionStrings[sica].ToString()))
    {
    connection.Open();
    SqlCommand cmd = new SqlCommand(al, connection);
    cmd.Parameters.AddWithValue(@idasignatura, idasignatura);
    SqlDataAdapter da = new SqlDataAdapter(cmd);
    da.Fill(dt);
    }
    return dt;
    }

  • RELEVANCY SCORE 2.65

    DB:2.65:Error Al Ejecutar Query p1



    Estimados tengo un problema que surgio recien

    Hace 1 hora ejecute un query que me arroja el EERR, hasta ahi todo bien. Hora mas tarde lo vuelvo a ajecutar debido a movimientos generados posteriormente y me arroja este error

    12/07/2011 17:12:44: 1). [Microsoft][SQL Native Client][SQL Server]Transaction 'Contratos de servicio' (OCTR) (Process ID 60) was deadlocked on lock | communication buffer resources with another process and has been chosen as the deadlock victim. Rerun

    Alguien sabe a que se debe?

    Atte.

    Felipe Loyola

    DB:2.65:Error Al Ejecutar Query p1


    Estimados

    Logre solucionar el problema, lo que hize fue "Matar" algunos usuarios que generalmente cargan via DTW muchos registros.

    Lo mas raro es que mi query era la unica corriendo, revise en el SQL y no habian mas procesos ejecutandose, como se dice "estaba corriendo solo por los palos".

    Muchas gracias por sus respuestas

    Atte.

    Felipe Loyola

  • RELEVANCY SCORE 2.65

    DB:2.65:Error 0x0c600c03 Al Ejecutar El Test De Onecare j7


    Saludos. Alguien podría indicarme a que se refiere este error de onecare:
    0x0c600c03

    Gracias

  • RELEVANCY SCORE 2.64

    DB:2.64:Error 0x800f023 No Puedo Ejecutar Service Pack 1 Para Vista, Que Puedo Hacer Gracias cx


    Hola necesito informacion a cerca de error 0x800F023 al instalar service pack 1 para vista.

    DB:2.64:Error 0x800f023 No Puedo Ejecutar Service Pack 1 Para Vista, Que Puedo Hacer Gracias cx


    Hola Oscar.
    Gracias por su interes.
    El equipo es portatil, y tenia McAfee como antivirus, ya lo desinstale pero sigue apareciendo al ejecutar el service pack 1 Error 0x800F023.
    Saludos y gracias.

    Aquí tambien puedes encontrar la herramienta de remoción completa de Mcafee. Ejecutala, como indica también Jose Antonio.
    Prueba además a descargar el Service Pack 1 de Windows Vista manualmente, desdeaquí .
    Una vez descargado, reinicia el sistema en el modo seguro con funciones de red.
    Reinicia y antes de que aparezca el logotipo de Windows presione varias veces la tecla F8 hasta que aparezca el menú de opciones avanzadas del inicio, selecciona Modo Seguro con funciones de red y presione entrar.
    Si aparece un cartel indicando que está en modo seguro haga clic en Sí, de otra forma continúa.
    Una vez en el modo seguro con funciones de red, trata de instalar el Service Pack 1 manualmente.
    Saludos!

  • RELEVANCY SCORE 2.64

    DB:2.64:Tengo Un Error Al Ejecutar Lela sd


    Mensaje desplazado hacia Otros.

  • RELEVANCY SCORE 2.64

    DB:2.64:Error Al Importar Archivo Excel zz


    Buenos dias al momento de importar un archivo excel obtengo el siguiente error luego de ejecutar este query
    SELECT *
    FROM OPENROWSET('Microsoft.ACE.OLEDB.12.0',
    'Excel 12.0 Xml;HDR=YES;Database=C:\Hola.xlsx',
    'SELECT * FROM [Ripley$]')

    Msg 7308, Level 16, State 1, Line 1
    OLE DB provider 'Microsoft.ACE.OLEDB.12.0' cannot be used for distributed queries because the provider is configured to run in single-threaded apartment mode.

    DB:2.64:Error Al Importar Archivo Excel zz

    Entiendo que necesites hacerlo, y se puede hacer de muchas maneras incluida usando OPENROWSET, sigue las instrucciones del post que te sugiere José Carlos Barba y seguramente podrás conseguirlo.
    Otras opciones son:

    Usar un paquete DTSX que a su vez utilice el proveedor OLEDB de Access. Luego ese paquete lo ejecutas en un Job de SQL ServerCrear una aplicación de consola .NET que utilice SqlBulkCopy y el proveedor OLEDB de Access. Y programarlo en un Job de SQL Server.Crear una aplicación de consola .NET que utilice SqlBulkCopy y un data reader proporcionado por una librería externa como Excel Data Reader
    http://exceldatareader.codeplex.com/. Y programarlo en un Job de SQL Server
    En realidad no es obligatorio programarlo en un job de SQL Server, pueden utilizarse otros Schedulers con el Windows, así se puede ejecutar la tarea en otra máquina que el servidor SQL.
    En vez de una aplicación .NET también podrías crear un script de PowerShell en su lugar. En fin, hay muchas maneras, y otras posibles que no he comentado.

  • RELEVANCY SCORE 2.64

    DB:2.64:Urgente Error Al Ejecutar Dcpromo jx


    Buenas,
     
    Necesito ayuda, resulta que deseo despromover un servidor, al ejecutar el dcpromo ejecuto todo el wizard que aparece y al finaliza aparece el siguiente error:
     
    El dominio especificado no existe o no se puede establecer contacto con él
     
    Ya mire los DNS y aparecen bien o nose que es lo que falta ayudenme por favor

    DB:2.64:Urgente Error Al Ejecutar Dcpromo jx

    El dns principal debe apuntar a si mismo , y el DNS secundario al controlador de dominio mas cercano , eso esta configurado asi ? No deberias tener problemas ... SldsSebastian del Rio

  • RELEVANCY SCORE 2.64

    DB:2.64:Error Al Crear Pst Outlook 2007 m9


    rundll
    Ha ocurrido una excepcion al intentar ejecutar C:\WINDOWS\system32\shell32.dll,Control_RunDLL
    C:\ARCHIV-1\MICROS-2\Office12\mlcfg32.cpl,@0

    DB:2.64:Error Al Crear Pst Outlook 2007 m9

    Repara la instalacin de Office:
    http://sites.google.com/site/palelmvp/reparar*** Por favor, marca como propuesta o como respuesta la que haya solucionado tu problema.
    __________________________________________________
    Palel – MVP Outlook
    Web de Informatica
    Blog Personal
    Video Tutoriales

  • RELEVANCY SCORE 2.64

    DB:2.64:Cmo Solucionar Problemas Al Ejecutar El Microsoft Safety Scanner 7m


    Me encuentro recibiendo un error al ejecutar Microsoft Safety Scanner, ¿Cómo puedo resolverlo?

    DB:2.64:Cmo Solucionar Problemas Al Ejecutar El Microsoft Safety Scanner 7m

    ¿Qué código de error posees? Trata de descargar el nuevo Microsoft Safety Scanner y luego realiza un nuevo análisis.

    Visita el sitio: http://support.microsoft.com/kb/2520970para conocer la lista de errores y las posibles soluciones para cada uno de ellos.

    Saludos!

  • RELEVANCY SCORE 2.64

    DB:2.64:Ora-29913: Error Al Ejecutar La Llamada De Odciaggregatemerge x9


    Why I can create this view on 11g and i receive this error on 10g?SQL CREATE MATERIALIZED VIEW SGPCVM_PARCELAS 2 NOCACHE NOPARALLEL BUILD IMMEDIATE 3 USING INDEX TABLESPACE PERSPECTIVAS_IDE_I PCTFREE 0 4 REFRESH ON DEMAND COMPLETE USING ENFORCED CONSTRAINTS 5 DISABLE QUERY REWRITE AS SELECT /*+ index(R SGPC_RECINTOS_PK) index(RG SG PC_RECINTOS_GEOM_PK) */ 6 R.CD_PROVINCIA, 7 R.CD_MUNICIPIO, 8 R.CD_POLIGONO, 9 R.CD_PARCELA, 10 SDO_AGGR_UNION(SDOAGGRTYPE(RG.SD_GEOM,0.0005)) AS SD_GEOM, 11 SUM(RG.NU_SUPERFICIE) AS NU_SUPERFICIE, 12 SUM(RG.NU_SUPERFICIE_ADM) AS NU_SUPERFICIE_ADM, 13 SUM(RG.NU_PERIMETRO) AS NU_PERIMETRO 14 FROM EQ_SIGPAC_IDE.SGPCD_RECINTOS R, 15 EQ_SIGPAC_IDE.SGPCD_RECINTOS_GEOM RG 16 WHERE R.IU_FH_BAJA_RECINTO IS NULL 17 AND R.ID_RECINTO_GEOM = RG.ID_RECINTO_GEOM 18 GROUP BY CD_PROVINCIA, CD_MUNICIPIO, CD_POLIGONO, CD_PARCELA; SDO_AGGR_UNION(SDOAGGRTYPE(RG.SD_GEOM,0.0005)) AS SD_GEOM, * ERROR en lnea 10: ORA-29913: error al ejecutar la llamada de ODCIAGGREGATEMERGE

    DB:2.64:Ora-29913: Error Al Ejecutar La Llamada De Odciaggregatemerge x9

    Why I can create this view on 11g and i receive this error on 10g?SQL CREATE MATERIALIZED VIEW SGPCVM_PARCELAS 2 NOCACHE NOPARALLEL BUILD IMMEDIATE 3 USING INDEX TABLESPACE PERSPECTIVAS_IDE_I PCTFREE 0 4 REFRESH ON DEMAND COMPLETE USING ENFORCED CONSTRAINTS 5 DISABLE QUERY REWRITE AS SELECT /*+ index(R SGPC_RECINTOS_PK) index(RG SG PC_RECINTOS_GEOM_PK) */ 6 R.CD_PROVINCIA, 7 R.CD_MUNICIPIO, 8 R.CD_POLIGONO, 9 R.CD_PARCELA, 10 SDO_AGGR_UNION(SDOAGGRTYPE(RG.SD_GEOM,0.0005)) AS SD_GEOM, 11 SUM(RG.NU_SUPERFICIE) AS NU_SUPERFICIE, 12 SUM(RG.NU_SUPERFICIE_ADM) AS NU_SUPERFICIE_ADM, 13 SUM(RG.NU_PERIMETRO) AS NU_PERIMETRO 14 FROM EQ_SIGPAC_IDE.SGPCD_RECINTOS R, 15 EQ_SIGPAC_IDE.SGPCD_RECINTOS_GEOM RG 16 WHERE R.IU_FH_BAJA_RECINTO IS NULL 17 AND R.ID_RECINTO_GEOM = RG.ID_RECINTO_GEOM 18 GROUP BY CD_PROVINCIA, CD_MUNICIPIO, CD_POLIGONO, CD_PARCELA; SDO_AGGR_UNION(SDOAGGRTYPE(RG.SD_GEOM,0.0005)) AS SD_GEOM, * ERROR en lnea 10: ORA-29913: error al ejecutar la llamada de ODCIAGGREGATEMERGE

  • RELEVANCY SCORE 2.64

    DB:2.64:Trigger Lento c7


    Hola, hace tiempo esta comunidad de expertos en SQL me ayudo a despejar varias dudas que tenia en respecto a como efectuar determinadas consultas, ahora acudo a su experticie nuevamente.
    Tengo un trigger que se lanza al efectuar un update, y este debe hacer un insert o update en otro servidor vinculado, el Query que habia formado para hacer el insert o Update en el sevidor vinculado era de naturaleza Transact-Dinamico, ya revisando y ampliando
    conocimientos y lo pase Transact normal nada de Transact dinamico, pero ahora tengo problemas de rendimiento mis consultas se tardan demasiado, a diferencia de la ejecucion con Transact dinamico tarda 5 seg. - 10 seg mas.

    Que podria estar sucediendo para que la ejecucion demore mas

    DB:2.64:Trigger Lento c7

    Hola.
    Eso significa que el update no es el problema, el problema es lo demás. Revisa el resto del script y trata de encontrar en qué punto se va de tiempos. Para ello, crear un procedimiento almacenado que haga lo mismo (pero sin el update al servidor vinculado,
    cámbialo por una select para la prueba) te ayudará notablemente.Alberto Lpez Grande
    SQL Server MVP

    Visita mi blog en
    http://qwalgrande.com
    Sígueme en twitter en
    http://twitter.com/qwalgrande

  • RELEVANCY SCORE 2.64

    DB:2.64:Error Al Ejecutar El Proyecto Windows Azure xz


    Estoy desarrollando un proyecto de tipo windows azure, cuando intento ejecutar el proyecto me sale un ventana de que informa el siguiente error start role failed for one or more roles, Que puedo hacer para solucionarlo?
    Agradezco su colaboracin
    Cordial Saludo.

    DB:2.64:Error Al Ejecutar El Proyecto Windows Azure xz

    Hola Miguel,
    Has conseguido resolver tu problema ??
    Cuentanos, como te fue ?
    Atento a tu respuesta,
    Saludos.Nicolás Herrera
    Bogotá - Colombia
    BLOG - Leader Group BogotaDotNet
    Daría todo lo que sé, por la mitad de lo que ignoro. Rene Descartes

  • RELEVANCY SCORE 2.64

    DB:2.64:Debe Declarar La Variable Escalar f1


    Buenas tengo un problema en una porsion de codigo, quiere ejecutar un select condicionado con la seleccion de un Dropdownlist pero al seleccionar un iten me salta el error de que Debo declarar la variable escalar en @ddldoc, alguien podria ayudarme
    using (SqlConnection cn = new SqlConnection(System.Configuration.ConfigurationManager.ConnectionStrings[ESTADOCURSOConnectionString].ConnectionString))
    {
    cn.Open();
    string query = SELECT * FROM DOCENTE WHERE Nombre_docente=@DDLdoc;
    SqlCommand cmd = new SqlCommand(query, cn);
    SqlCommand rea = new SqlCommand(query, cn);
    SqlDataReader dr = rea.ExecuteReader();

    cmd.Parameters.Clear();
    cmd.Parameters.AddWithValue(@DDLdoc, DDLdoc.DataTextField);
    cmd.ExecuteNonQuery();

    if (dr.Read())
    {
    Lnombdoc.Text = Convert.ToString(dr[Nombre_docente]);
    Lapelldoc.Text = Convert.ToString(dr[Apellido_docente]);
    Lcidoc.Text = Convert.ToString(dr[CI_docente]);
    Liddoc.Text = Convert.ToString(dr[ID_DOCENTE]);

    DB:2.64:Debe Declarar La Variable Escalar f1

    Hola.
    Tienes varios errores.
    Porque usas 2 veces el objeto command.
    SqlCommand cmd = new SqlCommand(query, cn);
    SqlCommand rea = new SqlCommand(query, cn);
    Solo lo tienes que usar una vez.
    Ademas no tienes que usar cmd.ExecuteNonQuery();
    Tambien para obtener el item del dropdowlist tienes que usar la propiedad
    SelectedValue.
    cmd.Parameters.AddWithValue(@DDLdoc, Convert.ToString(DDLdoc.SelectedValue));
    Prueba asi.
    using (SqlConnection cn = new SqlConnection(System.Configuration.ConfigurationManager.ConnectionStrings[ESTADOCURSOConnectionString].ConnectionString))
    {
    cn.Open();
    string query = SELECT * FROM DOCENTE WHERE Nombre_docente=@DDLdoc;
    SqlCommand cmd = new SqlCommand(query, cn);
    cmd.Parameters.AddWithValue(@DDLdoc, Convert.ToString(DDLdoc.SelectedValue));
    SqlDataReader dr = cmd.ExecuteReader();

    if (dr.Read())
    {
    Lnombdoc.Text = Convert.ToString(dr[Nombre_docente]);
    Lapelldoc.Text = Convert.ToString(dr[Apellido_docente]);
    Lcidoc.Text = Convert.ToString(dr[CI_docente]);
    Liddoc.Text = Convert.ToString(dr[ID_DOCENTE]);
    }

    }

    Saludos.

    Cristian Torres
    Blog Cristian Torres

    El Salvador - San Salvador

  • RELEVANCY SCORE 2.64

    DB:2.64:En Microsoft Excel 2003 , Al Ejecutar Una Macro Me Aparece El Siguente Error__Se Ha Produciun Un Error 1004 En Tiempo De Ejecucion __No Se Puede Utilizar Este Comando En Selecciones Superpuestas ____ 3d


    tengo 2 archivos excel abierto maximizados

    DB:2.64:En Microsoft Excel 2003 , Al Ejecutar Una Macro Me Aparece El Siguente Error__Se Ha Produciun Un Error 1004 En Tiempo De Ejecucion __No Se Puede Utilizar Este Comando En Selecciones Superpuestas ____ 3d

    Hola, ESERRANOS:
    Existe una enorme y muy variada cantidad de condiciones bajo las que se puede recibir ese error, por lo que lo descrito en el título (que debería estar en el texto de la conversación) no es una muy buena pista. Te agradecería si puedes indicarnos qué estás
    haciendo cuando se detiene la macro, y que presiones Depurar en el mensaje de error y transcribas al menos la línea en amarillo donde se detiene VBA.
    Sólo para adelantar un poco, por ejemplo, ese error puede deberse a intentos de cortar celdas cuyas filas-columnas se superponen entre sí.
    Detállanos más para revisar el caso. Saludos.

  • RELEVANCY SCORE 2.64

    DB:2.64:Problema Al Ejecutar Skydrive Derechos De Administrador Completos c8


    Hola, tengo el problema de derechos de Skydrive. Cada vez que se ejecuta me sale el error "No se puedeejecutar Skydrivecon derechos de administrador completos.Reiniciar skydrive sin derechos de administrador."
    Al volver ainiciarlofunciona bien, pero es incomodo tener el error cada vez que prendo mi pc.

    DB:2.64:Problema Al Ejecutar Skydrive Derechos De Administrador Completos c8

    Estimado.

    Se agradecería enviar la solución, ya que a mi también me sucede en windows 7 64 bits, cuando era skydrive funcionaba perfectamente pero cuando se llamó OneDrive no funcionó mas y solo sale el mensaje mencionado por Alfredo.

  • RELEVANCY SCORE 2.64

    DB:2.64:Linq To Entities Does Not Recognize The Method System.Type Gettype() 19


    hola Grupo:
    tegno un problema con lo siguiente Estoy usando entity framework , y quiero saber el tipo de los objetos en la query .
    tengo la siguiente query . (en mi caso se que solo tengo dos tipos : GroupGeneral y GroupTester)
    var GroupGeneral = source.Where(x = x.GetType() == typeof(GroupGeneral)).Select(x = new GroupDetailDTO
    {
    Type = GroupGeneral,
    Id = x.Id,

    });
    var GroupTester = source.Where(x = x.GetType() == typeof(GroupTester)).Select(x = new GroupDetailDTO
    {
    Type = GroupTester,
    Id = x.Id,

    });
    return GroupGeneral.Union(GroupTester);

    El error que me da es este LINQ to Entities does not recognize the method 'System.Type GetType()' method, and this method cannot be translated into a store expression
    No habria otra forma , de obtener los tipos de lso objetos que estoy realizando el query , mas dinamico, que hacer dos consultas separadas y unir al final.
    Gracias

    DB:2.64:Linq To Entities Does Not Recognize The Method System.Type Gettype() 19

    lo unico que creo que al hace tolist es poco performante porquetrae todo de la bd.
    exacto trae todo de la db porque necesitas comparar el Type desde objetos, no desde una query SQL
    no hay un equivalente para GetType() en sql
    recuerda cuando usas linq sql lo que escribas en el linq se transforma a sql para ejecutarlo contra al db, si usas algo que no tiene traduccion a sql no funcionara, como es el caso del GetType()
    saludosLeandro Tuttini

    Blog
    Buenos Aires
    Argentina

  • RELEVANCY SCORE 2.63

    DB:2.63:Error Al Ejecutar Crystal Reports Sap Bo 8.82 Pl 08 8a



    Buenas.-

    Tengo un inconveniente con algunas PC con SO Windows 7 y XP que al ejecutar un reporte, me sale el mensaje de "Error al ejecutar Crystal Reports".-

    La versin de SAP es 8.82 PL 08, Crystal Reports for SAP BO8.8.-

    Anterior mente el cliente estaba con la versin 2007, posterior a la actualizacin de versin surgi el problema del error.-

    Si a alguien le paso el mismo error si me pueden dar una ayuda.-

    Adjunto la imagen del error.-

    DB:2.63:Error Al Ejecutar Crystal Reports Sap Bo 8.82 Pl 08 8a


    Buenas.-

    Tengo un inconveniente con algunas PC con SO Windows 7 y XP que al ejecutar un reporte, me sale el mensaje de "Error al ejecutar Crystal Reports".-

    La versin de SAP es 8.82 PL 08, Crystal Reports for SAP BO8.8.-

    Anterior mente el cliente estaba con la versin 2007, posterior a la actualizacin de versin surgi el problema del error.-

    Si a alguien le paso el mismo error si me pueden dar una ayuda.-

    Adjunto la imagen del error.-

  • RELEVANCY SCORE 2.63

    DB:2.63:Al Ejecutar Un Programa Diseado Para Windows 98 En Windows Xp Se Genera El Error Resetskoflw En El Msvcrt.Dll Cmo Puedo Resolverlo px


    instale un programa en mi pc que requiere version windows 98 o windows nt pero yo tengo el XP, y al querer correrlo me aparece el error resetstkoflw en el msvcrt.dll. COMO PUEDO RESOLVERLO??

    DB:2.63:Al Ejecutar Un Programa Diseado Para Windows 98 En Windows Xp Se Genera El Error Resetskoflw En El Msvcrt.Dll Cmo Puedo Resolverlo px

    Primero, clic derecho sobre el acceso directo del programa y selecciona sus propiedades, luego en la pestaña "Cmpatibilidad" marca "ejecutar este programa en modo de compatibilidad para" y busca debajo Windows NT. aplica y acepta.
    Si de este modo sigue apareciendo el fallo y el programa es muy necesario y tines aún el disco de Windows 98 o NT puedes instalar alguno de estos sistemas en una maquina virtual, algo no muy complicado como Virtual PC 2007:
    Virtual PC:
    http://www.microsoft.com/downloads/es-es/details.aspx?FamilyID=28C97D22-6EB8-4A09-A7F7-F6C7A1F000B5

    Un buen tutorial aqui:
    http://www.infonegocio.com/luzylar/virtualpc.htm
    --
    Ivan

  • RELEVANCY SCORE 2.62

    DB:2.62:Error 80070003 De Windows Update da


    Al ejecutar el Windows Update, me sale que tengo una actualización disponible, cuando intento ejecutar la actualización, me sale el siguiente mensaje:
    "WindowsUpdate_80070003" "WindowsUpdate_dt000".
    Me podría alguien ayudar de qué se trata este error y cómo corregirlo???

    Gracias

    Saludos

  • RELEVANCY SCORE 2.62

    DB:2.62:Error Al Ejecutar Form [ Application.Run(New Form1()); ] c9


    Hola.
    Cuando quiero ejecutar mi programa me lleva a la depuracion, y me dice en esta linea de codigo:

    Application.Run(new Form1());

    Del program.cs este error:
    No se puede convertir un objeto de tipo System.Data.DataRowView al tipo System.IConvertible

    Alguien tiene idea como lo puedo solucionar?
    Gracias

    DB:2.62:Error Al Ejecutar Form [ Application.Run(New Form1()); ] c9

    estas de casualidad ejecutando algun codigo en el Load del Form1 ?
    porque si se produce un error en la carga del form que defines al inicio fallara justo alli donde comentas
    deberias poenr el codigo de Load del form1 dentro de un
    try{
    //aqui codigo que tienes actualmente
    }catch(Exception ex){
    MessageBox.Show(ex.Message);
    }
    para ver si se muestra el dialogo con el mismo error

    saludosLeandro Tuttini

    Blog
    Buenos Aires
    Argentina

  • RELEVANCY SCORE 2.62

    DB:2.62:Me Da Este Error Al Intentar Ejecutar s3


    Hola Estimados
    Necesito ayuda para solucionar este problema
    Me da este error al intentar ejecutar en el iis una aplicacion CGI.

    ¿Como lo puedo resolver?

    Muchas gracias

    Francisco Birrer
    Arquitecto de Software e-Process

    DB:2.62:Me Da Este Error Al Intentar Ejecutar s3

    esto que relacion tendria con asp.net ?
    has habilitado el seguridad anonima para el sitio en el iis ?Leandro Tuttini

    Blog
    Buenos Aires
    Argentina

  • RELEVANCY SCORE 2.62

    DB:2.62:Error De Bsod Blue Screen Of Death Al Ejecutar Wow f1


    Hola.

    Tengo BSOD (Blue Screen of Death) seguidas y con diferentes códigos de error, entre ellos 0x0000008e, 0x0000000d1; solo se presenta cuando ejecuto WOW

    DB:2.62:Error De Bsod Blue Screen Of Death Al Ejecutar Wow f1


    Hola!
    Existen varias causas que pueden derivar en lo que comentas, aunque mayormente es por cuestiones de controladores con fallas, sobrecalentamiento o hardware dañado. Aquí tienes un listado de cosas a verificar para poder dar con la causa del error:

    . Comprueba tu sistema en busca de errores en el disco duro como lo indica
    esta ayuda online.

    . Realiza un inicio limpio para descartar que alguno de los programas que se inician con
    Windows genere la mal función. Para saber cómo se realiza, visita la siguiente nota técnica:
    Windows 7 o Vista,
    Windows XP.

    . Comprueba que poseas
    los controladores actualizados de tus dispositivos, muchas veces un controlador con errores puede generar mal funciones como la que indicas.

    . Comprueba las temperaturas de tus dispositivos descargando
    este programa gratuito. En el mismo verifica la pestaña Sensors, con carga (para el procesador pon a comprimir algún archivo grande, y para la placa de video ejecuta algún juego en una ventana) no debería pasar ningún dispositivo de
    los 55°C (según el diseño de la placa base, mostrará más o menos sensores).

    . Comprueba la salud de tu memoria RAM, para ello programa manualmente un
    Diagnóstico de memoria como se indica en
    esta ayuda online.

    Si nada de esto arroja un resultado satisfactorio, encontrarás otros aspectos a verificar en

    este thread.

    Coméntanos los resultados. Saludos!

  • RELEVANCY SCORE 2.61

    DB:2.61:Al Ejecutar Microsoft Fsx, Al Cabo De Untiempo, Se Cierra El Programa Y Aparece El Error Apphangb1__ 7j


    Windows 7 Ultimate, 32 Bits.
    4 Gb de Ram,

    DB:2.61:Al Ejecutar Microsoft Fsx, Al Cabo De Untiempo, Se Cierra El Programa Y Aparece El Error Apphangb1__ 7j

    Hola Oscar, tengo instalados los dos Service Pack. He reparado la instalación de FSX, y la verdad, estoy desesperado, ya no sé por donde empezar. Lo peor, es que no tengo nada claro que se solucionara borrando todo y reinstalando. Si no, a estas
    alturas, habría empezado desde cero. He visto por varios foros que hay más gente con el mismo problema con FSX y también con otros programas, Explorer, Outlook, etc. Por eso todo me deriva apensar que el problema está en el sistema operativo, y tal vez, en
    alguna de las actualizaciones, ya que hace un par de meses, no tenía estos problemas.
    Gracias.

  • RELEVANCY SCORE 2.61

    DB:2.61:Error Al Ejecutar Aplicacion En Otros Ordenadores Sin Windows Xp xp


    Hola,

    DB:2.61:Error Al Ejecutar Aplicacion En Otros Ordenadores Sin Windows Xp xp

    no se si has podido implementar el control global de errores para obtener una descripcion mas puntual del problema
    pero en el mensaje que muestra cuando falla no menciona nada que pueda aportar alguna pista ?
    no muestra un cuadro con una seccion de detalle colapsable ? si es asi alli dentro que menciona, por ahi aporte alguna info

    saludosLeandro Tuttini

    Blog
    Buenos Aires
    Argentina

  • RELEVANCY SCORE 2.61

    DB:2.61:Error Al Ejecutar Archivo *.Sql Con Sqlcmd s7


    Buen día a todos,

    He estado batallando al ejecutar sqlcmd, me pueden ayudar con un error estese genera al ejecutar el siguiente script:
    xp_cmdshell 'sqlcmd -U XXXXX -P YYYYY -S AAAAA -i C:\Program Files\Microsoft SQL Server\MSSQL10_50.MSSQLSERVER\MSSQL\Backup\Archivos\Plaza\20120724\Update.sql'

    el error que manda es:

    output
    ---------------------------------------------------------------------------------------------------------------------------------------------------------------------------------------------------------------------------------------------------------------
    Sqlcmd: 'C:\Program': Invalid filename.
    NULL
    (2 row(s) affected)
    Lo que contiene este archivo es un update a una tabla son demaciados registros motivo por el cual se me ocurrio generar el archivo .sql para posteriormente ejecutarlo con sqlcmd, ya que al querer copiar de la parte de Results y pegar la sentencias en el
    query me dice que son demaciados registros y no los pega, supongo que el error que se genera es por los espacios que tienen los nombres de las carpetas pero existira alguna otraforma de que me respete la ruta donde esta el archivo ya que por politicas
    de la empresa sql solo puede leer esa carpeta.
    La version de sql que tengo es SQL Server 2008 R2 Standard Edition
    Espero que me puedan ayudar con esto, se los agradecere mucho.
    Saludos...

    DB:2.61:Error Al Ejecutar Archivo *.Sql Con Sqlcmd s7

    Muchas gracias Ronald si faltaban las comillas pero tambien tuve que agregar el nombre de la base de datos quedo de la siguiente forma:

    xp_cmdshell 'sqlcmd -U XXXXX -P YYYYY -S YYYYY -d BBBBBB -i C:\Program Files\Microsoft SQL Server\MSSQL10_50.MSSQLSERVER\MSSQL\Backup\Archivos\Plaza\20120724\Update_.sql'

    nuevamente muchas gracias por tu apoyo.

    Saludos...

  • RELEVANCY SCORE 2.61

    DB:2.61:Excel Con Odbc Sql Server 3d


    Buenos Dias.

    Tengo Execl 2007 y me conecto macros(ODBC) a SQL Server 2008, peor desde hace una semana al ejecutar las macros me sale un error 3669 que dice Ejecucuon Cancelada. Pero el query esta bien por que le pruebo directamente en el SqlServer y si funciona, el timepo
    de demora del query es de 50s.

    No se como arreglar o que hacer.

    Su ayuda por favor.

    Gracias de antemano

    DB:2.61:Excel Con Odbc Sql Server 3d


    ...Execl 2007 y me conecto macros (ODBC) a SQL Server 2008, peor desde hace una semana al ejecutar las macros me sale un error 3669 que dice Ejecucuon Cancelada. Pero el query esta bien por que le pruebo directamente en el SqlServer y si funciona, el timepo
    de demora del query es de 50s...

    hola, !
    consulta en este articulo: =
    SQLDriverConnectpor la palabra-clave: "QueryLogTime" (a la mitad de la pagina) y nota que deben ser milisegundos
    si cualquier duda (o informacion adicional)... comentas ?
    saludos,
    hector.

  • RELEVANCY SCORE 2.61

    DB:2.61:Que Variable Me Devuelve El Error Ocurrido En Una Transaccion Sql Server s3


    Tengo la siguiente transaccion...
    BEGIN TRY
    BEGIN TRANSACTION
    -- Query
    COMMIT
    RETURN 0
    END TRY
    BEGIN CATCH
    IF(@@TRANCOUNT 0)
    ROLLBACK
    RAISERROR('Mensaje', 16, 1)
    END CATCH
    Como pueden ver si hay un error yo doy un mensaje creado por mi al usuario de que nos e pudo ejecutar el query. Quiero que en lugar de dar un mensaje creado por mi que sea el mensaje que da sql de error... Cual sera la variable o algo que me devuelva dicho
    error?
    Gracias

    DB:2.61:Que Variable Me Devuelve El Error Ocurrido En Una Transaccion Sql Server s3


    En el mbito de un bloque CATCH, se pueden utilizar las siguientes funciones del sistema para obtener informacin acerca del error que provoc la ejecucin del bloque CATCH:
    ERROR_NUMBER() devuelve el nmero del error.
    ERROR_SEVERITY() devuelve la gravedad.
    ERROR_STATE() devuelve el nmero de estado del error.
    ERROR_PROCEDURE() devuelve el nombre del procedimiento almacenado o desencadenador donde se produjo el error.
    ERROR_LINE() devuelve el nmero de lnea de la rutina que provoc el error.
    ERROR_MESSAGE() devuelve el texto completo del mensaje de error. Este texto incluye los valores suministrados para los parmetros reemplazables, como longitudes, nombres de objetos u horas.
    Estas funciones devuelven NULL si se las llama desde fuera del mbito del bloque CATCH. Con ellas se puede recuperar informacin sobre los errores desde cualquier lugar dentro del mbito del bloque CATCH.
    http://msdn.microsoft.com/es-es/library/ms175976.aspx

    Norman M. Pardell
    ||Microsoft Certified IT Professional|| Database Administrator. Database Developer. SQL Server 2008

    Hola amigo muchisimas gracias eso era lo que buscaba.

  • RELEVANCY SCORE 2.61

    DB:2.61:Sql Dinamico Con Select * Into #Temporal From Tabla 91


    Es posible ejecutar este código con SQL Dinámico?
    Saludos!

    DB:2.61:Sql Dinamico Con Select * Into #Temporal From Tabla 91

    Es posible ejectuarlo, pero su utilidad es nula, ya que desde donde se llama no se puede acceder a la tabla temporal.

    Si ejecutas lo siguiente:
    EXEC ('SELECT * INTO #TempSchemas FROM sys.schemas')
    SELECT * FROM #TempSchemas

    La instrucción se ejecuta, se crea la tabla #TempSchemas pero no es accesible, obtienes un error:
    (13 row(s) affected)
    Msg 208, Level 16, State 0, Line 2
    Invalid object name '#TempSchemas'.

    EntityLite: A Lightweight, Database First, Micro ORM

  • RELEVANCY SCORE 2.60

    DB:2.60:Error Javascript Con Jquery x9


    hola... de antemano gracias por contestar
    veran... IE me regresa el error Function Expected al ejecutar codigo javascript... este codigo para ser preciso es un datepicker de la libreria JqueryUI, el error ocurre al ejecutar esta linea de codigo

    $(input[id$=txtdate]).datepicker()({dateFormat: 'dd-mm-yy'});

    DB:2.60:Error Javascript Con Jquery x9

    lo tengo definido en el master al igual que mi script
    esto que significa ?
    los directorios de jquery estan en raiz al igual que el master
    tienes los .js al mismo nivel que el .master y la pagina aspx tambien esta todo en el mismo nivel ?
    lo planteo porque el link relatico que armas al script src=... el que importa esel de la pagina no el del master, par que cargue correctamente

    saludosLeandro Tuttini

    Blog
    Buenos Aires
    Argentina

  • RELEVANCY SCORE 2.60

    DB:2.60:Error Al Ejecutar Aplicativo Archivo Manifest pm


    Estimados
    Al momento de grabar mi aplicativo en vb.net 2010 se me colgo el pc, despues me aparece este mensaje
    Error1Error embedding Win32 manifest: Manifest File 'C:\simbiosis\SimbiosisAp\SimbiosisAp\My Project\app.manifest' cannot be found.SimbiosisAp
    cada vez que quiero ejecutar

    Como puedo solucionar eso!!!

    Muchas gracias

    winckelman

    DB:2.60:Error Al Ejecutar Aplicativo Archivo Manifest pm

    Ya lo resolvi por si alguien le pasa debe volver a generarlo desde propiedades del proyecto
    Application
    View Window Settings
    Grabar
    winckelman

  • RELEVANCY SCORE 2.60

    DB:2.60:Error Sys.Application.Notifyscriptloaded() Al Ejecurar Un Crystal Report a1


    Hola, tengo ese error al ejecutar una pagina para ver un reporte de Crystal Report.
    dejo una imagen
    Saludos

    jmlc

    DB:2.60:Error Sys.Application.Notifyscriptloaded() Al Ejecurar Un Crystal Report a1

    Si esta habilitado el use de ActiveX en el IE10 y si funciona con FireFoxjmlc

  • RELEVANCY SCORE 2.60

    DB:2.60:Error Al Ejecutar Crystalreports En Procedimiento Clr px


  • RELEVANCY SCORE 2.60

    DB:2.60:Error Al Intentar Ejecutar El Asesor De Actualizaciones De Windows 7 En Windows Xp 9x


    Quiero instalar Windows 7 pero el asesor de actualizaciones de Windows 7 no corre me sale un error,
    alguna respuesta para resolver esto?Gracias

    DB:2.60:Error Al Intentar Ejecutar El Asesor De Actualizaciones De Windows 7 En Windows Xp 9x

    Hola Hector

    Comprendo que no has podido ejecutar el Asesor de actualizaciones de Windows 7 debido a un error que se presenta.

    Para que podamos brindarte una respuesta adecuada a la situación, es necesario que nos comentes cual es el mensaje de error que se presenta.

    Entre tanto, si quieres instalar Windows, puedes verificar los requerimientos previos a la instalación de este sistema operativo.

    Estos son los mínimos:
    Requisitos del sistema Windows 7

    Y también, para verificar que los programas que tienes en tu equipo puedan ser usados en el nuevo sistema operativo, puedes usar el

    Centro de compatibilidad de Windows 7.

    Espero que esta información sea de ayuda, quedamos atentos a tus comentarios.

    Oscar T.

  • RELEVANCY SCORE 2.60

    DB:2.60:Error Al Ejecutar Consulta En Sql j8


    Hola,

    DB:2.60:Error Al Ejecutar Consulta En Sql j8

    ok

    Gracias por la respuesta ya lo resolvi.AngelaMar ;)

  • RELEVANCY SCORE 2.60

    DB:2.60:Error 1719 Al Ejecutar Office2007 En Win7 Profesional 39


    Hola
    Instale Office2007 Enterprise en win7 y al iniciar cualquier componente del Office se reinicia la instalacion del Office. He realizadoel procedimiento de registrar el windows installer nuevamentey sigue fallando.
    Gracias por sus comentarios

    DB:2.60:Error 1719 Al Ejecutar Office2007 En Win7 Profesional 39

    Hola
    Instale Office2007 Enterprise en win7 y al iniciar cualquier componente del Office se reinicia la instalacion del Office. He realizadoel procedimiento de registrar el windows installer nuevamentey sigue fallando.
    Gracias por sus comentarios

    ¿El error solo te sucede en el Office 2007 o en todas las aplicaciones?
    Pureba a utilizar la herramienta SFC /scannowque busca errores en el sistema,descripta en la siguiente nota:
    http://support.microsoft.com/kb/936212/es
    Saludos!