• RELEVANCY SCORE 4.16

    DB:4.16:Compiling Options 9j




    Is there any option to spcify the destination of compiled class files while compiling Java files?

    DB:4.16:Compiling Options 9j

    http://java.sun.com/javase/6/docs/technotes/tools/windows/javac.html

  • RELEVANCY SCORE 4.08

    DB:4.08:Labview Embedded For Arm Build Fails z3





    I'm using the LabVIEW Embedded module for ARM microcontrollers with theLuminary EK-LM3S8962 evaluation board.When I try to build/run the example vi in the tutorial (pg 13 of the Getting Starteddoc)I get the following error: Build Failed. Build failed with errors.The output is the following:

    Build target 'LabVIEW'assembling Startup.s...compiling RTX_Config.c.....\System\RTX_Config.c(157): error: #130: expected a "{"compiling Retarget.c...compiling TargetInit.c...compiling ARM_irq.c...compiling ARM_RTClock.c...compiling ARM_Serial.c...compiling EKLM3S8962_Display.c...compiling LM3S_EMAC.c...D:\Program Files\National Instruments\LabVIEW8.6\Targets\Keil\Embedded\RealView\Drivers\RL-ARM\Include\RLARM_Net_Config.h(31): error: #256: invalid redeclaration of type name "S8" (declared at line37 of"d:\Keil\ARM\RV31\INC\RTL.h")compiling ARM_I2C.c...compiling ARM_SPI.c...compiling LM3S_Pins.c...compiling LVCGenIntInit.c...compiling Untitled_ARM.c...compiling lvEmbeddedMain.c...-----snip------compiling RLARM_CAN_Wrapper.c...Target not created







    Solved!
    Go to Solution.

    DB:4.08:Labview Embedded For Arm Build Fails z3


    Hello,

    now I downgraded to uVision 3.62c (MDK-ARM 3.22, but there I get the other error again:

    "RTX_Config.c: Error: C9932E: This Evaluation Version has expired. Please contact your supplier."

    I hope the ne Version vom Embedded for ARM will solve my problem:

    http://joule.ni.com/nidu/cds/view/p/id/1371/lang/de

  • RELEVANCY SCORE 4.03

    DB:4.03:How To Revover Compiling Environment? z8




    I installed Oracle8.1.7 server on Redhat7.3
    so I had to change my compiling version to 6.2 with following files

    these rpms:

    compat-egcs-6.2-1.1.2.14.i386.rpm
    compat-glibc-6.2-2.1.3.2.i386.rpm
    compat-libs-6.2-3.i386.rpm

    How could I recover my original compiling environment?

    Thanks alot

    DB:4.03:How To Revover Compiling Environment? z8

    I installed Oracle8.1.7 server on Redhat7.3
    so I had to change my compiling version to 6.2 with following files

    these rpms:

    compat-egcs-6.2-1.1.2.14.i386.rpm
    compat-glibc-6.2-2.1.3.2.i386.rpm
    compat-libs-6.2-3.i386.rpm

    How could I recover my original compiling environment?

    Thanks alot

  • RELEVANCY SCORE 4.02

    DB:4.02:Wdtvlivehub Compiling For Days ?!? m9



    I loaded 450G music files (about 92.000 songs) on my WDTVLiveHub and for two days now(!!) it is compiling...is this normal or I should something? Does somebody have any idea?

    Thanks a lot

    Spikon

    DB:4.02:Wdtvlivehub Compiling For Days ?!? m9


    thanks for your advise; do you know by the way if WDTVLiveHub can read WD 1T pasport HD which has USB 3.0 interface?

  • RELEVANCY SCORE 4.02

    DB:4.02:Not Compiling xm


    i am using jdk1.5,Tomcat6.x version.some of my jsp files are not compiling.is there any need to change in compiler settings?help me regarding this.
    thanks,
    sekhar

    DB:4.02:Not Compiling xm

    session.getAttribute("accountInfo");before this page calling

    Are you set this line in your previous page,
    session.setAttribute ("accountinfo",value);recheck it

  • RELEVANCY SCORE 3.83

    DB:3.83:Re: kf


    I keep getting the same error when I try to compile a *.shp file.

    Compiling shape/font description file
    Bad shape definition at line 1 of
    F:\SEDCO_HR\Wind_Project\pnwwind50m\pnw_50mwindnou​ma.shp:
    Expected '*n,len,name' shape header

    Any help or Advice would be appreciated. Thanks

    DB:3.83:Re: kf

    Will it catch on? ;-)

    "R. Robert Bell" wrote in message
    news:806ECB07AE19528B2576B21A5B5263B5@in.WebX.maYI​adrTaRb...
    "gsarver" wrote in message
    news:f16b687.6@WebX.maYIadrTaRb...

    TuFer is a nickname for A2k4

  • RELEVANCY SCORE 3.78

    DB:3.78:Compiling Packaged Servlet p3


    I have the following two java files in coreservlets directory, which stays in servlets directory.
    "A.java":
    package coreservlets;
    public class A {
    ...
    }

    "B.java":
    package coreservlets;
    public class B {
    public B() {
    new A();
    }
    ...
    }

    A.java compiles perfectly, but compiling B.java gives an error saying that "cannot find symbol: A" ... can somebody please help me with this.

    Thanks in advance.

  • RELEVANCY SCORE 3.78

    DB:3.78:Java Compiler zd


    We all use the javac command-line tool for compiling Java source files to class files. Then why do we need an API to compile Java files?

    DB:3.78:Java Compiler zd

    YoungWinston wrote:
    kuldeep wrote:
    Then why do we need an API to compile Java files?You don't. Do you mean an IDE, rather than an API?You will need the standard API and any 3rd party APIs referred to in the source available for referencing by the compiler :)

  • RELEVANCY SCORE 3.77

    DB:3.77:9ias Linux ::) Compiling Fmb/Pll/Mmb Edited Files Under Windows Os. !!!!!!! 79


    Dear all,
    I don't know how to compile (command) fmb/pll/mmb files under linux!
    Thank U !

    Regards
    Joe.

    DB:3.77:9ias Linux ::) Compiling Fmb/Pll/Mmb Edited Files Under Windows Os. !!!!!!! 79

    Thanks a lot for help!
    I have tested this and it gives good result.

    Joe

  • RELEVANCY SCORE 3.71

    DB:3.71:Frmcmp Issue ! fa


    Hey Guys,
    I'm compiling forms 6i using frmcmp. Here is my code. The problem I'm having is that all the fmbs are compiled but fmx are not generated. Can anyone find what I'm doing wrong ?

    Thanx

    :COMPILE PLSQL LFORMS
    ECHO COMPILING PLLs files from the HM directory
    cls
    Echo compiling Libraries....
    for %%f IN (C:\*.fmb) do frmplsqlconv userid=username/password@database module=%%f batch=yes logfilename=C:\fmb_converter.log generateruntime=true
    ECHO FINISHED COMPILING APPLIB Libraries files

    ECHO COMPILING PLLs files from the HM directory
    cls
    for %%f in (C:\*.fmb) do frmcmp userid=username/password@database
    module=%%f module_type=FORM batch=yes window_state=minimize compile_all=yes
    ECHO FINISHED GENERATING COMPILING APPLIB Libraries files

  • RELEVANCY SCORE 3.67

    DB:3.67:Merger Two Style Sheets At Run Time x3



    Hi,

    Can we merge two css files to get one swf after compiling.

    Thanks,

    Jayagopal.

    DB:3.67:Merger Two Style Sheets At Run Time x3


    Hi,

    Can we merge two css files to get one swf after compiling.

    Thanks,

    Jayagopal.

  • RELEVANCY SCORE 3.64

    DB:3.64:Need Help With Compiling Stuff In Java. dz


    My friend has written a program. It runs on linux just fine. He thought that the linux script might run on mac. I thought it might to. So i tried it. Nope it gives me back an error. Wich i have no clue wich it says or how to fix it. Im se to using exlipse for compiling stuff. All help would be appricated.

    the script:
    echo Compiling Randoms

    javac -cp .:././jars/impsoft.jar:././jars/swt.jar:././jars/jython.jar:././plugins Randoms/*.java

    echo Compiling Scripts

    javac -cp .:././jars/impsoft.jar:././jars/swt.jar:././jars/jython.jar:././plugins Scripts/*.java

    echo Compiling iScar PLugins

    javac -cp .:././jars/impsoft.jar:././jars/swt.jar:././jars/jython.jar iscarplugins/*.java

    echo Compiling Plugins

    javac -cp .:././jars/impsoft.jar:././jars/swt.jar:././jars/jython.jar plugins/*.java

    the error

    kevin-roses-computer:~/Desktop/nexus kevinrose$ ./compile.shCompiling Randoms
    javac: invalid flag: Randoms/*.java
    Usage: javac options source files
    use -help for a list of possible options
    Compiling Scripts
    javac: invalid flag: Scripts/*.java
    Usage: javac options source files
    use -help for a list of possible options
    Compiling iScar PLugins
    javac: invalid flag: iscarplugins/*.java
    Usage: javac options source files
    use -help for a list of possible options
    Compiling Plugins
    error: error reading plugins/*.java; plugins/*.java (No such file or directory)
    1 error
    kevin-roses-computer:~/Desktop/nexus kevinrose$

    MacBook Mac OS X (10.4.9) Java is 1.6.0_ad

    DB:3.64:Need Help With Compiling Stuff In Java. dz

    Ah. I must have an older version -- it doesn't list '-cp' as an option.

  • RELEVANCY SCORE 3.64

    DB:3.64:Compilation zd


    Actually , i was juz curious whether compiling to class files is a must for applets... Is it?

  • RELEVANCY SCORE 3.58

    DB:3.58:What Does This Mean? as


    ResourceManager : unable to find resource 'VM_global_library.vm' in any resource loader.

    - Would this prevent compiling projects or java files?

    DB:3.58:What Does This Mean? as

    I was joking about the sloooowwww startups, hence the wink. I've just been noticing the activity on the forum regarding slow startups of jdev and haven't had much problem with startup time in the last couple versions. But I am getting that velocity engine error and I agree - it doesn't seem to be the cause of any of the problems I've had and am working out.

    -Brian

  • RELEVANCY SCORE 3.58

    DB:3.58:Re: How To Compile jz


    YE,

    What you are asking doesn't make any sense.

    If there are errors in the Java files, compiling them with ANT isn't going to make the errors go away.

    John

    DB:3.58:Re: How To Compile jz

    In this situation, can I use old build.xml to compile them?Depends on the build.xml file. Most people would develop build.xml files to compile all Java files in a directory as opposed to compiling specific files, in which case, adding and removing Java files would not require you to change the build.xml file.

    As it seems you are learning about ANT and how to use it with JDeveloper, I'd suggest you take a backup of your application and then try out the scenarios that concern you with the backup copy. Use ANT from the command line so you eliminate all of the moving parts like Hudson in your testing

    John

  • RELEVANCY SCORE 3.58

    DB:3.58:Cannot Resolve Symbol 9k


    Hi,

    I'm getting "cannot resolve symbol" error , when i'm compiling my java files. I have created a package called mypack. In which i created 2 java files. They are:

    one.java
    two.java

    In two.java i'm creating the object of one class. When i'm compiling two.java, i'm getting aboe error. Please anybody has idea of it. Thanx in advance.

    DB:3.58:Cannot Resolve Symbol 9k

    Try using an IDE like netbeans or eclipse which sets up this for you.

  • RELEVANCY SCORE 3.58

    DB:3.58:Can Java Code Be Compiled As An O. File And How? 7c


    Some langyages produce o. files during the compiling process. Can Java do that?

  • RELEVANCY SCORE 3.57

    DB:3.57:Compiling Java Package 7c


    I have a folder a within which I have multiple folders b c d e containing java files b c d e are the packages which r dependent on each other.
    How do I compile the whole package a instead of compiling individual java files

    DB:3.57:Compiling Java Package 7c

    I have never had problems with the compiler having difficulties due to interdependencies between classes.

  • RELEVANCY SCORE 3.52

    DB:3.52:Compiling Under Jdk1.1.8 And Jdk1.3.1 sx


    If I compile a package that contains some classes called
    xe5e6c2c4c2c4d9f140404040f0f1f0.java,
    xe5e6c2c4c2c4d9f140404040f0f1f1.java,
    xe5e6c2c4c2c4d9f140404040f0f1f2.java
    ...
    ...
    ...
    xe5e6c2c4c2c4d9f140404040f0f2f1.java
    xe5e6c2c4c2c4d9f140404040f0f2f2.java
    and so on....
    with javac -d.... -classpath.... *.java
    by compiling with jdk 1.3.1 I'll get 7 errors by 10 files,
    by compiling with jdk 1.1.8 I'll get no erro's
    but if I compile class by class with jdk 1.3.1 I'll get no errrors.
    Can somebody help me?

    regards
    Markus Nohr

    DB:3.52:Compiling Under Jdk1.1.8 And Jdk1.3.1 sx


    There is difference jdk1.1.8 and jdk1.3
    First Several classes were deprecated from jk1.1.8 to
    jdk1.2, then from 1.2 to 1.3.

    You need to upgrade:
    1) compile you code under jdk1.3 with option
    -deprecation. This will identify deprecated methods in classes.
    2) Consult you jdk1.3 API and replace these
    deprecated classes or methods. This is an iterative process, so keep going until you have nomre errors.

    Hope yhis helps

    =================================

    If I compile a package that contains some classes
    called
    xe5e6c2c4c2c4d9f140404040f0f1f0.java,
    xe5e6c2c4c2c4d9f140404040f0f1f1.java,
    xe5e6c2c4c2c4d9f140404040f0f1f2.java
    ...
    ...
    ...
    xe5e6c2c4c2c4d9f140404040f0f2f1.java
    xe5e6c2c4c2c4d9f140404040f0f2f2.java
    and so on....
    with javac -d.... -classpath.... *.java
    by compiling with jdk 1.3.1 I'll get 7 errors by 10
    files,
    by compiling with jdk 1.1.8 I'll get no erro's
    but if I compile class by class with jdk 1.3.1 I'll
    get no errrors.
    Can somebody help me?

    regards
    Markus Nohr

  • RELEVANCY SCORE 3.50

    DB:3.50:Page Compilation In Jsp 89


    Hi

    when will be the jsp page is compiled and is there is any pipeline involvment for compiling the jsp files in atg

    DB:3.50:Page Compilation In Jsp 89

    You can add weblogic.xml under your application's /WEB-INF folder if required with precompile option set and then redeploy your application. There are certain other ways also including an ant task which you can call during the build process to precompile your JSPs. Refer this:
    http://m-button.blogspot.in/2008/09/using-jsp-precompilation-in-weblogic.html

  • RELEVANCY SCORE 3.50

    DB:3.50:Skipping The File From Mass Compiling 97



    What could cause the exlusion of the file from being mass compiled?

    

    CompileFile: skipping C:\Program Files\National Instruments\LabVIEW 8.6\instr.lib\Temptronic TP04300\Examples\TP04300 Poll Temperature.vi







    Solved!
    Go to Solution.

    DB:3.50:Skipping The File From Mass Compiling 97


    Just open your top-level VI. Follow the error messages.

    Since it's an example VI it's highly unlikely that any VI is calling it. You probably just have it in your project file and then deleted it from the file system. In this case the project should at least show a "Warning: File missing" next to the name.

  • RELEVANCY SCORE 3.50

    DB:3.50:Compiling A Single .Cs File In A Project ds


     Is there any way that I can compile a single *.cs file in a project that contains multiple *.cs files without compiling the other files? Kinda of like you can compile a single file in a Visual C++ project.

    DB:3.50:Compiling A Single .Cs File In A Project ds

    I don't believe so.
     
    Part of this makes sense: when building C++ projects, all files within a library are compiled individually (to .objs) and then linked together.
    With C#, all files within a library are compiled and linked in a single step. (This is somewhat essential given that the C#s language avoids #includes and ignores ordering of declarations)
     
    So it's more natural for VC++ to expose compiling a single file at a time, since that's what you actually do at the command-line.
     

  • RELEVANCY SCORE 3.50

    DB:3.50:Compiling c8


    Hy. How can I compile *.c or *.cpp files in Visual C++ 2005 Express Edition Beta 2?

    DB:3.50:Compiling c8

    If you're in the IDE, use theBuild | Compile menuoption.On command line use the cl.exe tool.Marinus

  • RELEVANCY SCORE 3.50

    DB:3.50:Compilation Error While Coet Following Discrepencimpiling Code In Solaris 8 j7


    Hi,

    I compiled the C source files in Solaris 8 which was earlier compiled in SUNOS 4.1.3(Solaris 1.1).
    On compiling the gmy executable

    DB:3.50:Compilation Error While Coet Following Discrepencimpiling Code In Solaris 8 j7

    Hi

    You'll have to send clearer details if you'd like any help. I have no idea what gmy is. Note also that Solaris 8 is fairly well into end-of-life, and none of the currently supported Sun compilers are supported on it.

    Paul

  • RELEVANCY SCORE 3.50

    DB:3.50:Using Jar Files When Compiling In Windows Command Line da


    Hi all,

    I can't get my JAR files to be recognized. Cananyone help with classpaths, syntax etc. when compiling Java in Windows??

    Thanks in advance.

  • RELEVANCY SCORE 3.50

    DB:3.50:Jsp Compilation On R12 dk


    Does it require prior to compiling JSP files in R12 applications need to be down..?

    please refer me MOS .

    DB:3.50:Jsp Compilation On R12 dk

    NewEBSDBA wrote:
    Does it require prior to compiling JSP files in R12 applications need to be down..? Not necessarily but you have to bounce the application services once it is done.

    Unable to login after Release 11i to Release 12 Upgrade [ID 473320.1]
    Blank Page Accessing R12 - 'Missing class: _RF' in OACore application.log [ID 467562.1]

    Thanks,
    Hussein

  • RELEVANCY SCORE 3.50

    DB:3.50:Program Not Compiling Giving Error : Invalid Path, "C:\Program Files\Java-- zm


    I am using jcreator where i am getting this error while compiling

    Error : Invalid path, "C:\Program Files\Java\j2re1.4.2_05\bin\javac.exe" -classpath "C:\Program Files\Xinox Software\JCreatorV3LE\MyProjects\zeroCode\classes" -d C:\Program" Files\Xinox "Software\JCreatorV3LE\MyProjects\zeroCode\classes C:\Program" Files\Xinox Software\JCreatorV3LE\MyProjects\zeroCode\src\BasicServiceLister.java
    Instead of that same program is compiling in textpad/eclipse easily.

    Please tell me what should i do to set what.
    present settings are:
    User Variable:
    classpath C:\Program Files\Xinox JCreatorV3LE\MyProjects\zeroCode\ classes
    Java_HOme: C:\Program Files\Java\j2re1.4.2_05\bin\javac.exe
    Path:C:\Program Files\Java\j2re1.4.2_05\bin

    Classpath is System Variables:
    C:\Program Files\Xinox Software\JCreatorV3LE\MyProjects\zeroCode\ classes
    Path :C:\Program Files\Java\j2re1.4.2_05\bin

    wher i really need to modify the settings:
    May be thorugh command prompt.
    I never did. windowds environment varaibles i can set.

    Thanks
    Vijendra

    DB:3.50:Program Not Compiling Giving Error : Invalid Path, "C:\Program Files\Java-- zm

    Your JAVA_HOME variable is wrong too. It should point to the top directory of your Java install, not javac.exe.

    JAVA_HOME = C:\Program Files\Java\j2re1.4.2_05

  • RELEVANCY SCORE 3.50

    DB:3.50:Magled Files With Hgfs On Mac 10.5.8 Fusion 3.1.2 (332101) f8



    I'm using an Ubuntu 9.04 VM to build some C/C++ code. The files I'm compiling in Ubuntu are on my Mac. gcc is saying some header files are currupt but looking at the files they are not. Also compiling the same files on the Ubuntu hard drive works.

    Anybody know what's wrong? Seen this?

    DB:3.50:Magled Files With Hgfs On Mac 10.5.8 Fusion 3.1.2 (332101) f8


    I'm using an Ubuntu 9.04 VM to build some C/C++ code. The files I'm compiling in Ubuntu are on my Mac. gcc is saying some header files are currupt but looking at the files they are not. Also compiling the same files on the Ubuntu hard drive works.

    Anybody know what's wrong? Seen this?

  • RELEVANCY SCORE 3.50

    DB:3.50:Compiling pz


    can we compile two java files located at different locations at a time using the same jvm

    DB:3.50:Compiling pz

    can we compile two java files located at different
    locations at a time using the same jvm and the two
    classes are independent they have no relation like
    inheritance and soon...I didn't realise the first line in my first reply was invisible.

  • RELEVANCY SCORE 3.50

    DB:3.50:Compiling C++/.Cxx Files With 'Cc' xj


    Is there a flag I can pass to /opt/SUNWspro/bin/cc to make it compile .cxx/c++ files or do I have to use /opt/SUNWspro/bin/CC?

    DB:3.50:Compiling C++/.Cxx Files With 'Cc' xj

    Sorry, no, there is no way to tell cc to run CC instead.

    I think you must have run into a configuration problem with building python.
    I suggest you go to the python community at python.org and ask about configuration issues there.

  • RELEVANCY SCORE 3.50

    DB:3.50:Compiling On A Dual Core Machine And Running The Class Files On Linux. fc


    does compiling on a dual core machine and running the class files on linux have any effect?

    DB:3.50:Compiling On A Dual Core Machine And Running The Class Files On Linux. fc

    well, the problem that i felt was that when i runmy
    class files on my machine(windows xp, dual core),
    Thread.sleep(60000) sleeps for 1 minute. but wheni
    run it on a linux machine, Thread.sleep(60000)sleeps
    for 2 minutes. my application has a lot ofthreads.

    I can't be 100% sure, but I'm pretty sure that
    sleep(60000) doesn't sleep for 2 minutes on the other
    machine.I, wholeheartedly, agree.

    Due to timing issues it may seem to sleep a few milliseconds more, but not double.

    Of course, if there is a "real-time" (or even simply higher than the Java app) priority program running that is using a lot of the CPU it may seem like it sleeps a lot longer than 60000, but that is a different issue.

  • RELEVANCY SCORE 3.50

    DB:3.50:Sun Studio C++ da


    we are using SUN SPARC SERVERS.
    In that SUN STUDIO was loaded.
    If we create C++ files they are not compiling
    We are compiling as follows

    CC source file name

    then we are getting message that
    CC : not found.

    Please help me regarding as quickly as possible.
    It is most urgent

    DB:3.50:Sun Studio C++ da

    Sun Studio installs to /opt/SUNWspro/bin/ by default. Try adding this directory to PATH.

  • RELEVANCY SCORE 3.48

    DB:3.48:Delete *.Class fk


    after modifying a java source program, is it a must to delete all the class files before re-compiling them?

  • RELEVANCY SCORE 3.45

    DB:3.45:Mfsvcutil Generated Proxy Files Compiling Error 8p



    Hi,

    DB:3.45:Mfsvcutil Generated Proxy Files Compiling Error 8p

    Hi,
    It's not a WCF issue but a C# compile problem. Please refer to:
    http://social.msdn.microsoft.com/forums/en-US/csharpgeneral/thread/6c8f9d59-7c7f-463c-84d2-c1d349cd3bf6/
    I'll close this thread for now.Please remember to mark the replies as answers if they help and unmark them if they provide no help. Windows Azure Platform China Blog: http://blogs.msdn.com/azchina/default.aspx

  • RELEVANCY SCORE 3.44

    DB:3.44:Xorg Keymap Errors cj



    I just decided to check my log files and at the end of the xorg log was this:
    (EE) Error compiling keymap (server-0)
    (EE) XKB: Couldnt compile keymap
    (EE) Error compiling keymap (server-0)
    (EE) XKB: Couldnt compile keymap
    (EE) Error compiling keymap (server-0)
    (EE) XKB: Couldnt compile keymap

    DB:3.44:Xorg Keymap Errors cj


    Does not solve the problem, I have this problem too.

    http://bbs.archlinux.org/viewtopic.php? … 61#p411061

  • RELEVANCY SCORE 3.44

    DB:3.44:Urgent Help Stop Jdeveloper From Compiling When I Run The Application Debug dm


    Hi
    can anyone let me know how to stop jdeveloper from again compiling teh classes when i have to use debug mode. when ever i start the application it compiles all my java files again. any help where is teh option in jdev10.1.2

    Rashid

  • RELEVANCY SCORE 3.43

    DB:3.43:Error Compiling Movie mc



    error Compiling movie

    DB:3.43:Error Compiling Movie mc


    Error Compiling Movie

    -http://helpx.adobe.com/premiere-pro/kb/error-compiling-movie-rendering-or.html

    -http://helpx.adobe.com/premiere-elements/kb/error-error-compiling-movie-render.html

    -and nested sequences http://forums.adobe.com/thread/955172

    -and WMV files frame rate http://forums.adobe.com/message/4629210

  • RELEVANCY SCORE 3.41

    DB:3.41:Compiling To .Exe Files z3


    Does anyone know of a program that I can use to compile my Java programs to Windows .exe files?

    DB:3.41:Compiling To .Exe Files z3

    For answers to this frequently asked question, please see this thread: http://forum.java.sun.com/thread.jsp?forum=31thread=57650

  • RELEVANCY SCORE 3.41

    DB:3.41:Weblogic Compiling Application z3


    Hello,

    How can we figure out whether an ear file is precompiled application? and How can we tell that weblogic is compiling the application when deploying? can it be found in any log files and how to tell that?

    DB:3.41:Weblogic Compiling Application z3

    thx for the info, if i am deploying an application to a weblogic server, can i check in any server logs or sysout.log whether the app is an uncompiled or precompiled? or its only with thread dump?

  • RELEVANCY SCORE 3.41

    DB:3.41:Re: While Applying Patch We Are No Signature Will Be Applied To The Produc xp


    p
    Your given abou metalink works for me

    again i got error
    /p
    p
    Compiling JSP files...
    /p
    p

    perl -x /xxx/app/xxx11appl/jtf/11.5.0/admin/scripts/ojspCompile.pl compile quiet
    /p
    p
    AutoPatch warning:

    ERROR [code=-1] compiling out of date JSP files

    An error occurred while compiling JSP files.

    Continue as if it were successful [No] :

    We can comiple JSPs after patching right
    /p

    DB:3.41:Re: While Applying Patch We Are No Signature Will Be Applied To The Produc xp

    Your given abou metalink works for meGood to know that.

    If the main issue is resolved, I suggest you create a new thread for other issues next time.

    Thanks!

  • RELEVANCY SCORE 3.41

    DB:3.41:Compiling Media Files fk


    I USB synced about 250gb from an external hard drive to my media live hub. Even though it has downloaded the content it seems to be taking an extremely long time compiling files on the top notification bar even though I can play all my files is this normal?

    DB:3.41:Compiling Media Files fk

    Just had to be a bit patient left it to run overnight. All synced and fine now, thanks.

  • RELEVANCY SCORE 3.41

    DB:3.41:When Compiling Java Files Its Giving An Exception Exception In Thread Main Java.Lang.Noclassdeffounderror. j9


    Hello Friends, will any one help me to get rid of my problem, i am using windows 8.1 ,i installed java 1.6 version, , when i am compiling .java files it is compiling properly but it is not executing. giving an exception : Exception in thread "main"
    java.lang.NoClassDefFoundError.

    Original Title:Command Prompt

  • RELEVANCY SCORE 3.41

    DB:3.41:Compiling Interdependent Files 81


    I am having a little problem compiling my program which consists of a few different .java files. Suppose I have two files, a.java and b.java. a.java uses something from b.java and b.java also uses something from a.java. In C we get to include the other file's header file. But since there's no header file in Java, how do I compile such interdependent files? Thanx!

  • RELEVANCY SCORE 3.41

    DB:3.41:Forms Compilation. 8m


    Hello,
    I have ftped forms, olb files, menus and libraries from unix to windows. I am in the process of compiling them all. What is the order of compiling them? Do I need designer to compile them or a script is enough? Also, how do I compile the olb file? Is it compiled as library?

    DB:3.41:Forms Compilation. 8m

    Hi User,

    If the issue is solved , kindly close the post and mark the helpful answer.
    If it not yet solved , kindly revert

  • RELEVANCY SCORE 3.41

    DB:3.41:Bigendian ms


    Hi, everyone:

    I cannot find how to set up the bigendian flag while compiling. Any suggestion? I checked with Fortran_user_guide and Programmer_guide. But cannot find it with search through the PDF files.

    DB:3.41:Bigendian ms

    Dear Roman:

    I have some outputs from programs that ran on Linux using big-endian as compiling options. But when I moved these output files to a solaris x86 system. I cannot read these files using program compiled by Studio11. Is this also the situation you mentioned for Linux?

  • RELEVANCY SCORE 3.41

    DB:3.41:Quick Question: Compiling .F And .F90 cm



    is there any problem in compiling .f and .f90 files into the same program?

    DB:3.41:Quick Question: Compiling .F And .F90 cm


    Yes good point, or reverse the order of the source files to see if the lack of fixed-form indentation in main.f90 triggered errors.

  • RELEVANCY SCORE 3.41

    DB:3.41:Xml Utilities d1


    Hi All,
    Could you please point out the differences between having XML's utilities (like XSU, XML Parser) in jar files to compiling them in the database ?

    Anand.

    DB:3.41:Xml Utilities d1

    XSU stands for XML SQL utility it provides the APIs for giving XML-formatted result from SQL Query and storing the input XML document to the database. currently you can use xsu111.jar or xsu12.jar.

    XSU depend on Oracle XML Parser(xmlparserv2.jar) and JDBC(classes12.zip).

    null

  • RELEVANCY SCORE 3.40

    DB:3.40:Compiling Java Files 7c


    I downloaded jdk6 and im used to using an IDE so i don't know how to compile with jdk. How do i do that from the cmd window?

    DB:3.40:Compiling Java Files 7c

    Ok i got it i didn't update the path variable.

  • RELEVANCY SCORE 3.40

    DB:3.40:Compiling In Eclipse (Without Ant) zk


    How do I compile my *.java files in Eclipse? I've read their help section on compiling and, to be honost, found it more confusing then anything else.

    If it's applicable, I'm working with Struts.

    DB:3.40:Compiling In Eclipse (Without Ant) zk

    Alright, I found part of the problem (I think).

    I had the build path set to the default .bin folder instead of the .class folder.

    Thanks.

  • RELEVANCY SCORE 3.39

    DB:3.39:Compiling And Running Ejbs jj



    what are all the files to be included in the classpath for compiling and deploying Ejbs

    DB:3.39:Compiling And Running Ejbs jj


    Goto http://sourceforge.net/projects/jboss/ and download the quick start guide, this should get you going with the information that you need.

  • RELEVANCY SCORE 3.38

    DB:3.38:Jdeveloper 3.0 Additional Options zd


    How and where do I specify additional options in Jdeveloper3.0. I would like to specify ser2class option while compiling SQLJ files.

    Thanks

    Hari
    null

    DB:3.38:Jdeveloper 3.0 Additional Options zd

    I was able to use the -ser2class option once I updated the translator.zip file in the sqlj directory to the newest 8.1.6 version. Before that I had no luck.

    Does this mean that deployment of Java stored procedures is restricted to the command line until JDeveloper 3.1? When I try to deploy the java file with the .ser files for the profile, I am informed that an error occurred since the file is not externalizable which is incompatible with serializable or something like that.

  • RELEVANCY SCORE 3.38

    DB:3.38:Compiling cm


    Why is javac (JDK6) appending 'App' to my compiled source files and how do I stop it?

    DB:3.38:Compiling cm

    Coming back after a month means you were very busy, lol.

    What operating system are you using?
    And most importantly, what text editor / ide are you using?

    I cant imagine any circumstance ever in which If you were
    saving the file (and naming the class) "HelloWorld"
    and compiling with "javac HelloWorld.java" that youd get anything
    other than "HelloWorld.class".

  • RELEVANCY SCORE 3.37

    DB:3.37:Building Link Pass In Wince 6.0 kx


    Hello everyone,
    I am building an application as subproject in WinCE 6.0 platform builder for iMX27. I have created some more source and hearder files and added in the subproject. It builds properly. But while running the application it is crashing in the newly created
    source class files.
    Also during build i am getting following prints which i found to be unusual. PdfWaveformSnap.cpp is my newly added source file.

    Compiling .\PdfWaveformSnap.cpp
    BUILD: [00:0000000569:PROGC ] Building LINK Pass in D:\AFMGUI\StripChartUpdated\AFM_GUI\ directory.
    BUILD: [01:0000000584:PROGC ] Compiling .\StripChart.cpp
    BUILD: [01:0000000587:PROGC ] Compiling .\DataMngr.cpp
    BUILD: [01:0000000590:PROGC ] Compiling .\WaveformSnapshot.cpp
    BUILD: [01:0000000593:PROGC ] Compiling .\AppMain.cpp
    BUILD: [01:0000000596:PROGC ] Compiling .\AfmGui.cpp
    BUILD: [01:0000000599:PROGC ] Compiling .\AfmSys.cpp
    BUILD: [01:0000000602:WARNN ] D:\AFMGUI\StripChartUpdated\AFM_GUI\.\AfmSys.cpp(466) : warning C4101: 'i32ret' : unreferenced local variable
    BUILD: [01:0000000603:WARNN ] D:\AFMGUI\StripChartUpdated\AFM_GUI\.\AfmSys.cpp(575) : warning C4101: 'StIx' : unreferenced local variable
    BUILD: [01:0000000604:WARNN ] D:\AFMGUI\StripChartUpdated\AFM_GUI\.\AfmSys.cpp(575) : warning C4101: 'EdIx' : unreferenced local variable
    BUILD: [01:0000000605:PROGC ] Compiling .\PdfExporter.cpp
    BUILD: [01:0000000608:PROGC ] Compiling .\PdfWaveformSnap.cpp
    BUILD: [01:0000000612:PROGC ] Linking obj\ARMV4I\retail\AFM_GUI.exe

    Please let me know do i need to give any advanced build options for this and how can this problem be resolved.

    Thanks in advance.

    DB:3.37:Building Link Pass In Wince 6.0 kx

    You only have some warnings indicating that some variables are not used:
    http://msdn.microsoft.com/en-us/library/c733d5h9(v=vs.80).aspx
    -- Good luck, Erwin Zwart, Check out my blog: http://GuruCE.com/blog GuruCE Microsoft Embedded Partner http://GuruCE.com Consultancy, training and development services.

  • RELEVANCY SCORE 3.37

    DB:3.37:Compiling Assembly Code To Produce Com Files. fa


    Hi.I have MS VS2005 Professional, which has Masm v.8 (OS MS Windows XP SP2)I recently started learning assembly language. And I have no problems compiling 32-bit code.There's only something wrong while compiling asm code to produce COM files.Here's simple code sample:

    Code Block

    DB:3.37:Compiling Assembly Code To Produce Com Files. fa

    Wow, it  worked. You're right that by default it generates object files in coff format. Without specifying, that ml has to compile an object module format object file, even if I used 16-bit linker, it would give a fatal error:
    TEST.OBJ : fatal error L1101: invalid object module
    , which now makes sense. A couple of days ago I figured out on myself how to compile my example code using MASM v.6.xx and 16-bit link.exe. I thought that I definetely have to use not only 16-bit linker, but ml.exe version 6.xx. But at last I was able to compile using ml.exe v.8! But still you have to use 16-bit linker ( for instance Microsoft link.exe v.5.xx) to link 16-bit code. It will produce an .EXE file, which I easily convert to .COM using exe2bin.
     
    And of course it's easier to write a batch file for this to make the compilation faster:

    Code Block

  • RELEVANCY SCORE 3.37

    DB:3.37:Which Rc.Exe Is Been Used? z1


    Compiling a PocketPC 2003 application that has resource files and not using .net. While compiling resource files which of following rc.exe file is been used? a) D:\Program Files\Microsoft Visual Studio 8\Common7\Tools\Bin\RC.exeb) D:\Program Files\Microsoft Visual Studio 8\SDK\v2.0\Bin\rc.exec) D:\Program Files\Microsoft Visual Studio 8\VC\bin\rc.exeThanks in advanceSeemit

    DB:3.37:Which Rc.Exe Is Been Used? z1

    Hi Seemit,RC.exe will be used from the first path found in the current platform's BIN directory. Look at Tools | Options | Projects and Solutions | VC++ Directories, and change the platform to the one that you're interested in. For default Pocket PC 2003 (ARMV4) it looks like the first one encountered will be in the $(VCInstallDir)\bin directory, so c). Hope this helps,Jeff AbrahamVisual Studio

  • RELEVANCY SCORE 3.37

    DB:3.37:How To Compile .Jasm Files? fz


    I suspect this is a foolish question, but I cannot find a tool compiling .jasm files.
    Thank you in advance.
    Mike

    DB:3.37:How To Compile .Jasm Files? fz

    Hi !

    If you refer by a .jasm file to a file created by ClassCracker...just rename the files to .java.

    See ya
    Udo

  • RELEVANCY SCORE 3.36

    DB:3.36:Problems Formatting/Burning jx


    I burnt a few test copies of my DVD project successfully.
    But then had to make some changes.

    I recompressed my files and it all played fine in the simulator, but now when I try to burn a copy it gets right across to 95% and then I get the following log:

    Starting DVD Build LFF...
    Compiler Initializing...
    Precompiling Project LFF
    Compiling VMG Information...
    Created 10 PGCs in VTSM1
    Created 8 PGCs in VMG.
    4 Menu(s) will be created...
    Compiling Menu PGCs...
    Compiling Menu#1 (Tutorials)...
    Compiling Menu#2 (Billy Movies)...
    Compiling Menu#3 (Extras)...
    Compiling Menu#4 (Main Menu)...
    Writing VIDEO_TS.VOB
    1 VTSs and 4 Titles will be created...
    Compiling VTS#1 (Track 1)...
    Muxing VTS011.VOB
    Video File Read Error

    Build cancelled
    Building was not successful. See log.

    My DVD data size is 4.1GB.

    Can anyone help??
    Thanks in advance

    DB:3.36:Problems Formatting/Burning jx

    Looks like it was just a glich.

    Deleted it all again and re-compressed and it's worked.

    Thanks for your help.

  • RELEVANCY SCORE 3.35

    DB:3.35:Re: Compiling Classes In Different Folders zc


    Why don't just you put the source code files in the same folder, if they belong to the same package?

    DB:3.35:Re: Compiling Classes In Different Folders zc

    Would you mind elaborating on the advantages you see
    in keeping the source code separate from the compiled
    code? I've read other posts from people who say
    separate directories is the only way to go, but I've
    never felt a need to or noticed any difficulties with
    source and compiled in the same directory. If you work on the command line which is what many people do, having Foo.class and Foo.java files in the same directory makes your work slightly slower and a bit more annoying because you cannot efficiently use the shell's automatic file name completion features.

    Consider the class Foo is the only class the name of which starts with an F and you want to edit its source code. If the directory has both Foo.java and Foo.class, this is what you will need to type in minimum to edit the file:

    vi Ftabjtabenter

    (tab is commonly the key that invokes the shell's autocompletion) If the directory has got only source files you can edit it with:

    vi Ftabenter

    3 key strokes less is not much, especially compared to actually writing the source code, but makes the work maybe just a little bit more seamless.

    Also, in my personal opinion it is "cleaner" to have the source code in one place and the binaries in another -- e.g the binaries directory can simply be removed if you want to recompile everything and be sure no old binary code is left.

  • RELEVANCY SCORE 3.35

    DB:3.35:Compiling Help Needed 1j


    Hi. I am getting going and have a question...
    I am in the process of compiling a project and
    have arrived at a compiling impass. I have two
    java files, file A and file B. In each case, the
    code in one depends on the availability of the
    other's class file. So, I can't compile either.
    I am guessing that this is a pretty common problem
    when compiling interrelated files. Does anybody
    know how i can compile without commenting out the
    dependent methods?

    I hope this was reasonably clear.

    thanks,
    peter

    DB:3.35:Compiling Help Needed 1j

    ok. i figured it out, thanks.
    i added a package heading to the java files and
    the compiler didn't seem to like that. when i
    took out the common package heading, it compiled
    straight away. thanks again.

  • RELEVANCY SCORE 3.35

    DB:3.35:Compiling z3


    I am having a hard time compiling my .java files using javac. I know there aren't any errors in my code (it's too simple). I keep getting 'cannot read file, error 1'. Does anyone know what this error is and why I get it. Using the same compiling code on another file in the same directory works. (it's the only one that works)

    DB:3.35:Compiling z3

    i think its the problem with class path, u can set classpath temporarily using the command
    for eg: ' set classpath=%classpath%;c:\jdk1.3.1\bin ' , then compile ur .java file. and if u r still getting error, please paste ur java code ,then we can find out what is the error in it.

    java is the best....

    rajesh r

  • RELEVANCY SCORE 3.34

    DB:3.34:Link : Warning Lnk4089: All References To Shell32.Dll Discarded By /Opt:Ref kk


    Hi.
    when I run Batch Build ....
    Deleting intermediate files and output files for project 'Sampler - Win32 Release'.Deleting intermediate files and output files for project 'Sampler - Win32 Debug'.--------------------Configuration: Sampler - Win32 Release--------------------Compiling resources...Compiling...StdAfx.cppCompiling...Sampler.cppSamplerDlg.cppDisplayDlg.cppGenerating Code...Linking...LINK : warning LNK4089: all references to SHELL32.dll discarded by /OPT:REF
    Sampler.exe - 0 error(s), 1 warning(s)--------------------Configuration: Sampler - Win32 Debug--------------------Compiling resources...Compiling...StdAfx.cppCompiling...Sampler.cppSamplerDlg.cppDisplayDlg.cppGenerating Code...Linking...
    Sampler.exe - 0 error(s), 0 warning(s)
    what's my mistake? what should I do?
    thanks.

    DB:3.34:Link : Warning Lnk4089: All References To Shell32.Dll Discarded By /Opt:Ref kk

    I realize this question is old, but for the sake of others like me who come here to gleem some info:
    Here is what I was able to find: Yes, it is harmless, and just indicates the compiler tossed the references to a library that it did not need. If you want to supress this warning, enter /IGNORE:4089 as one of your inline linking options, and it will go away.
    As long as the post is still good, my source was here: http://vcfaq.mvps.org/ide/7.htm
    Hope this helps!~Joe

  • RELEVANCY SCORE 3.34

    DB:3.34:Jar Files. k7


    Thanks alot for the info about compiling to executables. I have one more problem. Using purely JDK and notepad, where do the .jar files spring from? All I see are .class and .java files...

    DB:3.34:Jar Files. k7

    if u donno the command, it's ok!
    just download the winrar

    it can extract it 4u!

  • RELEVANCY SCORE 3.33

    DB:3.33:Need Progress Information While Build Process Using Ant Script 78



    Hi,

    am using flex sdk and ant script to create build, but while compiling files it doesn't show any status information.

    i want to know the progress of compiling can any one help me..

    Thanks in advance

    DB:3.33:Need Progress Information While Build Process Using Ant Script 78


    Hi,

    am using flex sdk and ant script to create build, but while compiling files it doesn't show any status information.

    i want to know the progress of compiling can any one help me..

    Thanks in advance

  • RELEVANCY SCORE 3.32

    DB:3.32:Re: Class Files Won't Appear After Compiling A .Java File!!! a3


    Some of those rules are compiler specific.

    DB:3.32:Re: Class Files Won't Appear After Compiling A .Java File!!! a3

    Thanks Java_Jay. I looked at the book I've been using and I overlooked the statement that said I had to use the first or only class in my .java file as the filename. I tried that and it worked. Thanks for everyones help.

  • RELEVANCY SCORE 3.32

    DB:3.32:Compiling sx


    I'm totally new to programing.
    When I try compiling the first java document (HelloWorldApp)
    I get
    "unable to read HelloWorldApp.java"
    I created the file using notepad. When I try seeing the files by
    dir command, files have .txt at the end of it, is this the reason? if so how can I get lid of .txt?

  • RELEVANCY SCORE 3.32

    DB:3.32:I Get In Excel On Each File To Open The Info Mistake In Compiling Distmon And When Files Need To Be Closed Mistake In Compiling Autoexecnew c9


    Original Title: Excel 2010
    I did upload Office 2010 on a XP system with service pack 3 after delete Office 2003. Meanwhile I get in Excel on each file to open the info "Mistake in compiling DistMon" and when files need to be closed "Mistake in compiling AutoExecNew". Can someone help?

  • RELEVANCY SCORE 3.32

    DB:3.32:Help: Can't Compile Qmslib65.Pll Under Solaris 8k


    Hi,

    I am trying to apply patch 6.5.2.1. One of the files updated is qmslib65.pll.
    When I try and recompile it under Solaris I get the following error message:

    ---------------------
    .
    .
    .
    Compiling Package Body QMS$FORM_FUNCTION......
    Compiling Package Body QMS$FORMS_ERRORS......
    ERROR 315 at line 1149, column 78
    PL/SQL TABLE declarations must currently use binary_integer indexes
    ERROR 0 at line 1149, column 10
    Statement ignored
    Compiling Package Body QMS$FORM......
    Compiling Package Body QMS$FIND_BLOCK......
    Compiling Package Body QMS$ERRORS......
    ERROR 306 at line 131, column 4
    wrong number or types of arguments in call to 'POP'
    ERROR 0 at line 131, column 4
    Statement ignored
    ERROR 306 at line 139, column 7
    wrong number or types of arguments in call to 'POP'
    ERROR 0 at line 139, column 7
    Statement ignored
    Compiling Package Body QMS$CONTEXT......
    Compiling Package Body QMS$CONFIG......
    Compiling Package Body QMS$CALENDAR......
    Compiling Package Body QMS$BLOCK......
    Compiling Package Body QMS$APPLICATION......
    Compiling Procedure Body COPYRIGHT......
    Compiling Procedure Body CGHP$CALL_MS_HELP......
    Closing library QMSLIB65...
    Compilation errors on QMS$FORMS_ERRORS:
    PL/SQL ERROR 315 at line 1149, column 78
    PL/SQL TABLE declarations must currently use binary_integer indexes
    PL/SQL ERROR 0 at line 1149, column 10
    Statement ignored

    Compilation errors on QMS$ERRORS:
    PL/SQL ERROR 306 at line 131, column 4
    wrong number or types of arguments in call to 'POP'
    PL/SQL ERROR 0 at line 131, column 4
    Statement ignored
    PL/SQL ERROR 306 at line 139, column 7
    wrong number or types of arguments in call to 'POP'
    PL/SQL ERROR 0 at line 139, column 7
    Statement ignored

    Failed to generate library.

    FRM-30312: Failed to compile the library.

    -----------------------------------------------

    When I try under Forms on NT/2000 and Tru64 UNIX it compiles without issue.

    Under solaris gui (f60desm) and command line I get the above errors. I am connecting
    to the same database using the same user (hst65).

    DB:3.32:Help: Can't Compile Qmslib65.Pll Under Solaris 8k

    Hi,

    Finally found out what the problem was. The PLSQL Version under the Solaris box was 8.0.6.0.0 this should have been
    updated when we applied patch 9. The database patch did not install (see note: 191573.1 on metalink) once fixed
    the PLSQL Version was updated to 8.0.6.3.0 and recompiling QMSLIB65.PLL was successfull.

    BTW: All the ofg*65.pll, qmsevh65.pll, and the others compiled without issue under plsql version 8.0.6.0.0.

    Thanks for your suggestions.

  • RELEVANCY SCORE 3.32

    DB:3.32:Compiling A Package - Help!! kz


    Hello, I'm having problems compiling my Java package. I'm using the latest beta version(j2sdk1.4.0-rc). my application files are located in c:\java and the java apllication files are located at: c:\j2sdk1.4.0-rc. I get the "unresolve error". PLEASE HELP!!!

    DB:3.32:Compiling A Package - Help!! kz

    What is "the unresolve error"? Did you set your path and classpath correctly? Did you follow the JDK installation instructions carefully?

    Setting the class path
    http://java.sun.com/j2se/1.4/docs/tooldocs/win32/classpath.html

    Installation notes
    http://java.sun.com/j2se/1.4/install-windows.html

    Java 2 SDK Readme
    http://java.sun.com/j2se/1.4/README.html

    Jesper

  • RELEVANCY SCORE 3.32

    DB:3.32:Problem Compiling... p3


    /usr/j2sdk1.4.2_03/bin/javac -classpath lib/struts.jar -d classes -sourcepath src
    throws...
    javac: no source files

    src has several packages...

    suppose something like
    src.pcs.model
    src.pcs.userinterface

    how can I fix this ?

    Thanks.

    DB:3.32:Problem Compiling... p3

    Thanks, it worked using `find -name "*.java" -print`

  • RELEVANCY SCORE 3.32

    DB:3.32:Hc12: When Compiling, I Don't Get A .S19-Files ca


    Dear all,

  • RELEVANCY SCORE 3.32

    DB:3.32:Compiling d9


    i was wondering, can you only compile your files if they have no errors. No errors at all?

    DB:3.32:Compiling d9

    sentence with some grammar errors Can a compile you?

    The compiler does what it can, warns you on anything suspect, and completely borks out on anything worse than that. A warning is okay, the compiler will press onwards. Any problem worse than that will not create a new class file from the source, to my understanding.

  • RELEVANCY SCORE 3.32

    DB:3.32:Thread: Info In C:\Grpwise\Gwia\Defer ? zz


    I have some daily files compiling in the defer directory, and not going

    away, what could be the problem?

    DB:3.32:Thread: Info In C:\Grpwise\Gwia\Defer ? zz

    Mesick Man wrote:

    I have some daily files compiling in the defer directory, and not going

    away, what could be the problem?

    These are deferred messages that could not be sent because of any number

    of reasons, and by default the GWIA will try for four days to send them

    before giving up and returning an undeliverable to the sender. In any

    case, they have nothing to do with webaccess so if you\'re continuing to

    have troubles with the messages *never* leaving the defer directory, you

    might want to ask in the gwia forum here.

    -' + '-

    Jim

    NSC Sysop

  • RELEVANCY SCORE 3.32

    DB:3.32:Actionform Error d8


    Hi All,

    I have created a simple ActionForm java file (lets say LookupForm) which extends ActionForm. I have included the struts.jar and servlet.jar in classpath for compiling the java files.

    Now when I am compiling the LookupForm java file I am getting the error can not resolve symbol "ActionForm"

    What needs to be done.

    Thanks in Advance.

    Dhiren.

    DB:3.32:Actionform Error d8

    hi all
    i got the solution copy the struts.jar and servlet.jar or javax.servlet.jar into the java_home\jre\lib\ext folder and set the environment variable accordingly that is classpath=.,e\j2sdk1.4\jre\lib\ext\struts.jar by clicking onmy computeradvanceenvironment variable system variable(Im using win2k j2sdk 1.4_05 and jboss-3.2.3) where j2sdk1.4 is my java_home directory(replace it with yours). then compile with the normal
    javac command with the path where the file to be compiled is present(like c: javac e:\LookupForm.java.

    it will definitely solve your problem.
    cheer!!!!

  • RELEVANCY SCORE 3.32

    DB:3.32:Sdk/Edk 14.3 Cannot Compile Bsp Package ds


    After successful went thought the design flow on XPS 14.3, I export the design to SDK 14.3. I created a BSP project for standalone_bsp_0. But it compiled with errors. Would anyone point me to how to fix the errors. I am working on ML510 board and PPC440. The Xilinx application version is 14.3.

    make -k all
    libgen -hw ../ml510_dual_vxworks_ppc440_14_hw_platform/system​.xml\
    \
    -pe ppc440_0 \
    -log libgen.log \
    system.mss
    libgen
    Xilinx EDK 14.3 Build EDK_P.40xd
    Copyright (c) 1995-2012 Xilinx, Inc. All rights reserved.

    Command Line: libgen -hw ../ml510_dual_vxworks_ppc440_14_hw_platform/system​.xml
    -pe ppc440_0 -log libgen.log system.mss

    Staging source files.
    Running DRCs.
    Running generate.
    XPS_BRAM_IF_CNTLR_1 not connected

    DDR2_SDRAM_DIMM1 not connected

    Running post_generate.
    Running include - 'make -s include "COMPILER=powerpc-eabi-gcc"
    "ARCHIVER=powerpc-eabi-ar" "COMPILER_FLAGS=-mfpu=dp_full -mcpu=440 -O2 -c"
    "EXTRA_COMPILER_FLAGS=-g"'.

    Running libs - 'make -s libs "COMPILER=powerpc-eabi-gcc"
    "ARCHIVER=powerpc-eabi-ar" "COMPILER_FLAGS=-mfpu=dp_full -mcpu=440 -O2 -c"
    "EXTRA_COMPILER_FLAGS=-g"'.
    "Compiling common"
    powerpc-eabi-ar: creating ../../../lib/libxil.a
    "Compiling llfifo"
    "Compiling lldma"
    "Compiling dma"
    "Compiling standalone"
    "Compiling lltemac"
    "Compiling llfifo"
    "Compiling iic"
    "Compiling gpio"
    "Compiling pci"
    "Compiling uartns550"
    "Compiling spi"
    "Compiling sysace"
    "Compiling bram"
    "Compiling intc"
    "Compiling tft"
    xtft.c: In function 'XTft_GetPixel':
    xtft.c:368: error: expected ')' before ';' token
    xtft.c:370: error: expected ';' before '}' token
    make[1]: *** [libs] Error 1
    "Compiling cpu_ppc440"
    ERROR:EDK:369 - make failed for target "libs"
    ERROR:EDK:3418 - Error(s) while running make.
    make: *** [ppc440_0/lib/libxil.a] Error 2
    make: Target `all' not remade because of errors.

    DB:3.32:Sdk/Edk 14.3 Cannot Compile Bsp Package ds


    I looked at the code. It is missing the ')". Xilinx did not test before shipped the product.

    Thanks,

  • RELEVANCY SCORE 3.32

    DB:3.32:Compiling Takes Like Forever ? 8f



    hey there,

    when the hub will "load" my files, by compiling, then it takes forever !!

    i have my movies on my nas, and synchronice the music from the nas, to to local harddrive of the HUB..

    is they why ??

    Takes about 20-30 minute every time when i start it up ??

    And when the compiling is done, i can only get information of the last 10 movies I have ?

    And not the music

    DB:3.32:Compiling Takes Like Forever ? 8f


    This may help answer your question.

    http://community.wdc.com/t5/General-Discussions/WD-TV-Live-Hub-Media-Library-Complie-Issue/td-p/8919...

  • RELEVANCY SCORE 3.32

    DB:3.32:Trouble Compiling s3


    Hi. I am trying to compile one of the sample plug-ins with Visual C++ 2005 Express. The following error is resulting. C:\Program Files\Autodesk\Maya2009\include\maya/MTypes.h#40;137#41; : fatal error C1083: Cannot open include file: 'winsock2.h': No such file or directoryI would appreciate suggestions toward a solution. Thanks.APS

    DB:3.32:Trouble Compiling s3

    Hello. I solved this problem by installing Microsoft Windows SDK. Now sample plug-ins like helloWorldCMD will compile. The MEL command helloWorld is not working once the plug-in is loaded into Maya. Thanks.APS

  • RELEVANCY SCORE 3.32

    DB:3.32:Re: The Requested Url /Oa_Html/Appslogin Was Not Found On This Server. a9


    Said,

    What about compiling JSP files (using "perl ojspCompile.pl --compile --flush -p" command)?

    Thanks,
    Hussein

    DB:3.32:Re: The Requested Url /Oa_Html/Appslogin Was Not Found On This Server. a9

    Thanks for the update.

    Looks like the same issue is reported in (AppsLogin Page Not Opening In R12.1.1 With "File Does Not Exist" Error [ID 1122804.1]).

    Thanks,
    Hussein

  • RELEVANCY SCORE 3.32

    DB:3.32:Problem Compiling Jsp File 33


    I am using ant to precompile my jsp files which contains struts taglibs but it is giving an error

    [jasperc] error:org.apache.jasper.JasperException: Error compiling \attendance\AllPendingAuthentication.jsp

    [jasperc] at org.apache.jasper.JspC.processFile(JspC.java:543)
    [jasperc] at org.apache.jasper.JspC.execute(JspC.java:748)
    [jasperc] at org.apache.jasper.JspC.main(JspC.java:770)

    what i need to do to come out of this??

    DB:3.32:Problem Compiling Jsp File 33

    You can load the JSP in the browser and add a jsp_precompile parameter, something like:

    http://yourwebsite.com/yourwebpage.jsp?jsp_precompile

    Any mistakes will end up being displayed in the browser, but the JSP will never get executed should it contain no programming mistakes.

  • RELEVANCY SCORE 3.32

    DB:3.32:Compiling A Java File Using Java Code 9c


    HI Champs,

    Can anybody tell me how to compile java files through java code ..?

    I am using Runtime.exec() but after compiling one its not coming out of loop any ideas, suggestions ?

    Greetings,
    Alpesh

    DB:3.32:Compiling A Java File Using Java Code 9c

    If you have sun's JDK (and tools.jar in your classpath), you can compile classes with the sun.tools.javac.Main class. There's no documentation available but you'll get the method and constructor listing with the command "javap sun.tools.javac.Main" - IIRC you can specify a stream where the error messages are printed in a constructor and compile source files with the compile() method.

  • RELEVANCY SCORE 3.29

    DB:3.29:Javac mm


    in the new version of 1.4.1 in the bin directory there's no "javac.exe" no way of compiling the java text files. anyone noticed that?

    DB:3.29:Javac mm

    Both the jre and the sdk are on the same page. You have to look at the column titles to pick the correct one.

  • RELEVANCY SCORE 3.28

    DB:3.28:Dynamically Compiling C++ a7


    Is there anyway to dynamically compile C++ files in visual studio 8?
    I know i can use codedom namespace for compiling C# sources but im
    wondering if there is a way to do the same with C++ source files.

    DB:3.28:Dynamically Compiling C++ a7

    create a dummy vc-solution, replace the codefiles with your (dynamically) created ones. then create a process witch runs msbuild.call the created exe file or if you create a library you can dynamically access it (using reflection).

  • RELEVANCY SCORE 3.28

    DB:3.28:Compiling Error C:\Program Files\Windows Ce Tools\Wce420\Standardsdk_420\Mfc\Include\Wcealt.H(245) : Error C2084: Function Void 8p


    Hi, 

  • RELEVANCY SCORE 3.26

    DB:3.26:Re: Compiling Ejb's zz


    you have to compile all file in a directory.
    go to the directory placing EJB files.
    Ex: javac -d . *.java
    Good luck !

    DB:3.26:Re: Compiling Ejb's zz

    1. Set the classpath

    set classpath=%classpath%;.;c:\bea\weblogic81\server\lib\weblogic.jar

    2. go for to compile EJB files

    javac *.java

    Note : Pls remember where u installed the weblogic

    eg : if u installed in d:\sukumar folder means

    then the path should be

    d:\set classpath=%classpath%;.;d:\sukumar\bea\weblogic81\server\lib\weblogic.jar

  • RELEVANCY SCORE 3.23

    DB:3.23:Compiling Jpf File Using Ant 8f



    Hi..

    How to compile .jpf files using ANT, without using workshop ? Can you point me
    to the resource?

    TIA

    MBhat

    DB:3.23:Compiling Jpf File Using Ant 8f


    Hi..

    How to compile .jpf files using ANT, without using workshop ? Can you point me
    to the resource?

    TIA

    MBhat

  • RELEVANCY SCORE 3.23

    DB:3.23:Thread: Compiling Applications jc


    I need some help with compiling some applications that I want to add to the initrd file of my pxe server. I don\'t know how to compile for the specific kernel. I am running off of these files Novell Login Does anyone know how to compile things that will work with the pxe\'s kernel?

  • RELEVANCY SCORE 3.23

    DB:3.23:Runtime Compiling Of .Cs Files For Plugins? js


    I am looking to create an application where a user can write their own .cs for the plugins and not worry about compiling them. I have used software in the past where I have seen the ability to do this, I am wondering if anyone knows of a toutorial or has
    an example of how to do runtime compiling so this can work?

    Thanks

    DB:3.23:Runtime Compiling Of .Cs Files For Plugins? js

    Also keep your eye out for Roslyn:
    Microsoft Roslyn CTPMy blog: blog.jessehouwing.nl

  • RELEVANCY SCORE 3.23

    DB:3.23:Error Compiling Movie 9z



    hii i am workong on a hd files on premire cs6 and when trying to export them on a quichtime HD the following message pop up "error compiling movie :unkown error" but when exporting with pal dv wide screen their is no problem any help plzz

    my client want the files today

    DB:3.23:Error Compiling Movie 9z


    The Max Depth setting is under the the video tab in the export settings and Max Render Quality is at the bottom of the export panel

    Eric

    ADK

  • RELEVANCY SCORE 3.23

    DB:3.23:Error Running Sample Application 9k


    Not able to run sample application. while compiling *.java files it's giving error oracle.ifs.bean.* not found. pls. suggest asap.

    DB:3.23:Error Running Sample Application 9k

    Do you have your CLASSPATH setup correctly? Your CLASSPATH must include the iFS libraries if you want to compile anything. Read the devkit documentation for more info.

  • RELEVANCY SCORE 3.23

    DB:3.23:Compiling Multiple Files 3c


    Hi,

    When i compile 2 files:
    javac A.java B.java
    If A.java fails to compile, the compiler doesn't try to compile B.java.

    Is there a way to force the compiler to continue compiling even if one or more files fails to compile?

  • RELEVANCY SCORE 3.23

    DB:3.23:Compiling *.Vit Files z3


    I am using *.vit files to dynamicaly open multiple copies of the same user interface. This works fine, but when i try to compile the program i get "???" in the error cluster and only on of the multiple windows opens. Could someone please explain what is happening and if there is any way to solve it? Cheers,

    DB:3.23:Compiling *.Vit Files z3

    There are both build-time and run-time bugs when trying to include templates in an executable. See the previous thread http://exchange.ni.com/servlet/ProcessRequest?RHIVEID=101RNAME=ViewQuestionHOID=506500000008000000CA290000ECategory=LabVIEW.LabVIEW+Generalfor a description of a workaround.




    LabVIEW, C'est LabVIEW

  • RELEVANCY SCORE 3.23

    DB:3.23:Compiling For Dummies mc



    I am trying to compile some .as files into a .swc and need some help. If anyone would like to walk me through this it would be appreciated.

    Thanks'

    925Jay

    DB:3.23:Compiling For Dummies mc


    Yes I have downloaded an src file and am trying to compile it but it wont create a .swc file. I just get errors I am wondering if I am doing something wrong

  • RELEVANCY SCORE 3.23

    DB:3.23:Unity Stopped Compiling Automatically as



    This problem can be caused if you have enabled meta files in Project Settings, but have set the file attribute to Hidden on the meta files. Unity just stops refreshing, but will refresh fine if you open a project that doesn't use meta files, or if you unhide the meta files.

    DB:3.23:Unity Stopped Compiling Automatically as


    Firstly. Under stand my Languadge skill. my english is not good. becouse im korean , anyway Also i have the same problem as you, so i was finding answer this problem in internet, But unfortunately i didn't find.. and than i find some repetitively feature in problem. it is the ScriptName! if you make Script name that Main or MainManager Uinty doesn't automaticaly compile , but if you change your script name, No problem! ^^. than good luck. ^^

  • RELEVANCY SCORE 3.23

    DB:3.23:Workflow Error dd


    Errors were found when compiling the workflow. The workflow files were saved but cannot be run

    DB:3.23:Workflow Error dd

    Hi, 1)First of all check all the property of Element(Activity) in Sharepoint design mode is properly set and after that check it is properly deactivate and uninstall and after that install it and activate feature. 2)For your problem the suggested thing is create new workflow project and do whatever thing you have done before it and deploy it. I know second one  is not appropriate solution but in my case it is working after working one large number of working hours. Thanks  Regards, Arpan Shah

  • RELEVANCY SCORE 3.23

    DB:3.23:Nullpointerexception While Compiling Jsps 1d


    I'm getting a NullPointerException while compiling JSP files using the 9.0.3 (preview) version of JDeveloper. This happens when I include a custom tag library in the JSP files. Am not sure why this is happening. Any help is greatly appreciated.

    - Ranga

    DB:3.23:Nullpointerexception While Compiling Jsps 1d

    Are all your tag handler classes within the jar file of the registered tag library?

  • RELEVANCY SCORE 3.23

    DB:3.23:Missing Something When Compiling Cpv Java 7d



    Where and what files do I put where on my PC so that..

    import com.audium.server.AudiumException;

    import com.audium.server.voiceElement.ActionElementBase;

    import com.audium.server.session.ActionElementData;

    works, and I can write proper classes for CVP. I think its framework.jar

    Any HELP is great!!

    Chad

    DB:3.23:Missing Something When Compiling Cpv Java 7d


    Are you reading "VoiceXML Programming Guide for Cisco Unified Customer Voice Portal Release 4.0(1)" ? That's your bible, along with the Audium Java docs.

    On page 4:

    "Once a component is constructed in Java, the process for compiling and deploying these classes is very simple. The VoiceXML Server lib directory includes JAR files containing everything a developer requires to compile custom components. The main JAR file of interest is framework.jar, which defines the entire Unified CVP Java API (including the VFCs). To create custom components, all that is needed is to ensure that this JAR file appears in the compiler's CLASSPATH or referred to in a Java IDE project file."

    Regards,

    Geoff

  • RELEVANCY SCORE 3.23

    DB:3.23:Continuous Compiling - Never Finding Any Files On Hub 3a



    After the last upgrade for my WD TV Live Hub I cannot get any files to show up and theWD TVcontinously says compiling, yet never finds any files for Photos, Video or Music. If you browse the hub with the file browser you can see all of the files. I am only looking for files located locally on the WD TV Live Hub.

    I've left it on over night with no success.

    Any suggestions?







    Solved!
    Go to Solution.

    DB:3.23:Continuous Compiling - Never Finding Any Files On Hub 3a


    What types...

    No way of knowing. It can happen with poor encodes that have corrupted metadata in them, but it's impossible to predict.

    anyway to access a log

    Nope...

    Can you exclude...

    Actually, YES. If you PRECEDE a folder name with a ".", such as renaming "My Movies 1" to ".My Movies 1" the hub will COMPLETELY ignore the folder when it builds the library.




    ===Live SMP / Live Hub x2 / Live+ / Live x2 / 24 TBytes of QNAP + WD NAS ===

  • RELEVANCY SCORE 3.23

    DB:3.23:[C++] Include Problem Causing Compiling Error [Solved] 7a



    Hello.
    I am working on some code snippets that I finally want to put together.
    There are three relevant files that cause the compiling error:
    mpdscrob.cpp
    options.h
    librc.h

    DB:3.23:[C++] Include Problem Causing Compiling Error [Solved] 7a


    codemac: No, the error is still the same. Why it should be anything differend?

    drakosha: librc is written by myself. It is comprised of these files:
    librc.h
    librc.cpp

  • RELEVANCY SCORE 3.23

    DB:3.23:Form Distribution Compiling Data 1m



    With Acrobt 9 standard, when compiling response forms, does the app. simply log the returned files or add pages to an existing form? Can you tranfer data from multiple files into a single file?

    DB:3.23:Form Distribution Compiling Data 1m


    With Acrobt 9 standard, when compiling response forms, does the app. simply log the returned files or add pages to an existing form? Can you tranfer data from multiple files into a single file?

  • RELEVANCY SCORE 3.23

    DB:3.23:Compiling Utf-8 Source Java Files sm


    Hi there,

    Is it possible to compile java applications with the source files encoded in utf-8 format?

    DB:3.23:Compiling Utf-8 Source Java Files sm

    Thank you for your reply, but i have an error when i
    compile like that

    error: compiler message file broken:
    key=compiler.err.java.io.UnsupportedEncodin
    gException: utf8 arguments=null, null, null, null,
    null, null, null
    1 error

    What is error mean??The following all work with the Sun jdk 1.4

    javac -encoding UTF8 MyClass.java
    javac -encoding utf8 MyClass.java
    javac -encoding utf-8 MyClass.java

    If the encoding is wrong then it produces the following error

    error: unsupported encoding: XXXX

    And that is not the error that you are getting. Which at the very least suggests that you are not using Sun 1.4. So it might help to know which version you are using.

  • RELEVANCY SCORE 3.23

    DB:3.23:Jdeveloper Showing Indexing 24 Files ac


    Hi All,
    I wrote a soa code in my jdeveloper, which is working and compiling successfullly, but i sent the same code to my friend through mail and pendrive. code is not compiling , simplyl it showing compiling.... if we check right hand side of jdeveloper at the bottom its showing INDEXING 24 files. Any idea wats behind that

    Regards
    Francis

    DB:3.23:Jdeveloper Showing Indexing 24 Files ac

    Hi Frank,
    But it hangs for 5 to 6 hours, code is not compiling at all

    Regards
    francis