• RELEVANCY SCORE 5.47

    DB:5.47:Altivec In C Compiling Problems kd




    Question for PowerPC code development, thread moved to appropriate forum

    DB:5.47:Altivec In C Compiling Problems kd

    Question for PowerPC code development, thread moved to appropriate forum

  • RELEVANCY SCORE 4.21

    DB:4.21:Altivec In C Compiling Problems k8




    Hi! I'm new to c and i dont really know if this thread does belong here. I've tried to compile my AltiVec programs on a dcc compiler but I invariably get a syntax error on the lines where I've used vectors. Am I supposed to include something which I'm not including? Or what could be the problem? Please help.

  • RELEVANCY SCORE 3.43

    DB:3.43:Where To Find The Latest Altivec Technology, Programming Interface Manual? 8k





    Hi,

    I am looking for a good starting point for writing Altivec Code for the e6500 (T2080/T4240).

    The programming interface manual is dated from 6/1999

    http://cache.freescale.com/files/32bit/doc/ref_manual/ALTIVECPIM.pdf

    Is it the latest document?

    Actually I tried vec_malloc(), which seems to have no C prototype.

    I can give more details, it desired.

    best regards

    Alois

    DB:3.43:Where To Find The Latest Altivec Technology, Programming Interface Manual? 8k


    The most recent version of "AltiVec Technology Programming Instructions Manual for Power ISA Processors" (ALTIVECPOWERISAPIM.pdf) is preliminary and not published yet.

    If you wish to get preliminary version of this document, please contact your local Freescale representative.

    Looking to this document, I see the vec_malloc() is somehow mentioned in Section 3.5, but there is no changes in this section, this section is exactly the same as in old ALTIVECPIM.pdf (6/1999).

    If the function have no prototype this means you have some library missing.

  • RELEVANCY SCORE 3.18

    DB:3.18:How To Activate Altivec2 In Gcc ? dp



    Hi,

    this is a specific question about using the new altivec instructions (altivec2 extensions) of the e6500 in gcc

    I use the target specific option -mcpu=e6500.

    Building file: main.cpp
    "/home/freescale/CodeWarrior_PA_10.4.0/eclipse/../Cross_Tools/gcc-4.8.2-Ee6500-aeabi/bin/powerpc-aeabi-g++" "../Sources/main.cpp" @"Sources/main_1.args" -o"Sources/main.o"
    Sources/main_1.args : -O0 -g -Wall -std=c++0x -trigraphs -fno-use-cxa-atexit -fno-exceptions -frtti -fno-threadsafe-statics --param max-inline-recursive-depth=8 -c -mbig-endian -fno-builtin -fomit-frame-pointer -Wno-unknown-pragmas -m32 -mcpu=e6500

    DB:3.18:How To Activate Altivec2 In Gcc ? dp


    Hello Alois,

    Yes, and I suggest you add "-maltivec2" in the compiler options in your project from CodeWarrior IDE, no need to consider about GCC version.

    Have a great day,Yiping

    -----------------------------------------------------------------------------------------------------------------------Note: If this post answers your question, please click the Correct Answer button. Thank you!-----------------------------------------------------------------------------------------------------------------------

  • RELEVANCY SCORE 2.79

    DB:2.79:Compiling Pro*C Code In Windows xk


    hi,

    can any body please help me to compile code in pro*c?

    thanks in advance....

    thanks and regards
    LaxmiNarsimha

    DB:2.79:Compiling Pro*C Code In Windows xk

    http://download.oracle.com/docs/cd/B19306_01/win.102/b14321/toc.htm

    Is this what you were looking for?

  • RELEVANCY SCORE 2.73

    DB:2.73:Problems Using Jdic 18


    Hi
    I am trying to use jdic to open a browser from a java application, I downloaded and installed the binary under C:\jdic
    I updated my classpath to point to this directory too.
    However when I am compiling my source code from the command line, usng the following command
    C:\VDApp javac -cp C:\jdic;C:\VDApp GeneViewer/VisualDatabase.java (GeneViewer is the package and VisualDatabase.java is the class containing the main method)

    and run it using

    java GeneViewer.VisualDatabase

    I get the following error
    Exception in thread main java.lang.NoClassDefFoundError: /org/jdesktop/jdic/desktop/DesktopException

    Please guide me

    DB:2.73:Problems Using Jdic 18

    Is DesktopException.class in the jar file?

  • RELEVANCY SCORE 2.68

    DB:2.68:Problems Compiling C++ Programs.. zk



    Hi, Im having real problems compiling some C++ programs - ive tried Stellarium (Sky maps) and Hugin (Panorama software) and both fail with various errors.

    I wont post the full error logs here yet, because theres probably no need, but both the programs seem to use alot of .hxx files and complain about many undeclared variables.

    Anyone have any ideas what package ive missed?

    Thanks Dan

    DB:2.68:Problems Compiling C++ Programs.. zk

    sarah31 wrote:
    looks like a gcc issue on stellarium. looking at some ebuilds out there there is nothing really special needed to build it.

  • RELEVANCY SCORE 2.68

    DB:2.68:Cross Platform Software Development - Support For Ides & C/C++ Compilers 1d



    What if on some project a support for many IDEs or C/C++ compilers is needed?

    In case of Microsoft's Visual Studios the following macros could be used:

    ...

    #if _MSC_VER 1200
    #pragma message ( "*** Compiling with Visual C++ v5.0 ***" )
    #endif

    #if _MSC_VER == 1200
    #pragma message ( "*** Compiling with Visual Studio 98 ***" )
    #endif

    #if _MSC_VER == 1300
    #pragma message ( "*** Compiling with Visual Studio .NET ***" )
    #endif

    #if _MSC_VER == 1310
    #pragma message ( "*** Compiling with Visual Studio 2003 ***" )
    #endif

    #if _MSC_VER == 1400
    #pragma message ( "*** Compiling with Visual Studio 2005 ***" )
    #endif

    #if _MSC_VER == 1500
    #pragma message ( "*** Compiling with Visual Studio 2008 ***" )
    #endif

    #if _MSC_VER == 1600
    #pragma message ( "*** Compiling with Visual Studio 2010 ***" )
    #endif

    ...

    It would be nice to have a complete list of macros with version codes for as many as possible
    versions of Intel C/C++ compiler.

    For a cross platform software development it would be an invaluable information.

    DB:2.68:Cross Platform Software Development - Support For Ides & C/C++ Compilers 1d


    Quoting Om Sachan (Intel)The Intel C++ Composer XE 2011 support VS2010, VS2008 and VS2005.

    My question was related toIntel C/C++ compiler __ICC macro for different versions.

  • RELEVANCY SCORE 2.67

    DB:2.67:Internal Error #432 While Compiling Code With Class Definition mj


    I am programming microcontroller MC9S12NE64 in C++. I can create class as following:

    DB:2.67:Internal Error #432 While Compiling Code With Class Definition mj

    The problem is that c++ is not used much in this domain.I think you should submit a service request.

  • RELEVANCY SCORE 2.65

    DB:2.65:Is There Any Plan To Support Building With Visual C++ 2010? 8k


    I have tried to do it. But I met many problems, included converting VC project format to new, compiling errors warnings, runtime crash(seems due to custom memory allocator in dbxml). So I gave up. -_-

    DB:2.65:Is There Any Plan To Support Building With Visual C++ 2010? 8k

    Hi,

    XQilla is not directly maintained by our group, but if you want, you can post your specific issue, we will look into it and contact its developer if needed.

    Regards,
    Jason
    Berkeley DB XML

  • RELEVANCY SCORE 2.63

    DB:2.63:Import Periferal In Xps 3d



    This is might an silly Question but i have huge problems importing my IPIF Periferals in XPS 11.4.

    At first I generated an Template (v1.00.a)

    then I added my logic

    after that I tried 2 import my logic.

    In the Impot Dialog i choose an higher Versions Number ...for example 1.01.a

    in the next window I selected vhl source files

    in the next Step i used the pao file located with the Autogenerated Themplate ...

    Then the Import Wizzard shows me the HDL Analysis Information ....

    everything looks good sofar

    but when i Press next I'm toold that no vhdl Files are Compiled into the current logical library called XXX_v1.01.a

    So I tried to add the vhdl Files Manually to the Library XXX_1.01.a ....

    but then the impoter gives back an HDL parsing Error ...

    Please Tell me what im doing wrong here ...

    Parsing PAO project file successfully ...
    Analyzing HDL source files ...

    Analyzing HDL source files successfully ...

    HDL language for the peripheral (top level) design unit my_timer is vhdl ...

    WARNING:EDK:2221 - Project file D:\thobmei\Examplebackup\pcores/my_timer.prj

    already exists, will be overwrite and removed afterward ...

    INFO:EDK:948 - Create temparary xst project file:

    D:\thobmei\Examplebackup\pcores/my_timer.prj

    Compiling vhdl file

    "C:/Xilinx/11.1/EDK/hw/XilinxProcessorIPLib/pcores/proc_common_v3_00_a/hdl/vhdl/

    proc_common_pkg.vhd" in Library proc_common_v3_00_a.

    Package proc_common_pkg compiled.

    Package body proc_common_pkg compiled.

    Compiling vhdl file

    "C:/Xilinx/11.1/EDK/hw/XilinxProcessorIPLib/pcores/proc_common_v3_00_a/hdl/vhdl/

    or_muxcy.vhd" in Library proc_common_v3_00_a.

    Entity or_muxcy compiled.

    Entity or_muxcy (Architecture implementation) compiled.

    Compiling vhdl file

    "C:/Xilinx/11.1/EDK/hw/XilinxProcessorIPLib/pcores/proc_common_v3_00_a/hdl/vhdl/

    family_support.vhd" in Library proc_common_v3_00_a.

    Package family_support compiled.

    Package body family_support compiled.

    Compiling vhdl file

    "C:/Xilinx/11.1/EDK/hw/XilinxProcessorIPLib/pcores/proc_common_v3_00_a/hdl/vhdl/

    counter_f.vhd" in Library proc_common_v3_00_a.

    Entity counter_f compiled.

    Entity counter_f (Architecture imp) compiled.

    Compiling vhdl file

    "C:/Xilinx/11.1/EDK/hw/XilinxProcessorIPLib/pcores/proc_common_v3_00_a/hdl/vhdl/

    pselect_f.vhd" in Library proc_common_v3_00_a.

    Entity pselect_f compiled.

    Entity pselect_f (Architecture imp) compiled.

    Compiling vhdl file

    "C:/Xilinx/11.1/EDK/hw/XilinxProcessorIPLib/pcores/proc_common_v3_00_a/hdl/vhdl/

    or_gate128.vhd" in Library proc_common_v3_00_a.

    Entity or_gate128 compiled.

    Entity or_gate128 (Architecture imp) compiled.

    Compiling vhdl file

    "C:/Xilinx/11.1/EDK/hw/XilinxProcessorIPLib/pcores/proc_common_v3_00_a/hdl/vhdl/

    ipif_pkg.vhd" in Library proc_common_v3_00_a.

    Package ipif_pkg compiled.

    Package body ipif_pkg compiled.

    Compiling vhdl file

    "C:/Xilinx/11.1/EDK/hw/XilinxProcessorIPLib/pcores/plbv46_slave_single_v1_01_a/h

    dl/vhdl/plb_address_decoder.vhd" in Library plbv46_slave_single_v1_01_a.

    Entity plb_address_decoder compiled.

    Entity plb_address_decoder (Architecture IMP) compiled.

    Compiling vhdl file

    "C:/Xilinx/11.1/EDK/hw/XilinxProcessorIPLib/pcores/plbv46_slave_single_v1_01_a/h

    dl/vhdl/plb_slave_attachment.vhd" in Library plbv46_slave_single_v1_01_a.

    Entity plb_slave_attachment compiled.

    Entity plb_slave_attachment (Architecture implementation) compiled.

    Compiling vhdl file

    "C:/Xilinx/11.1/EDK/hw/XilinxProcessorIPLib/pcores/interrupt_control_v2_01_a/hdl

    /vhdl/interrupt_control.vhd" in Library interrupt_control_v2_01_a.

    Entity interrupt_control compiled.

    Entity interrupt_control (Architecture implementation) compiled.

    Compiling vhdl file

    "C:/Xilinx/11.1/EDK/hw/XilinxProcessorIPLib/pcores/plbv46_slave_single_v1_01_a/h

    dl/vhdl/plbv46_slave_single.vhd" in Library plbv46_slave_single_v1_01_a.

    Entity plbv46_slave_single compiled.

    Entity plbv46_slave_single (Architecture implementation) compiled.

    Compiling vhdl file

    "D:/thobmei/Examplebackup/pcores/my_timer_v1_00_a/hdl/vhdl/my_timer.vhd" in

    Library my_timer_v1_01_a.

    ERROR:HDLParsers:3317 -

    "D:/thobmei/Examplebackup/pcores/my_timer_v1_00_a/hdl/vhdl/my_timer.vhd" Line

    75. Library my_timer_v1_00_a cannot be found.

    ERROR:HDLParsers:3014 -

    "D:/thobmei/Examplebackup/pcores/my_timer_v1_00_a/hdl/vhdl/my_timer.vhd" Line

    76. Library unit my_timer_v1_00_a is not available in library

    my_timer_v1_01_a.

    WARNING:HDLParsers:3481 - Library my_timer_v1_01_a has no units. Did not save

    reference file "xst/my_timer_v1_01_a/hdllib.ref" for it.

    ERROR:EDK:2121 - Parse Errors encountered in HDL source

    WARNING:EDK:2579 - Unable to delete temparary project file

    D:\thobmei\Examplebackup\pcores\my_timer.prj : 13

    HDL language for the peripheral (top level) design unit my_timer is vhdl ...

    WARNING:EDK:2221 - Project file D:\thobmei\Examplebackup\pcores/my_timer.prj

    already exists, will be overwrite and removed afterward ...

    INFO:EDK:948 - Create temparary xst project file:

    D:\thobmei\Examplebackup\pcores/my_timer.prj

    Compiling vhdl file

    "C:/Xilinx/11.1/EDK/hw/XilinxProcessorIPLib/pcores/proc_common_v3_00_a/hdl/vhdl/

    proc_common_pkg.vhd" in Library proc_common_v3_00_a.

    Package proc_common_pkg compiled.

    Package body proc_common_pkg compiled.

    Compiling vhdl file

    "C:/Xilinx/11.1/EDK/hw/XilinxProcessorIPLib/pcores/proc_common_v3_00_a/hdl/vhdl/

    or_muxcy.vhd" in Library proc_common_v3_00_a.

    Entity or_muxcy compiled.

    Entity or_muxcy (Architecture implementation) compiled.

    Compiling vhdl file

    "C:/Xilinx/11.1/EDK/hw/XilinxProcessorIPLib/pcores/proc_common_v3_00_a/hdl/vhdl/

    family_support.vhd" in Library proc_common_v3_00_a.

    Package family_support compiled.

    Package body family_support compiled.

    Compiling vhdl file

    "C:/Xilinx/11.1/EDK/hw/XilinxProcessorIPLib/pcores/proc_common_v3_00_a/hdl/vhdl/

    counter_f.vhd" in Library proc_common_v3_00_a.

    Entity counter_f compiled.

    Entity counter_f (Architecture imp) compiled.

    Compiling vhdl file

    "C:/Xilinx/11.1/EDK/hw/XilinxProcessorIPLib/pcores/proc_common_v3_00_a/hdl/vhdl/

    pselect_f.vhd" in Library proc_common_v3_00_a.

    Entity pselect_f compiled.

    Entity pselect_f (Architecture imp) compiled.

    Compiling vhdl file

    "C:/Xilinx/11.1/EDK/hw/XilinxProcessorIPLib/pcores/proc_common_v3_00_a/hdl/vhdl/

    or_gate128.vhd" in Library proc_common_v3_00_a.

    Entity or_gate128 compiled.

    Entity or_gate128 (Architecture imp) compiled.

    Compiling vhdl file

    "C:/Xilinx/11.1/EDK/hw/XilinxProcessorIPLib/pcores/proc_common_v3_00_a/hdl/vhdl/

    ipif_pkg.vhd" in Library proc_common_v3_00_a.

    Package ipif_pkg compiled.

    Package body ipif_pkg compiled.

    Compiling vhdl file

    "C:/Xilinx/11.1/EDK/hw/XilinxProcessorIPLib/pcores/plbv46_slave_single_v1_01_a/h

    dl/vhdl/plb_address_decoder.vhd" in Library plbv46_slave_single_v1_01_a.

    Entity plb_address_decoder compiled.

    Entity plb_address_decoder (Architecture IMP) compiled.

    Compiling vhdl file

    "C:/Xilinx/11.1/EDK/hw/XilinxProcessorIPLib/pcores/plbv46_slave_single_v1_01_a/h

    dl/vhdl/plb_slave_attachment.vhd" in Library plbv46_slave_single_v1_01_a.

    Entity plb_slave_attachment compiled.

    Entity plb_slave_attachment (Architecture implementation) compiled.

    Compiling vhdl file

    "C:/Xilinx/11.1/EDK/hw/XilinxProcessorIPLib/pcores/interrupt_control_v2_01_a/hdl

    /vhdl/interrupt_control.vhd" in Library interrupt_control_v2_01_a.

    Entity interrupt_control compiled.

    Entity interrupt_control (Architecture implementation) compiled.

    Compiling vhdl file

    "C:/Xilinx/11.1/EDK/hw/XilinxProcessorIPLib/pcores/plbv46_slave_single_v1_01_a/h

    dl/vhdl/plbv46_slave_single.vhd" in Library plbv46_slave_single_v1_01_a.

    Entity plbv46_slave_single compiled.

    Entity plbv46_slave_single (Architecture implementation) compiled.

    Compiling vhdl file

    "D:/thobmei/Examplebackup/pcores/my_timer_v1_00_a/hdl/vhdl/user_logic.vhd" in

    Library my_timer_v1_01_a.

    Entity user_logic compiled.

    Entity user_logic (Architecture IMP) compiled.

    Compiling vhdl file

    "D:/thobmei/Examplebackup/pcores/my_timer_v1_00_a/hdl/vhdl/my_timer.vhd" in

    Library my_timer_v1_01_a.

    ERROR:HDLParsers:3317 -

    "D:/thobmei/Examplebackup/pcores/my_timer_v1_00_a/hdl/vhdl/my_timer.vhd" Line

    75. Library my_timer_v1_00_a cannot be found.

    ERROR:HDLParsers:3014 -

    "D:/thobmei/Examplebackup/pcores/my_timer_v1_00_a/hdl/vhdl/my_timer.vhd" Line

    76. Library unit my_timer_v1_00_a is not available in library

    my_timer_v1_01_a.

    ERROR:EDK:2121 - Parse Errors encountered in HDL source

    WARNING:EDK:2579 - Unable to delete temparary project file

    D:\thobmei\Examplebackup\pcores\my_timer.prj : 13

    HDL language for the peripheral (top level) design unit my_timer is vhdl ...

    WARNING:EDK:2221 - Project file D:\thobmei\Examplebackup\pcores/my_timer.prj

    already exists, will be overwrite and removed afterward ...

    INFO:EDK:948 - Create temparary xst project file:

    D:\thobmei\Examplebackup\pcores/my_timer.prj

    Compiling vhdl file

    "C:/Xilinx/11.1/EDK/hw/XilinxProcessorIPLib/pcores/proc_common_v3_00_a/hdl/vhdl/

    proc_common_pkg.vhd" in Library proc_common_v3_00_a.

    Package proc_common_pkg compiled.

    Package body proc_common_pkg compiled.

    Compiling vhdl file

    "C:/Xilinx/11.1/EDK/hw/XilinxProcessorIPLib/pcores/proc_common_v3_00_a/hdl/vhdl/

    or_muxcy.vhd" in Library proc_common_v3_00_a.

    Entity or_muxcy compiled.

    Entity or_muxcy (Architecture implementation) compiled.

    Compiling vhdl file

    "C:/Xilinx/11.1/EDK/hw/XilinxProcessorIPLib/pcores/proc_common_v3_00_a/hdl/vhdl/

    family_support.vhd" in Library proc_common_v3_00_a.

    Package family_support compiled.

    Package body family_support compiled.

    Compiling vhdl file

    "C:/Xilinx/11.1/EDK/hw/XilinxProcessorIPLib/pcores/proc_common_v3_00_a/hdl/vhdl/

    counter_f.vhd" in Library proc_common_v3_00_a.

    Entity counter_f compiled.

    Entity counter_f (Architecture imp) compiled.

    Compiling vhdl file

    "C:/Xilinx/11.1/EDK/hw/XilinxProcessorIPLib/pcores/proc_common_v3_00_a/hdl/vhdl/

    pselect_f.vhd" in Library proc_common_v3_00_a.

    Entity pselect_f compiled.

    Entity pselect_f (Architecture imp) compiled.

    Compiling vhdl file

    "C:/Xilinx/11.1/EDK/hw/XilinxProcessorIPLib/pcores/proc_common_v3_00_a/hdl/vhdl/

    or_gate128.vhd" in Library proc_common_v3_00_a.

    Entity or_gate128 compiled.

    Entity or_gate128 (Architecture imp) compiled.

    Compiling vhdl file

    "C:/Xilinx/11.1/EDK/hw/XilinxProcessorIPLib/pcores/proc_common_v3_00_a/hdl/vhdl/

    ipif_pkg.vhd" in Library proc_common_v3_00_a.

    Package ipif_pkg compiled.

    Package body ipif_pkg compiled.

    Compiling vhdl file

    "C:/Xilinx/11.1/EDK/hw/XilinxProcessorIPLib/pcores/plbv46_slave_single_v1_01_a/h

    dl/vhdl/plb_address_decoder.vhd" in Library plbv46_slave_single_v1_01_a.

    Entity plb_address_decoder compiled.

    Entity plb_address_decoder (Architecture IMP) compiled.

    Compiling vhdl file

    "C:/Xilinx/11.1/EDK/hw/XilinxProcessorIPLib/pcores/plbv46_slave_single_v1_01_a/h

    dl/vhdl/plb_slave_attachment.vhd" in Library plbv46_slave_single_v1_01_a.

    Entity plb_slave_attachment compiled.

    Entity plb_slave_attachment (Architecture implementation) compiled.

    Compiling vhdl file

    "C:/Xilinx/11.1/EDK/hw/XilinxProcessorIPLib/pcores/interrupt_control_v2_01_a/hdl

    /vhdl/interrupt_control.vhd" in Library interrupt_control_v2_01_a.

    Entity interrupt_control compiled.

    Entity interrupt_control (Architecture implementation) compiled.

    Compiling vhdl file

    "C:/Xilinx/11.1/EDK/hw/XilinxProcessorIPLib/pcores/plbv46_slave_single_v1_01_a/h

    dl/vhdl/plbv46_slave_single.vhd" in Library plbv46_slave_single_v1_01_a.

    Entity plbv46_slave_single compiled.

    Entity plbv46_slave_single (Architecture implementation) compiled.

    Compiling vhdl file

    "D:/thobmei/Examplebackup/pcores/my_timer_v1_00_a/hdl/vhdl/my_timer.vhd" in

    Library my_timer_v1_01_a.

    ERROR:HDLParsers:3317 -

    "D:/thobmei/Examplebackup/pcores/my_timer_v1_00_a/hdl/vhdl/my_timer.vhd" Line

    75. Library my_timer_v1_00_a cannot be found.

    ERROR:HDLParsers:3014 -

    "D:/thobmei/Examplebackup/pcores/my_timer_v1_00_a/hdl/vhdl/my_timer.vhd" Line

    76. Library unit my_timer_v1_00_a is not available in library

    my_timer_v1_01_a.

    ERROR:EDK:2121 - Parse Errors encountered in HDL source

    WARNING:EDK:2579 - Unable to delete temparary project file

    D:\thobmei\Examplebackup\pcores\my_timer.prj : 13

    Parsing PAO project file successfully ...

    Analyzing HDL source files ...

    Analyzing HDL source files successfully ...

    HDL language for the peripheral (top level) design unit my_timer is vhdl ...

    WARNING:EDK:2221 - Project file D:\thobmei\Examplebackup\pcores/my_timer.prj

    already exists, will be overwrite and removed afterward ...

    INFO:EDK:948 - Create temparary xst project file:

    D:\thobmei\Examplebackup\pcores/my_timer.prj

    Compiling vhdl file

    "C:/Xilinx/11.1/EDK/hw/XilinxProcessorIPLib/pcores/proc_common_v3_00_a/hdl/vhdl/

    proc_common_pkg.vhd" in Library proc_common_v3_00_a.

    Package proc_common_pkg compiled.

    Package body proc_common_pkg compiled.

    Compiling vhdl file

    "C:/Xilinx/11.1/EDK/hw/XilinxProcessorIPLib/pcores/proc_common_v3_00_a/hdl/vhdl/

    or_muxcy.vhd" in Library proc_common_v3_00_a.

    Entity or_muxcy compiled.

    Entity or_muxcy (Architecture implementation) compiled.

    Compiling vhdl file

    "C:/Xilinx/11.1/EDK/hw/XilinxProcessorIPLib/pcores/proc_common_v3_00_a/hdl/vhdl/

    family_support.vhd" in Library proc_common_v3_00_a.

    Package family_support compiled.

    Package body family_support compiled.

    Compiling vhdl file

    "C:/Xilinx/11.1/EDK/hw/XilinxProcessorIPLib/pcores/proc_common_v3_00_a/hdl/vhdl/

    counter_f.vhd" in Library proc_common_v3_00_a.

    Entity counter_f compiled.

    Entity counter_f (Architecture imp) compiled.

    Compiling vhdl file

    "C:/Xilinx/11.1/EDK/hw/XilinxProcessorIPLib/pcores/proc_common_v3_00_a/hdl/vhdl/

    pselect_f.vhd" in Library proc_common_v3_00_a.

    Entity pselect_f compiled.

    Entity pselect_f (Architecture imp) compiled.

    Compiling vhdl file

    "C:/Xilinx/11.1/EDK/hw/XilinxProcessorIPLib/pcores/proc_common_v3_00_a/hdl/vhdl/

    or_gate128.vhd" in Library proc_common_v3_00_a.

    Entity or_gate128 compiled.

    Entity or_gate128 (Architecture imp) compiled.

    Compiling vhdl file

    "C:/Xilinx/11.1/EDK/hw/XilinxProcessorIPLib/pcores/proc_common_v3_00_a/hdl/vhdl/

    ipif_pkg.vhd" in Library proc_common_v3_00_a.

    Package ipif_pkg compiled.

    Package body ipif_pkg compiled.

    Compiling vhdl file

    "C:/Xilinx/11.1/EDK/hw/XilinxProcessorIPLib/pcores/plbv46_slave_single_v1_01_a/h

    dl/vhdl/plb_address_decoder.vhd" in Library plbv46_slave_single_v1_01_a.

    Entity plb_address_decoder compiled.

    Entity plb_address_decoder (Architecture IMP) compiled.

    Compiling vhdl file

    "C:/Xilinx/11.1/EDK/hw/XilinxProcessorIPLib/pcores/plbv46_slave_single_v1_01_a/h

    dl/vhdl/plb_slave_attachment.vhd" in Library plbv46_slave_single_v1_01_a.

    Entity plb_slave_attachment compiled.

    Entity plb_slave_attachment (Architecture implementation) compiled.

    Compiling vhdl file

    "C:/Xilinx/11.1/EDK/hw/XilinxProcessorIPLib/pcores/interrupt_control_v2_01_a/hdl

    /vhdl/interrupt_control.vhd" in Library interrupt_control_v2_01_a.

    Entity interrupt_control compiled.

    Entity interrupt_control (Architecture implementation) compiled.

    Compiling vhdl file

    "C:/Xilinx/11.1/EDK/hw/XilinxProcessorIPLib/pcores/plbv46_slave_single_v1_01_a/h

    dl/vhdl/plbv46_slave_single.vhd" in Library plbv46_slave_single_v1_01_a.

    Entity plbv46_slave_single compiled.

    Entity plbv46_slave_single (Architecture implementation) compiled.

    Compiling vhdl file

    "D:/thobmei/Examplebackup/pcores/my_timer_v1_00_a/hdl/vhdl/user_logic.vhd" in

    Library my_timer_v1_00_a.

    Entity user_logic compiled.

    Entity user_logic (Architecture IMP) compiled.

    Compiling vhdl file

    "D:/thobmei/Examplebackup/pcores/my_timer_v1_00_a/hdl/vhdl/my_timer.vhd" in

    Library my_timer_v1_00_a.

    Entity my_timer compiled.

    Entity my_timer (Architecture IMP) compiled.

    Analyzing HDL attributes ...

    Entity name = my_timer

    INFO:EDK:1607 - IPTYPE set to value : PERIPHERAL

    INFO:EDK:1511 - IMP_NETLIST set to value : TRUE

    INFO:EDK:1486 - HDL set to value : VHDL

    WARNING:EDK:2579 - Unable to delete temparary project file

    D:\thobmei\Examplebackup\pcores\my_timer.prj : 13

    HDL language for the peripheral (top level) design unit my_timer is vhdl ...

    WARNING:EDK:2221 - Project file D:\thobmei\Examplebackup\pcores/my_timer.prj

    already exists, will be overwrite and removed afterward ...

    INFO:EDK:948 - Create temparary xst project file:

    D:\thobmei\Examplebackup\pcores/my_timer.prj

    Compiling vhdl file

    "C:/Xilinx/11.1/EDK/hw/XilinxProcessorIPLib/pcores/proc_common_v3_00_a/hdl/vhdl/

    proc_common_pkg.vhd" in Library proc_common_v3_00_a.

    Package proc_common_pkg compiled.

    Package body proc_common_pkg compiled.

    Compiling vhdl file

    "C:/Xilinx/11.1/EDK/hw/XilinxProcessorIPLib/pcores/proc_common_v3_00_a/hdl/vhdl/

    or_muxcy.vhd" in Library proc_common_v3_00_a.

    Entity or_muxcy compiled.

    Entity or_muxcy (Architecture implementation) compiled.

    Compiling vhdl file

    "C:/Xilinx/11.1/EDK/hw/XilinxProcessorIPLib/pcores/proc_common_v3_00_a/hdl/vhdl/

    family_support.vhd" in Library proc_common_v3_00_a.

    Package family_support compiled.

    Package body family_support compiled.

    Compiling vhdl file

    "C:/Xilinx/11.1/EDK/hw/XilinxProcessorIPLib/pcores/proc_common_v3_00_a/hdl/vhdl/

    counter_f.vhd" in Library proc_common_v3_00_a.

    Entity counter_f compiled.

    Entity counter_f (Architecture imp) compiled.

    Compiling vhdl file

    "C:/Xilinx/11.1/EDK/hw/XilinxProcessorIPLib/pcores/proc_common_v3_00_a/hdl/vhdl/

    pselect_f.vhd" in Library proc_common_v3_00_a.

    Entity pselect_f compiled.

    Entity pselect_f (Architecture imp) compiled.

    Compiling vhdl file

    "C:/Xilinx/11.1/EDK/hw/XilinxProcessorIPLib/pcores/proc_common_v3_00_a/hdl/vhdl/

    or_gate128.vhd" in Library proc_common_v3_00_a.

    Entity or_gate128 compiled.

    Entity or_gate128 (Architecture imp) compiled.

    Compiling vhdl file

    "C:/Xilinx/11.1/EDK/hw/XilinxProcessorIPLib/pcores/proc_common_v3_00_a/hdl/vhdl/

    ipif_pkg.vhd" in Library proc_common_v3_00_a.

    Package ipif_pkg compiled.

    Package body ipif_pkg compiled.

    Compiling vhdl file

    "C:/Xilinx/11.1/EDK/hw/XilinxProcessorIPLib/pcores/plbv46_slave_single_v1_01_a/h

    dl/vhdl/plb_address_decoder.vhd" in Library plbv46_slave_single_v1_01_a.

    Entity plb_address_decoder compiled.

    Entity plb_address_decoder (Architecture IMP) compiled.

    Compiling vhdl file

    "C:/Xilinx/11.1/EDK/hw/XilinxProcessorIPLib/pcores/plbv46_slave_single_v1_01_a/h

    dl/vhdl/plb_slave_attachment.vhd" in Library plbv46_slave_single_v1_01_a.

    Entity plb_slave_attachment compiled.

    Entity plb_slave_attachment (Architecture implementation) compiled.

    Compiling vhdl file

    "C:/Xilinx/11.1/EDK/hw/XilinxProcessorIPLib/pcores/interrupt_control_v2_01_a/hdl

    /vhdl/interrupt_control.vhd" in Library interrupt_control_v2_01_a.

    Entity interrupt_control compiled.

    Entity interrupt_control (Architecture implementation) compiled.

    Compiling vhdl file

    "C:/Xilinx/11.1/EDK/hw/XilinxProcessorIPLib/pcores/plbv46_slave_single_v1_01_a/h

    dl/vhdl/plbv46_slave_single.vhd" in Library plbv46_slave_single_v1_01_a.

    Entity plbv46_slave_single compiled.

    Entity plbv46_slave_single (Architecture implementation) compiled.

    Compiling vhdl file

    "D:/thobmei/Examplebackup/pcores/my_timer_v1_00_a/hdl/vhdl/my_timer.vhd" in

    Library my_timer_v1_01_a.

    ERROR:HDLParsers:3317 -

    "D:/thobmei/Examplebackup/pcores/my_timer_v1_00_a/hdl/vhdl/my_timer.vhd" Line

    75. Library my_timer_v1_00_a cannot be found.

    ERROR:HDLParsers:3014 -

    "D:/thobmei/Examplebackup/pcores/my_timer_v1_00_a/hdl/vhdl/my_timer.vhd" Line

    76. Library unit my_timer_v1_00_a is not available in library

    my_timer_v1_01_a.

    ERROR:EDK:2121 - Parse Errors encountered in HDL source

    WARNING:EDK:2579 - Unable to delete temparary project file

    D:\thobmei\Examplebackup\pcores\my_timer.prj : 13







    Solved!
    Go to Solution.

    DB:2.63:Import Periferal In Xps 3d


    No problem! Making mistakes is only human.

    Do try to carefully read error messages or warnings. They don't always tell the truth, but they can lead to the root cause and a solution.

    Best regards,

    Dries




    --------------------------------------------------------------------------------------------------------------------Please mark the Answer as "Accept as solution" if the information provided is helpful.Give Kudos to a post which you think is helpful and reply oriented by clicking the star next to the post.

  • RELEVANCY SCORE 2.62

    DB:2.62:Re: Still Exception In Thread Main ma


    Adding c:\javaproj still has not effect.

    When compiling I get no errors.....when running I get the "exception thread in main"

    I'll try to give a directory picture:

    c:\javaproj\DataWatch (before compiling) =
    DividerLayout.java
    Start.java //this one contains main
    MainMenu.java

    c:\javaproj\DataWatch (after compiling) =
    all of the above +
    DividerLayout.class
    Start.class
    MainMenu.class
    MainMenu$1.class //not too sure what this is

    I'm at my wits last end. Thanks for your help again.

    DB:2.62:Re: Still Exception In Thread Main ma

    Great! I'm glad you got it working.

    Do take the time to learn the details of classpath and packages. Like I said, it's not all that complicated once you know it, but for any but the most trivial programs, it can cause major headaches if you don't understand it (as you've seen).

  • RELEVANCY SCORE 2.61

    DB:2.61:Error:Edk:369 - Make Failed For Target "Libs" d9



    Running libs - 'make -s libs "COMPILER=arm-xilinx-eabi-gcc""ARCHIVER=arm-xilinx-eabi-ar" "COMPILER_FLAGS= -O2 -c""EXTRA_COMPILER_FLAGS=-g"'."Compiling common"arm-xilinx-eabi-ar: creating ../../../lib/libxil.a"Compiling xadc""Compiling standalone""Compiling axidma"xaxidma_bdring.c: In function 'XAxiDma_BdRingToHw':xaxidma_bdring.c:1068:2: error: 'DATA_SYNC' undeclared (first use in this function)xaxidma_bdring.c:1068:2: note: each undeclared identifier is reported only once for each function it appears inmake[1]: *** [libs]"Compiling iic""Compiling axivdma""Compiling devcfg""Compiling dmaps""Compiling emacps""Compiling gpiops""Compiling iicps""Compiling qspips""Compiling scugic""Compiling scutimer""Compiling scuwdt""Compiling ttcps""Compiling uartps""Compiling usbps""Compiling cpu_cortexa9"ERROR:EDK:369 - make failed for target "libs" ERROR:EDK:3418 - Error(s) while running make.make: *** [ps7_cortexa9_0/lib/libxil.a]

    I build a Planhead project using ISE14.3, and export the .bit file to SDK, so comes there two errors.

    The reason of the first error may be the 'DATA_SYNC',it is automatically generated, but I donot know why this error happened.Maybe inxaxidma_bdring.c: In function 'XAxiDma_BdRingToHw', there is something wrong.

    How about the second error?

    I found

    in the directory 'lib' filefolder, i cannot find 'libxil.a'.

    So thank you for your help.

    DB:2.61:Error:Edk:369 - Make Failed For Target "Libs" d9


    Running libs - 'make -s libs "COMPILER=arm-xilinx-eabi-gcc""ARCHIVER=arm-xilinx-eabi-ar" "COMPILER_FLAGS= -O2 -c""EXTRA_COMPILER_FLAGS=-g"'."Compiling common"arm-xilinx-eabi-ar: creating ../../../lib/libxil.a"Compiling xadc""Compiling standalone""Compiling axidma"xaxidma_bdring.c: In function 'XAxiDma_BdRingToHw':xaxidma_bdring.c:1068:2: error: 'DATA_SYNC' undeclared (first use in this function)xaxidma_bdring.c:1068:2: note: each undeclared identifier is reported only once for each function it appears inmake[1]: *** [libs]"Compiling iic""Compiling axivdma""Compiling devcfg""Compiling dmaps""Compiling emacps""Compiling gpiops""Compiling iicps""Compiling qspips""Compiling scugic""Compiling scutimer""Compiling scuwdt""Compiling ttcps""Compiling uartps""Compiling usbps""Compiling cpu_cortexa9"ERROR:EDK:369 - make failed for target "libs" ERROR:EDK:3418 - Error(s) while running make.make: *** [ps7_cortexa9_0/lib/libxil.a]

    I build a Planhead project using ISE14.3, and export the .bit file to SDK, so comes there two errors.

    The reason of the first error may be the 'DATA_SYNC',it is automatically generated, but I donot know why this error happened.Maybe inxaxidma_bdring.c: In function 'XAxiDma_BdRingToHw', there is something wrong.

    How about the second error?

    I found

    in the directory 'lib' filefolder, i cannot find 'libxil.a'.

    So thank you for your help.

  • RELEVANCY SCORE 2.61

    DB:2.61:Re: Still Having Problems Compiling Java Code f1


    On command prompt : if your file is locate in c:/javaFiles

    write cd c:/javaFiles and then

    write javac FileName.java and this should work,

    You should update your classpath and path variables..

    DB:2.61:Re: Still Having Problems Compiling Java Code f1

    by the way... I forgot to mention...
    to see you environment variable...
    type...
    c:\setand you will see your environment variables and it values...
    now this maybe a matter of preference, but I do not have a "System" classpath variable... nor do i set one temporarily...
    While you can set it so it point to any or all of your directories where you have *.java and *.class files... after a while, you classpath will have to many entries for it to be managable... Plus, it also means I have to go through the System Properties|Advance|Environment panel each time I want to add a new entry to the classpath...
    and setting temporarily is about the same, having to type "set classpath= c:\blah\blah" each time i want a new entry...

    it is much easier for me to either change my working directory...
    (assuming all my program files are in the same folder)
    i.e...
    C:\cd myfolder\test
    C:\myfolder\testjavac myprogram.javaand compile
    or give the classpath as an arguement...
    C:\javac -classpath c:\myfolder\test myprogram.javahave fun...

    - MaxxDmg...

    - ' He who never sleeps... '

  • RELEVANCY SCORE 2.60

    DB:2.60:Compiling And Linking C Library In C++ sa


    I am using a C library (Solstice FTAM v9.0) in my C++ program. One of the library header files has a declrartion

    short class;

    in one of the structures.

    The C++ compiler (Sun C++ 5.4 on Solaris 8) gives error. What we should do to compile and link this library in C++.

    DB:2.60:Compiling And Linking C Library In C++ sa

    Thanks. I am using the #define and #undef option, as i do have only the header and binary library.

    Manoj

  • RELEVANCY SCORE 2.60

    DB:2.60:Compiling Int 10g Not Compiling In 11g 8k


    Hi
    I have proc and its compiled in 10g but its not compiling in 11g

    In proc content is:

    INTO TABLE_NAME
    VALUES (SYSDATE, SAMPLE,
    1234, 'C',
    ROWNUM)

    Error is:
    ORA-00976: Specified pseudocolumn or operator not allowed here

    Thanks anyone helped.

    DB:2.60:Compiling Int 10g Not Compiling In 11g 8k

    Rownum is only defined in a select context. Here you don't select data.

    This should work:

    insert into table_name
    select SYSDATE, 'SAMPLE', 1234, 'C',ROWNUM from dual;but it does not make much sense, because rownum will always be 1.

    By the way: It would be better to specify the columns for insert statement. Something like this:

    insert into table_name (yourcol1, yourcol2, yourcol3, yourcol4, yourcol5)
    select SYSDATE, 'SAMPLE', 1234, 'C',ROWNUM from dual;Edited by: hm on 19.11.2010 03:59

  • RELEVANCY SCORE 2.59

    DB:2.59:Compiling In Microsoft Visual C++ 2010 Express j7


    I'm having problems just figuring out how to run a project in Visual C 2010 Express. It builds successfully, but then when I try to start it, with or without debugging, on various configurations, it says it can't find the exe.

    DB:2.59:Compiling In Microsoft Visual C++ 2010 Express j7


    Hi,

    Welcome to MSDN forum!

    I think you should create project use wizard.
    And in this thread you can get some useful help as a beginner.

    WHERE TO START

    If you still have any doubts and concerns about this issue, please let me know.

    Regards!
    JessePlease remember to mark the replies as answers if they help and unmark them if they provide no help.

    Welcome to the All-In-One Code Framework! If you have any feedback, please tell us.

  • RELEVANCY SCORE 2.54

    DB:2.54:Given Dropdown-Script In C# - Compiling Problems 1c



    The line in OnGUI():

    if (Popup.List(rect, showList, listEntry, GUIContent(hello), list, listStyle))


    should probably be

    if (Popup.List(rect, ref showList, ref listEntry, new GUIContent(hello), list, listStyle))


    Remember in C# you have to prefix variable creation with the word new. Also, if you are passing in reference arguments, you have to prefix the variables you pass into the function with ref.

    DB:2.54:Given Dropdown-Script In C# - Compiling Problems 1c


    The line in OnGUI():

    if (Popup.List(rect, showList, listEntry, GUIContent(hello), list, listStyle))


    should probably be

    if (Popup.List(rect, ref showList, ref listEntry, new GUIContent(hello), list, listStyle))


    Remember in C# you have to prefix variable creation with the word new. Also, if you are passing in reference arguments, you have to prefix the variables you pass into the function with ref.

  • RELEVANCY SCORE 2.54

    DB:2.54:Kamailio Presence Server On Freescale P2020rdb-Pca 19


    Hi,

    I'm getting the following Error when I'm trying to compile kamailio presence server in Freescale P2020rdb-pca.

    AltiVec and E500 instructions cannot coexist

    Your recommendations would be very much appreciated.

    Thanks Ashwin

    DB:2.54:Kamailio Presence Server On Freescale P2020rdb-Pca 19


    Thanks that worked.But another compilation error came.

    bison -d -b cfg cfg.y

    make: *** [cfg.tab.h] Broken Pipe.

    Please help to solve this error ,as the particular Kamailio Server was working in my x86 machine.So hopefully some changes are to be

    done in Make file so as to work in P2020RDB-PCA.Request your advice as Im very new to Power PC .

    Thanks

  • RELEVANCY SCORE 2.54

    DB:2.54:Problems... cx




    Ok, recently I've been having problems with my PC. I reinstalled the system 4X and I still get problems. This time it happens when I'm doing more things at once: for example when I'm using the internet and compiling a C++ program in the background. The computer freezes for about 5-seconds, then resumes and continues to work. Also, it freezes in games. I have BIOS 1.4 and I ran Windows update untill I didn't have any more to update. Any ideas?

    If you need more info, please ask.

    Thanks.

    DB:2.54:Problems... cx


    I still believe it's your PSU....and not the Audigy....
    You plain have a too light PSU....
    So by removing the Audigy you might gave the little extra power it needed....

    As you list problems all over the forum, how about giving it a real test and replace the PSU this time?????

  • RELEVANCY SCORE 2.53

    DB:2.53:Problems Compiling With Microsoft Visual C++ 2010 Express fj


    Hi
    I am programming C Win Api in Windows 7 using Microsoft Visual C 2010 Express. However, more and more often I get the following error: 1LINK : fatal error LNK1168: cannot open C:\User etc. I have read that this can be because the program is
    still running, but when I open the task manager, everything is okay. I often have to restart the PC to be able to compile again. Is there anybody who can give suggestions what to do about this?
    Sincerely
    Keitel

    DB:2.53:Problems Compiling With Microsoft Visual C++ 2010 Express fj

    Hi,

    Thank you for your answer and sorry for a late replay. My Windows program is in another language, so I am not sure where to find the Application experience service. But I opened the Window Update manager and downloaded the last updates, but unfortunately,
    it didn't solve the problem.

    Regards
    Keitel

  • RELEVANCY SCORE 2.53

    DB:2.53:Problems In Compiling Simprim Library dd



    Hi,

    I got the following problems when I compiled the simprim library for my project. The behavioral simulation of my project was OK, but the post translate simulation results were incorrect. Do you think, that the mismatch in behavioral/functinal and post translate simulation is due to simprim library failure.

    Started : "Compile HDL Simulation Libraries".
    XILINX = 'C:\Xilinx\10.1\ISE'
    Library Source = 'C:\Xilinx\10.1\ISE'
    Compilation Mode = FAST
    Scheduling library installation compilation for VIRTEX-II Pro
    MTI = Model Technology ModelSim SE vlog 6.5c Compiler 2009.08 Aug 27 2009
    -- Installing Xilinx smartmodel library .....
    Environment variable LMC_HOME = 'C:\Xilinx\10.1\ISE\smartmodel\nt\installed_nt'
    Extracting model names from 'C:\Xilinx\10.1\ISE\smartmodel\nt\image\sl_toc.dat'
    Creating 'model.list' at current directory
    Library Image directory : 'C:\Xilinx\10.1\ISE\smartmodel\nt\image'
    Installation directory : 'C:\Xilinx\10.1\ISE\smartmodel\nt\installed_nt'
    Running installer......
    Synopsys/Logic Modeling sl_admin
    Copyright (c) 1984-2000 Synopsys Inc. ALL RIGHTS RESERVED
    Version: 02042
    Reading Library
    Reading Media
    Checking user selections
    Loading models....
    Loading model: dcc_fpgacore_swift, version: 03403, platform: pcnt
    Loading model: emac_swift, version: 02023, platform: pcnt
    Loading model: glogic_adv_swift, version: 02005, platform: pcnt
    Loading model: glogic_swift, version: 05002, platform: pcnt
    Loading model: gt10_swift, version: 03222, platform: pcnt
    Loading model: gt11_swift, version: 02017, platform: pcnt
    Loading model: gt_swift, version: 02603, platform: pcnt
    Loading model: gtp_dual_swift, version: 01011, platform: pcnt
    Loading model: gtx_dual_swift, version: 01006, platform: pcnt
    Loading model: pcie_internal_1_1_swift, version: 01020, platform: pcnt
    Loading model: ppc405_adv_swift, version: 02011, platform: pcnt
    Loading model: ppc405_swift, version: 05004, platform: pcnt
    Loading model: ppc440_swift, version: 01009, platform: pcnt
    Loading model: temac_swift, version: 01004, platform: pcnt
    Updating Configuration files
    Writing: C:\Xilinx\10.1\ISE\smartmodel\nt\installed_nt/data/pcnt.lmc
    Updating Library Versioned links
    Updating Documentation files
    Updating Library cache
    Install complete
    Compiling Xilinx HDL Libraries for ModelSim SE Simulator
    Language = vhdl
    Backing up setup files if any...
    Output directory = 'C:\Xilinx\10.1\ISE\vhdl\mti_se'
    -- Compiling vhdl unisim library
    Unisim compiled to C:\Xilinx\10.1\ISE\vhdl\mti_se\unisim
    Log file C:\Xilinx\10.1\ISE\vhdl\mti_se\unisim\cxl_unisim.log generated
    Library mapping successful, setup file(s) modelsim.ini updated
    compxlib[unisim]: No error(s), 3 warning(s)
    -- Compiling vhdl unimacro library
    unimacro compiled to C:\Xilinx\10.1\ISE\vhdl\mti_se\unimacro
    Log file C:\Xilinx\10.1\ISE\vhdl\mti_se\unimacro\cxl_unimacro.log generated
    Library mapping successful, setup file(s) modelsim.ini updated
    compxlib[unimacro]: No error(s), no warning(s)
    -- Compiling vhdl simprim library
    Simprim compiled to C:\Xilinx\10.1\ISE\vhdl\mti_se\simprim
    Log file C:\Xilinx\10.1\ISE\vhdl\mti_se\simprim\cxl_simprim.log generated
    Library mapping successful, setup file(s) modelsim.ini updated
    compxlib[simprim]: No error(s), 989 warning(s)
    -- Compiling vhdl XilinxCoreLib library
    XilinxCoreLib compiled to C:\Xilinx\10.1\ISE\vhdl\mti_se\XilinxCoreLib
    Log file C:\Xilinx\10.1\ISE\vhdl\mti_se\XilinxCoreLib\cxl_XilinxCoreLib.log generated
    Library mapping successful, setup file(s) modelsim.ini updated
    compxlib[XilinxCoreLib]: No error(s), 124 warning(s)
    MTI = Model Technology ModelSim SE vcom 6.5c Compiler 2009.08 Aug 27 2009
    -- Compiling vhdl smartmodel(unisim) library
    use -smartmodel_setup switch in case you want to configure
    the modelsim.ini for smart model usage (SWIFT Interface)
    Unisim Smart-Models compiled to C:\Xilinx\10.1\ISE\vhdl\mti_se\unisim
    Log file C:\Xilinx\10.1\ISE\vhdl\mti_se\unisim\cxl_smartmodel.log generated
    Library mapping successful, setup file(s) modelsim.ini updated
    compxlib[smartmodel]: No error(s), no warning(s)
    -- Compiling vhdl smartmodel(simprim) library
    use -smartmodel_setup switch in case you want to configure
    the modelsim.ini for smart model usage (SWIFT Interface)
    Simprim Smart-Models compiled to C:\Xilinx\10.1\ISE\vhdl\mti_se\simprim
    Log file C:\Xilinx\10.1\ISE\vhdl\mti_se\simprim\cxl_smartmodel.log generated
    Library mapping successful, setup file(s) modelsim.ini updated
    compxlib[smartmodel]: 14 error(s), 306 warning(s)
    Log file (compxlib.log) generated.
    Process "Compile HDL Simulation Libraries" failed

    DB:2.53:Problems In Compiling Simprim Library dd

    some of the warnings in my log file** Warning: [6] D:\xilinx\ISE\vhdl\src\simprims\simprim_VITAL_mti. vhd(7927): (vcom-1288) VITAL timing generic "tisd_gsr_c0" port specification "gsr" does not denote a port.(1076.4 section 4.3.2.1.3)###### D:\xilinx\ISE\vhdl\src\simprims\simprim_VITAL_mti. vhd(7928): tisd_GSR_C1 : VitalDelayType := 0.000 ns;** Warning: [6] D:\xilinx\ISE\vhdl\src\simprims\simprim_VITAL_mti. vhd(7928): (vcom-1288) VITAL timing generic "tisd_gsr_c1" port specification "gsr" does not denote a port.(1076.4 section 4.3.2.1.3)###### D:\xilinx\ISE\vhdl\src\simprims\simprim_VITAL_mti. vhd(7935): tpd_GSR_Q : VitalDelayType01 := (0.000 ns, 0.000 ns);** Warning: [6] D:\xilinx\ISE\vhdl\src\simprims\simprim_VITAL_mti. vhd(7935): (vcom-1288) VITAL timing generic "tpd_gsr_q" port specification "gsr" does not denote a port.(1076.4 section 4.3.2.1.3)###### D:\xilinx\ISE\vhdl\src\simprims\simprim_VITAL_mti. vhd(7943): tpw_GSR_posedge : VitalDelayType := 0.000 ns;** Warning: [6] D:\xilinx\ISE\vhdl\src\simprims\simprim_SECUREIP_mti.vhd(98309): (vcom-1287) VITAL timing generic "tisd_txcomtype1" has invalid port specification.(1076.4 section 4.3.2.1.3)###### D:\xilinx\ISE\vhdl\src\simprims\simprim_SECUREIP_mti.vhd(98310): tisd_TXDATA0 : VitalDelayArrayType(31 downto 0) := (others = 0 ps);** Warning: [6] D:\xilinx\ISE\vhdl\src\simprims\simprim_SECUREIP_mti.vhd(98310): (vcom-1287) VITAL timing generic "tisd_txdata0" has invalid port specification.(1076.4 section 4.3.2.1.3)###### D:\xilinx\ISE\vhdl\src\simprims\simprim_SECUREIP_mti.vhd(98311): tisd_TXDATA1 : VitalDelayArrayType(31 downto 0) := (others = 0 ps);** Warning: [6] D:\xilinx\ISE\vhdl\src\simprims\simprim_SECUREIP_mti.vhd(98311): (vcom-1287) VITAL timing generic "tisd_txdata1" has invalid port specification.(1076.4 section 4.3.2.1.3)###### D:\xilinx\ISE\vhdl\src\simprims\simprim_SECUREIP_mti.vhd(98312): tisd_TXDETECTRX0 : VitalDelayType := 0 ps;

  • RELEVANCY SCORE 2.53

    DB:2.53:C++ Compiling Problem In Terminal.. k7


    I have a problem in compiling and executing c programs on my lion in terminal..can anyone help me with it plzz??

    DB:2.53:C++ Compiling Problem In Terminal.. k7

    Tried Steve's suggestion. I now have version 4.5.2 of Xcode. When I type gcc on the command line I get " gcc: Command not found."Carol

  • RELEVANCY SCORE 2.53

    DB:2.53:C Compiler Options For Solaris 8m


    Hi,

    I have C project running on HP Unix and i want to migrate it to Solaris platform.
    For compiling the project i use the options flags in Unix are
    cc O3 OnoLimit -N

    what is/are the equvalant solaris options on Solaris?? It uses cc for compiling the normal programs.

    Thanks
    Sunil.

    DB:2.53:C Compiler Options For Solaris 8m

    I do not have access to the HP C compiler, could you describe from their man page what effect the +OnoLimit and -N flags have? If so, I will be able to tell you the equivalent Sun C compiler flags.

  • RELEVANCY SCORE 2.53

    DB:2.53:New G4 And Altivec f9


    Does anyone know how to De-activate the Altivec ?
    I bought a new G4 which feature the new Sudden Motion sensor and AltiVec, and I am having lots of trouble working with my Pro-Tools Audio Workstation, with the system going unstable every now and then. My colleagues who use the olde G4 dont have any issues, and I think its one of these new features that creates problems. I already disabled the Sudden motion sensor.
    Can anyone help me with the AltiVec ??

    DB:2.53:New G4 And Altivec f9

    Does anyone know how to De-activate the Altivec ?
    I bought a new G4 which feature the new Sudden Motion sensor and AltiVec, and I am having lots of trouble working with my Pro-Tools Audio Workstation, with the system going unstable every now and then. My colleagues who use the olde G4 dont have any issues, and I think its one of these new features that creates problems. I already disabled the Sudden motion sensor.
    Can anyone help me with the AltiVec ??

  • RELEVANCY SCORE 2.53

    DB:2.53:Compiling Problems az


    Can someone please tell me why I am having problems compiling my code. I have the j2sdk1.4.1_03 version. On the DOS prompt (c:\j2sdk1.4.1_03\bin\javac file name.java) when I prompt it to compile it, it tells me it cannot be compile in DOS. Even after adding the path in my autoexec.bat file.
    Someone please help.

    DB:2.53:Compiling Problems az

    Try this;

    1) cd c:\j2sdk1.4.1_03\bin\

    type java -version

    you should get the JVM version number

    3) Also you can type javac (still on c:\j2sdk1.4.1_03\bin\) --- yesy no file
    and get error message like this
    ......

    Usage: javac options source files
    where possible options include:
    -g Generate all debugging info
    -g:none Generate no debugging info
    -g:{lines,vars,source} Generate only some debugging info
    -nowarn Generate no warnings
    -verbose Output messages about what the compiler is doing
    -deprecation Output source locations where deprecated APIs are us
    ed
    -classpath path Specify where to find user class files
    -sourcepath path Specify where to find input source files
    -bootclasspath path Override location of bootstrap class files
    -extdirs dirs Override location of installed extensions
    -d directory Specify where to place generated class files
    -encoding encoding Specify character encoding used by source files
    -source release Provide source compatibility with specified release
    -target release Generate class files for specific VM version
    -help Print a synopsis of standard options

    3) While on the j2sdk\bin folder, make sure that javac, java is there

    Hope that helps

  • RELEVANCY SCORE 2.52

    DB:2.52:Compiling C Program In Vc++2008 78


    hi,i just need to run C programs in VC++ environment.

    DB:2.52:Compiling C Program In Vc++2008 78

    QuoteI just need to run C programs in VC++ environment.
    *Which* VC++? What version? Which edition?
    Quoteis it necessary to keep int_tmain(...)
    No. It just allows for automatic generation ofthe correct function signature when Unicode isenabled or not.
    Quotecommand window that shows results comes Quotein a flash and goes
    Put a pause for input at the end of your program.e.g. -
    system(pause);
    or
    getch();
    etc.
    Depending on which version you're using, you mayalso run your program from the IDE without debugging(Crtl-F5) which will automatically pause at the end.
    Quotecan i compline it as win32 application or win 64?
    It depends on which compiler/version/edition/installationoptions you have.
    Quotewhen i tried to include iostream.h in program,Quoteit gave an error,
    Pity. Even more so since we can't help you if you don'thelp us. There are potentially hundreds of differenterrors which may occur during a build. If you aren'tspecific, we can't be either.
    In most current C++ compilers headers are suppliedwithout the .h extension:#include iostream
    But why are you trying to use that header if you arejust working with C? It's used with C++ only.
    - Wayne

  • RELEVANCY SCORE 2.51

    DB:2.51:C++ Project Dependencies z1


    Hi,i have some problems compiling a c++ project using 4 dll's, 1 static lib and 1 application. I added project dependencies for the build order.When compiling in the ide, it works fine.Using the tfs server there seems to be a problems with the dependency of the static lib. If the dependency with the static lib is not set, the team build succeeds (still using the dll dependencies)I get the following error:Solution: CRE.sln, Project: Test, Compilation errors and warningsLINK(0,0): error LNK1104: cannot open file 'e:\data\team server\build\npl\binaries\win32\debug\CREFramework.lib'while the project runtimes are compiled in:e:\data\team server\build\npl\CRE\binaries\win32\debug\CREFramework.libTeam build infoBuildType: CREBuildDirectory: E:\Data\Team Server\Build

    DB:2.51:C++ Project Dependencies z1

    Found a solution for the problem :)On the c++ project properties, set the Link Library Dependencies to No (default = Yes)It still links the static library (setin additional dependencies)

  • RELEVANCY SCORE 2.50

    DB:2.50:Simulation Problem With Pci Express Endpoint_Pipe V1.7-Help???!! ms



    I have used the modelsim se6.1b+ISE 10.1webpack to do the simulation of PCI-E endpoint_pipe v1.7 example design,the fault occer:

    cd C:/coregen/endpoint_pipe/simulation/functionaldo C:/coregen/endpoint_pipe/simulation/functional/sim​ulate_mti.do# ** Warning: (vlib-34) Library already exists at "work".# Reading C:\Modeltech_6.1b\win32/../modelsim.ini# "work" maps to directory work. (Default mapping)# Model Technology ModelSim SE vlog 6.1b Compiler 2005.09 Sep 8 2005# ** Warning: (vlog-2103) Directory "C:\Xilinx\10.1\ISE/smartmodel/lin/wrappers/mtiver​ilog" for -y option not found.# -- Compiling module px1011a# -- Compiling module boardx01# -- Compiling module sys_clk_gen# -- Compiling module sys_clk_gen_ds# -- Compiling module xilinx_pci_exp_1_lane_epipe_ep# -- Compiling module endpoint_pipe# -- Compiling module glbl# -- Compiling module pci_exp_32b_app# -- Compiling module PIO_EP# -- Compiling module PIO_EP_MEM_ACCESS# -- Compiling module EP_MEM# -- Compiling module PIO_32_RX_ENGINE# -- Compiling module PIO_32_TX_ENGINE# -- Compiling module PIO_TO_CTRL# -- Compiling module PIO# -- Compiling module xilinx_pci_exp_1_lane_downstream_port# -- Compiling module xilinx_pci_exp_1_lane_dsport# -- Compiling module dsport_cfg# -- Compiling module pci_exp_usrapp_rx# -- Compiling module pci_exp_usrapp_tx# -- Compiling module pci_exp_usrapp_com# -- Compiling module pci_exp_usrapp_cfg# -- Compiling module pci_exp_1_lane_64b_dsport# -- Scanning library directory 'C:\Xilinx\10.1\ISE/verilog/src/simprims'# -- Scanning library directory 'C:\Xilinx\10.1\ISE/verilog/src/unisims'# -- Compiling module OBUF# -- Compiling module IBUF# -- Compiling module VCC# -- Compiling module GND# -- Compiling module INV# -- Compiling module FD# -- Compiling module SRL16# -- Compiling module FDE# -- Compiling module SRL16E# -- Compiling module LUT4_L# -- Compiling module LUT4_D# -- Compiling module LUT3_L# -- Compiling module LUT3_D# -- Compiling module LUT2_D# -- Compiling module LUT2_L# -- Compiling module MUXF5# -- Compiling module LUT2# -- Compiling module LUT3# -- Compiling module LUT4# -- Compiling module FDP# -- Compiling module FDR# -- Compiling module BUF# -- Compiling module LUT1# -- Compiling module FDRSE# -- Compiling module FDRE# -- Compiling module FDCE# -- Compiling module FDRS# -- Compiling module FDS# -- Compiling module MUXF6# -- Compiling module MUXCY# -- Compiling module XORCY# -- Compiling module FDSE# -- Compiling module SRLC16E# -- Compiling module RAMB16_S9_S9# -- Compiling module FDPE# -- Compiling module FDC# -- Compiling module RAM16X1D# -- Compiling module FDDRCPE# -- Compiling module BUFG# -- Compiling module DCM# -- Compiling module dcm_clock_divide_by_2# -- Compiling module dcm_maximum_period_check# -- Compiling module dcm_clock_lost# -- Compiling module RAMB16_S36_S36# -- Compiling module GT11CLK_MGT# -- Compiling module LUT1_L# -- Compiling module DCM_ADV# -- Compiling module dcm_adv_clock_divide_by_2# -- Compiling module dcm_adv_maximum_period_check# -- Compiling module dcm_adv_clock_lost# -- Compiling module MUXCY_L# -- Compiling module SRLC16# -- Compiling module GT11# -- Compiling module MULT_AND# -- Compiling module RAMB16_S18_S18# -- Scanning library directory 'C:\Xilinx\10.1\ISE/verilog/src/simprims'# -- Scanning library directory 'C:\Xilinx\10.1\ISE/verilog/src/unisims'# # Referenced (but uncompiled) modules or primitives:# GT11_SWIFT# # Top level modules:# boardx01# glbl# vsim +notimingchecks +TESTNAME=sample_smoke_test0 -L work work.boardx01 glbl # Loading work.boardx01# Loading work.px1011a# Loading work.xilinx_pci_exp_1_lane_epipe_ep# Loading work.OBUF# Loading work.IBUF# Loading work.pci_exp_32b_app# Loading work.PIO# Loading work.PIO_EP# Loading work.PIO_EP_MEM_ACCESS# Loading work.EP_MEM# Loading work.RAMB16_S36_S36# Loading work.PIO_32_RX_ENGINE# Loading work.PIO_32_TX_ENGINE# Loading work.PIO_TO_CTRL# Loading work.endpoint_pipe# Loading work.VCC# Loading work.GND# Loading work.INV# Loading work.FD# Loading work.SRL16# Loading work.FDE# Loading work.SRL16E# Loading work.LUT4_L# Loading work.LUT4_D# Loading work.LUT3_L# Loading work.LUT3_D# Loading work.LUT2_D# Loading work.LUT2_L# Loading work.MUXF5# Loading work.LUT2# Loading work.LUT3# Loading work.LUT4# Loading work.FDP# Loading work.FDR# Loading work.BUF# Loading work.LUT1# Loading work.FDRSE# Loading work.FDRE# Loading work.FDCE# Loading work.FDRS# Loading work.FDS# Loading work.MUXF6# Loading work.MUXCY# Loading work.XORCY# Loading work.FDSE# Loading work.SRLC16E# Loading work.RAMB16_S9_S9# Loading work.FDPE# Loading work.FDC# Loading work.RAM16X1D# Loading work.FDDRCPE# Loading work.BUFG# Loading work.DCM# Loading work.xilinx_pci_exp_1_lane_downstream_port# Loading work.xilinx_pci_exp_1_lane_dsport# Loading work.GT11CLK_MGT# Loading work.pci_exp_1_lane_64b_dsport# Loading work.LUT1_L# Loading work.DCM_ADV# Loading work.dcm_adv_clock_divide_by_2# Loading work.dcm_adv_maximum_period_check# Loading work.dcm_adv_clock_lost# Loading work.MUXCY_L# Loading work.SRLC16# Loading work.GT11# ** Error: (vsim-3033) C:/Xilinx/10.1/ISE/verilog/src/unisims/GT11.v(2563​): Instantiation of 'GT11_SWIFT' failed. The design unit was not found.# Region: /boardx01/xilinx_pci_exp_1_lane_downstream_port/xi​linx_pci_exp_1_lane_dsport/pci_exp_1_lane_64b_dspo​rt/plm_v4f_mgt_gt11_by1_GT11_PCIEXP_2_INST# Searched libraries:# work# work# ** Error: (vsim-3033) C:/Xilinx/10.1/ISE/verilog/src/unisims/GT11.v(2563​): Instantiation of 'GT11_SWIFT' failed. The design unit was not found.# Region: /boardx01/xilinx_pci_exp_1_lane_downstream_port/xi​linx_pci_exp_1_lane_dsport/pci_exp_1_lane_64b_dspo​rt/plm_v4f_mgt_gt11_by1_GT11_PCIEXP_2_INST2# Searched libraries:# work# work# Loading work.MULT_AND# Loading work.RAMB16_S18_S18# Loading work.dsport_cfg# Loading work.pci_exp_usrapp_rx# Loading work.pci_exp_usrapp_tx# Loading work.pci_exp_usrapp_cfg# Loading work.pci_exp_usrapp_com# Loading work.sys_clk_gen_ds# Loading work.sys_clk_gen# Loading work.glbl# Error loading design# Error: Error loading design # Pausing macro execution # MACRO C:\coregen\endpoint_pipe\simulation\functional\sim​ulate_mti.do PAUSED at line 8

    DB:2.50:Simulation Problem With Pci Express Endpoint_Pipe V1.7-Help???!! ms


    Do you know if you compiled your libraries for Modelsim?

    You should see them in your Libraries tab.

    The Libraries that you should see is the "secureip" and "unisims_ver" libraries.

    If you have them compiled, then you need to make sure that your vsim command uses these libraries.

    You'll need to add the following to you vsim command:

    -L unisims_ver

    -L secureip

  • RELEVANCY SCORE 2.49

    DB:2.49:Visual C++ 2010 Express Compiling Issue fj


    I recently downloaded Visual C 2010 Express and wrote a short program, and am experiencing problems compiling it. I wrote the program in the IDE, clicked Debug, then clicked Build Solution. The message said it was successful, but then I tried Start Debugging,
    andan error message poppedup saying it couldn't find the executable. Is there something else I should be doing besides Build Solution in order tocreate the executable? I have already found instructionsconcerning the vcvarsall batch
    file, and I believe I did that correctly.

    DB:2.49:Visual C++ 2010 Express Compiling Issue fj

    In your original description you said you pressed Debug then Build Solution. This is the wrong way round.
    In hindsight, that could have been worded better. I meant I clicked the Debug menu and then clicked Build Solution in the menu.
    It turned out, after Wayne's question about what happened when I clicked Compile, I re-read his previous question about the .cpp file, and noticedthe file was only listed as a tab beside the Solution Explorer pane, not under it as it should have
    been. I added the file to the project, and was able to compile, build and run my program without further complications. I used a different version of C some years ago where the source file was automatically added to the project, and didn't realize I needed
    to manually add it in this version.
    I appreciate the input from both of you. For now, it looks as though my problem is solved.

  • RELEVANCY SCORE 2.49

    DB:2.49:Trying To Use A C++ Dll, Getting System.Typeloadexception pd



    Looks like the problem was solved by compiling the dll in Release instead of Debug.

    DB:2.49:Trying To Use A C++ Dll, Getting System.Typeloadexception pd


    Looks like the problem was solved by compiling the dll in Release instead of Debug.

  • RELEVANCY SCORE 2.49

    DB:2.49:Error While Building X264 dz


    I was trying to build x264 for t1040rdb and it get failed with below error log

    Log data follows:
    | DEBUG: Executing python function sysroot_cleansstate
    | DEBUG: Python function sysroot_cleansstate finished
    | DEBUG: Executing shell function do_configure
    | No working C compiler found.

    When I check the config.log file it reports below error

    Failed commandline was:
    --------------------------------------------------
    powerpc-fsl-linux-gcc -m32 -mhard-float -mcpu=e5500 --sysroot=sysroot dir conftest.c - O2 -pipe -g -feliminate-unused-debug-types -Wall -I. -I$(SRCPATH) sysroot=sysroot dir - maltivec -mabi=altivec -Wl,-O1 -Wl,--hash-style=gnu -Wl,--as-needed --sysroot=sysroot dir -lm -o conftest
    conftest.c:1:0: error: AltiVec not supported in this target
    int main () { return 0; }
    ^
    --------------------------------------------------
    Failed program was:
    --------------------------------------------------
    int main () { return 0; }
    --------------------------------------------------
    DIED: No working C compiler found.

    So any thoughts how to fix this issue.

    Thanks,
    Abhinav

    DB:2.49:Error While Building X264 dz

    I was trying to build x264 for t1040rdb and it get failed with below error log

    Log data follows:
    | DEBUG: Executing python function sysroot_cleansstate
    | DEBUG: Python function sysroot_cleansstate finished
    | DEBUG: Executing shell function do_configure
    | No working C compiler found.

    When I check the config.log file it reports below error

    Failed commandline was:
    --------------------------------------------------
    powerpc-fsl-linux-gcc -m32 -mhard-float -mcpu=e5500 --sysroot=sysroot dir conftest.c - O2 -pipe -g -feliminate-unused-debug-types -Wall -I. -I$(SRCPATH) sysroot=sysroot dir - maltivec -mabi=altivec -Wl,-O1 -Wl,--hash-style=gnu -Wl,--as-needed --sysroot=sysroot dir -lm -o conftest
    conftest.c:1:0: error: AltiVec not supported in this target
    int main () { return 0; }
    ^
    --------------------------------------------------
    Failed program was:
    --------------------------------------------------
    int main () { return 0; }
    --------------------------------------------------
    DIED: No working C compiler found.

    So any thoughts how to fix this issue.

    Thanks,
    Abhinav

  • RELEVANCY SCORE 2.48

    DB:2.48:More Problems Compiling m3


    Hello,

    I downloaded a package called mpt.jar which I can successfully use in one of my programs, e.g Program1:

    import mpt.*;

    public class Program1
    {
    ...
    //here I can use classes from mpt.jar

    }

    I have been compiling this class by:

    C:\MyPrograms javac -classpath c:\lib\mpt.jar Program1.java.

    And the program successfully compiles.

    The problem occurs when I want to use the package in another class e.g. Program2.

    import mpt.*;

    public class Program1
    {
    ...

    Program p2 = new Program();
    }

    import mpt.*;

    public class Program2
    {
    //want to also use classes from mpt here.
    }

    When I try to compile:

    C:\MyPrograms javac -classpath c:\lib\mpt.jar Program1.java.

    I get:

    cannot find symbol...
    Program2.

    Could someone explain why this will not work and provide some help on how to get it working. Help is very much apprec.

    DB:2.48:More Problems Compiling m3

    Jonny, your ignorance is too deep for this forum to bail out. It's great that you're writing all these small programs to try and learn, but you've really got to learn a bit more about Java. You can't be posting to this forum every time you have an elementary question like this. Go through the Java tutorial on-line or buy yourself a good book and go all the way through it.

    Try Bruce Eckel's "Thinking In Java". It's available for free in electronic form.

    You don't know enough Java yet.

    %

  • RELEVANCY SCORE 2.48

    DB:2.48:When Compiling C++ Source Code ,Which Library Need To Be Linked ? dj


    in TRU64 UNIX, when compiling c++ source code (the code has used OCCI,which library need to be linked ?

    DB:2.48:When Compiling C++ Source Code ,Which Library Need To Be Linked ? dj

    Please see demo_rdbms.mk under rdbms/demo directory
    for building OCCI.

  • RELEVANCY SCORE 2.48

    DB:2.48:Problems Using Jdic kk


    Hi
    I am trying to use jdic to open a browser from a java application, I downloaded and installed the binary under C:\jdic
    I updated my classpath to point to this directory too.
    However when I am compiling my source code from the command line, usng the following command
    C:\VDApp javac -cp C:\jdic;C:\VDApp GeneViewer/VisualDatabase.java (GeneViewer is the package and VisualDatabase.java is the class containing the main method)

    and run it using

    java GeneViewer.VisualDatabase

    I get the following error
    Exception in thread main java.lang.NoClassDefFoundError: /org/jdesktop/jdic/desktop/DesktopException

    Please guide me

    DB:2.48:Problems Using Jdic kk

    Duplicate post:
    http://forum.java.sun.com/thread.jspa?threadID=666152

  • RELEVANCY SCORE 2.48

    DB:2.48:Compiling A Package - Help!! kz


    Hello, I'm having problems compiling my Java package. I'm using the latest beta version(j2sdk1.4.0-rc). my application files are located in c:\java and the java apllication files are located at: c:\j2sdk1.4.0-rc. I get the "unresolve error". PLEASE HELP!!!

    DB:2.48:Compiling A Package - Help!! kz

    What is "the unresolve error"? Did you set your path and classpath correctly? Did you follow the JDK installation instructions carefully?

    Setting the class path
    http://java.sun.com/j2se/1.4/docs/tooldocs/win32/classpath.html

    Installation notes
    http://java.sun.com/j2se/1.4/install-windows.html

    Java 2 SDK Readme
    http://java.sun.com/j2se/1.4/README.html

    Jesper

  • RELEVANCY SCORE 2.48

    DB:2.48:Wdk 7.1 Win7 X86 Compiling Error p3


    Hi,
    I'm trying to compile WDM codes on Win7 x86 Checked Built Environment.
    I have two different dokument, first one compiled succesfully but i have problems with other one;
    i opened the compiler and go to my code's directory then wrote BLD and result
    C:\deneme\apco25_vpcc_device_driverBLD
    BUILD: Compile and Link for x86
    BUILD: Loading c:\winddk\build.dat...
    BUILD: Computing Include file dependencies:
    BUILD: Start time: Wed Feb 09 15:18:53 2011
    BUILD: Examining c:\deneme\apco25_vpcc_device_driver directory for files to comp
    ile.
    c:\deneme\apco25_vpcc_device_driver Invalidating OACR warning log for 'root:
    x86chk'
    BUILD: Saving c:\winddk\build.dat...
    BUILD: Compiling and Linking c:\deneme\apco25_vpcc_device_driver directory
    Configuring OACR for 'root:x86chk' - OACR on
    Compiling resources - driver.rc
    Compiling - apco25_vpcc_driver_entry.cpp
    Compiling - apco25_vpcc_read_write.cpp
    Compiling - apco25_vpcc_queue_wr_functions.cpp
    Compiling - stddcls.cpp
    Compiling - generating code...
    1errors in directory c:\deneme\apco25_vpcc_device_driver
    1NMAKE : fatal error U1073: don't know how to make '\apco25_vpcc_driver_generic
    _functions\objchk_win7_x86\i386\apco25_vpcc_driver_generic_functions.lib'
    1nmake.exe /nologo BUILDMSG=Stop. -i BUILD_PASS=PASS2 LINKONLY=1 NOPASS0=1 MAKE
    DIR_RELATIVE_TO_BASEDIR= failed - rc = 2
    BUILD: Finish time: Wed Feb 09 15:18:54 2011
    BUILD: Done
    7 files compiled - 5 Warnings - 2 Errors

    I couldnt find the reason, pls take me a hand...
    Thanks,
    Osman.

    DB:2.48:Wdk 7.1 Win7 X86 Compiling Error p3

    for posterity and others who hit this problem, how?d -- This posting is provided AS IS with no warranties, and confers no rights.

  • RELEVANCY SCORE 2.48

    DB:2.48:Problem When Compiling C Program From Rfc Sdk On Aix 5.2 3c



    Hi friends,

    When I compile c program from RFC SDK, some problems occured. The OS is AIX 5.2 and I use standard C compiler on AIX.

    The compiling command is "xlc -q64 sapinfo.c -I... -L... sapinfo.c librfc.a -o sapinfo".

    In "ld" step of compiling process, the problem is:

    ld: 0711-317 ERROR: Undefined symbol: .__vn__FUl

    ld: 0711-317 ERROR: Undefined symbol: .__vd__FPv

    ld: 0711-317 ERROR: Undefined symbol: __PureVirtualCalled

    ld: 0711-317 ERROR: Undefined symbol: .__dl__FPv

    ld: 0711-317 ERROR: Undefined symbol: __dl_FPv

    ld: 0711-317 ERROR: Undefined symbol: .__nw__FUl

    ld: 0711-345 Use the -bloadmap or -bnoquiet option to obtain more information.

    I thought it seem to RFC SDK uses some C++ functions. So I change the file name into

    "sapinfo.C".

    The compiling command is "xlc -q64 sapinfo.C -I... -L... sapinfo.c librfc.a -o sapinfo"

    to compile.

    Then the error information comed:

    ld: 0711-317 ERROR: Undefined symbol: .operator new[](unsighned long)

    ld: 0711-317 ERROR: Undefined symbol: .operator delete[](void*)

    ld: 0711-317 ERROR: Undefined symbol: __PureVirtualCalled

    ld: 0711-317 ERROR: Undefined symbol: .operator delete(void*)

    ld: 0711-317 ERROR: Undefined symbol: operator delete(void*)

    ld: 0711-317 ERROR: Undefined symbol: .operator new(unsigned long)

    ld: 0711-345 Use the -bloadmap or -bnoquiet option to obtain more information.

    I hope someone can tell me the reason and how I can get it through.

    3x

  • RELEVANCY SCORE 2.47

    DB:2.47:'During Compiling C Example The Compiler Generate Error As' 3c


    'when compile c example of NI-DAQmxBase, for daq USB-6009; the compiler generate link error as: " [Linker error] undefined reference to `DAQmxBaseCreateTask' "
    Can you help me?
    thanks in advance,
    C

    DB:2.47:'During Compiling C Example The Compiler Generate Error As' 3c

    Hi,

    You would probably get a better response by posting your question here:
    http://forums.ni.com/ni/board?board.id=250

    Regards
    Ray Farmer



    RegardsRay Farmer

  • RELEVANCY SCORE 2.46

    DB:2.46:Given Dropdown-Script In C# - Compiling Problems j3



    The line in OnGUI():

    if (Popup.List(rect, showList, listEntry, GUIContent(hello), list, listStyle))


    should probably be

    if (Popup.List(rect, ref showList, ref listEntry, new GUIContent(hello), list, listStyle))


    Remember in C# you have to prefix variable creation with the word new. Also, if you are passing in reference arguments, you have to prefix the variables you pass into the function with ref.

    DB:2.46:Given Dropdown-Script In C# - Compiling Problems j3


    The line in OnGUI():

    if (Popup.List(rect, showList, listEntry, GUIContent(hello), list, listStyle))


    should probably be

    if (Popup.List(rect, ref showList, ref listEntry, new GUIContent(hello), list, listStyle))


    Remember in C# you have to prefix variable creation with the word new. Also, if you are passing in reference arguments, you have to prefix the variables you pass into the function with ref.

  • RELEVANCY SCORE 2.46

    DB:2.46:Xcode Is Compiling Slowly 19


    I've noticed a noticeable slow-down in the compile speed of XCode recently. Even when I'm building a simple (less than 50 line) Objective-C program, it compiles slowly. Is this just because of Objective-C, or is there something wrong with my system? Compiling a C program seemed to be much faster.

  • RELEVANCY SCORE 2.46

    DB:2.46:Compiling C++ Code Inside C# Application 8c


    I once had a code for compiling IL code in C# application.
    What I want to do is to import a C compiler into my project and when user makes the input in the application and press the button, that C# application will run C compiler and compile the code that user has created.
    How to do that?

    Microsoft Student Parnter Microsoft Technology Associate

    DB:2.46:Compiling C++ Code Inside C# Application 8c

    You have multiple problems/requirements:
    1. You want to compile native C Code. So you either need to figure out how to direct Visual Studio (that has to be installed on each product machine for this to work) via console.
    Or you need some other command line compiler and have to ship it (and all files it needs) along with your GUI.
    Solve step 1 before you even think about how to write the UI. Because if
    you can't controll the compiler from the console, you can't teach the computer how to do it for you.

    2. Save the TextBox.Text to a File that file that fits the requirement of a SourceCode File for the compiler.
    3. Call the compiler, give it the path to the SourcecodeFile and whatever else it needs via commandline Parameters.
    4. (optional) process output/return values/Events of the Compiler so you can give the user of your IDE some feedback. You may also have to start the programm after sucesfull compilation, as very few command line compielr can do that for you (you usually
    put thier call in a batch-file or use an IDE for those steps).

  • RELEVANCY SCORE 2.46

    DB:2.46:C++ Framework ja


    I'm trying to create a framework using some c++ libraries... already written, tested and (fortunately) working. No problems about compiling framework, but when I added it into my obj-c app, gcc gave me a bunch of errors in (public) header files: parse errors, sintax errors, undeclared variables and so on...
    Can you explain me why? Are there any compiling conflicts between obj-c and c++? Are there some particular configurations to set to make it work?

    macbook pro, xcode 2.4 Mac OS X (10.4.8)

    DB:2.46:C++ Framework ja

    error: conflicting declaration 'typedef int BOOL'
    error: 'BOOL' has a previous declaration as 'typedef
    signed char BOOL'
    // ok, redeclaration...

    Okay, this one is easy. BOOL is defined in objc.h like so:

    pre class="command"typedef signed char BOOL;/preSo you are declaring it in your c++ file as a different type. If I had this problem, I'd probably try changing the declaration to something else, like Boolean or MYBOOL in the c++ framework. But I'm not sure it that's the "right" way or not.

    error: expected identifier before numeric constant
    error: expected `}' before numeric constant
    error: expected unqualified-id before numeric
    constant
    error: expected constructor, destructor, or type
    conversion before ';' token
    error: 'PrefType' does not name a type
    // these are about the line:
    // typedef enum { TYPE_INT, TYPE_STRING, TYPE_FLOAT,
    TYPE_BOOL } PrefType;

    Hmm. I see a TYPE_BOOL there, so it's possible that's just related to the redeclared BOOL above. Like I said, I don't know that much about c++, so I'm a bit lost with some of this stuff.

    charlie

  • RELEVANCY SCORE 2.45

    DB:2.45:Frm-30312: Failed To Compile The Library In R12 pj


    Hi All,

    I want to compile a custom library in R12. After I compiled it , an stranger error occured....Some packages are not available. Then I decided to compile an standard library (JE.pll) and the error occured again. If I wrote echo $FORMS60_PATH nothing appeared. I need to add the path which contains libraries ?.

    This is the command that I executed
    ---------------------------------------------------

    frmcmp_batch ${1}.pll userid=APPS/APPS output_file=/u01/oracle/DESA/apps/apps_st/appl/xbol/12.0.0/resource/${1}.plx module_type=LIBRARY

    This is the error :
    -----------------------

    Forms 10.1 (Form Compiler) Version 10.1.2.3.0 (Production)

    Forms 10.1 (Form Compiler): Release - Production

    Copyright (c) 1982, 2005, Oracle. All rights reserved.

    Oracle Database 11g Enterprise Edition Release 11.1.0.7.0 - 64bit Production
    With the Partitioning, OLAP, Data Mining and Real Application Testing options
    PL/SQL Version 10.1.0.5.0 (Production)
    Oracle Procedure Builder V10.1.2.3.0 - Production
    Oracle Virtual Graphics System Version 10.1.2.0.0 (Production)
    Oracle Multimedia Version 10.1.2.0.2 (Production)
    Oracle Tools Integration Version 10.1.2.0.2 (Production)
    Oracle Tools Common Area Version 10.1.2.0.2
    Oracle CORE 10.1.0.5.0 Production
    Compiling library JE...
    Compiling Package Spec JEZZ_GL......
    Compiling Package Spec JEZZ_AR......
    Compiling Package Spec JEZZ_AP......
    Compiling Package Spec JEZZ......
    Compiling Package Spec JESK_AP......
    Compiling Package Spec JERU_SH......
    Compiling Package Spec JERU_GL......
    Compiling Package Spec JERU_CE......
    Compiling Package Spec JERU_AR......
    Compiling Package Spec JERU_AP......
    Compiling Package Spec JEPT_AR......
    Compiling Package Spec JEPL_AR......
    Compiling Package Spec JEIT_AP......
    Compiling Package Spec JEHU_AP......
    Compiling Package Spec JEES_AR......
    Compiling Package Spec JEES_AP......
    Compiling Package Spec JECZ_AP......
    Compiling Package Spec JE......
    Compiling Package Body JEZZ_GL......
    Compiling Package Body JEZZ_AR......
    Compiling Package Body JEZZ_AP......
    Compiling Package Body JEZZ......
    Compiling Package Body JESK_AP......
    Compiling Package Body JERU_SH......
    Compiling Package Body JERU_GL......
    Compiling Package Body JERU_CE......
    Compiling Package Body JERU_AR......
    Compiling Package Body JERU_AP......
    Compiling Package Body JEPT_AR......
    Compiling Package Body JEPL_AR......
    Compiling Package Body JEIT_AP......
    Compiling Package Body JEHU_AP......
    Compiling Package Body JEES_AR......
    Compiling Package Body JEES_AP......
    Compiling Package Body JECZ_AP......
    Compiling Package Body JE......
    FRM-30312: Failed to compile the library.

    Thanks Mariano.-

    DB:2.45:Frm-30312: Failed To Compile The Library In R12 pj

    Hi,

    What do you mean nstead ?. That it is not necesary to set FORMS60_PATH ?. If you are on 11i, you need to check the value of FORMS60_PATH

    If you are on R12, you need to check the value of FORMS_PATH

    In addition, I sent an email to DBA in order to know if we have invalid objects, but I need to insist that the library is standard (JE.pll).Just verify as you may get this FRM error if you have any invalid objects that could be relevant.

    Thanks,
    Hussein

  • RELEVANCY SCORE 2.45

    DB:2.45:Problem Deploying a7


    Hello,

    I want to deploy my application in J2EE RI but I get following 2 errors:

    Compiling C:\java\j2sdkee1.3.1\repository\blinky\gnrtrTMP\project5\data\VakBean_
    PM.java ....
    Compiling C:\java\j2sdkee1.3.1\repository\blinky\gnrtrTMP\project5\data\VakBean_
    PMState.java ....
    Compiling C:\java\j2sdkee1.3.1\repository\blinky\gnrtrTMP\project5\data\Leerkrac
    htBean_PM.java ....
    Compiling C:\java\j2sdkee1.3.1\repository\blinky\gnrtrTMP\project5\data\Leerkrac
    htBean_PMState.java ....
    Compiling C:\java\j2sdkee1.3.1\repository\blinky\gnrtrTMP\project5\data\VakBean_
    leerkrachten_LeerkrachtBean_vakken.java ....
    Compiling C:\java\j2sdkee1.3.1\repository\blinky\gnrtrTMP\project5\data\VakBean_
    PM_LocalHomeImpl.java ....
    Compiling C:\java\j2sdkee1.3.1\repository\blinky\gnrtrTMP\project5\data\VakBean_
    PM_EJBLocalObjectImpl.java ....
    Compiling C:\java\j2sdkee1.3.1\repository\blinky\gnrtrTMP\project5\data\Leerkrac
    htBean_PM_LocalHomeImpl.java ....
    Compiling C:\java\j2sdkee1.3.1\repository\blinky\gnrtrTMP\project5\data\Leerkrac
    htBean_PM_EJBLocalObjectImpl.java ....
    C:\java\j2sdkee1.3.1\repository\blinky\gnrtrTMP\project5\data\VakBean_PM_LocalHo
    meImpl.java:31: cannot resolve symbol
    symbol : method ejbPostCreate (java.lang.String)
    location: class data.VakBean_PM
    ejb.ejbPostCreate(param0);
    ^
    C:\java\j2sdkee1.3.1\repository\blinky\gnrtrTMP\project5\data\LeerkrachtBean_PM_
    LocalHomeImpl.java:31: cannot resolve symbol
    symbol : method ejbPostCreate (java.lang.String)
    location: class data.LeerkrachtBean_PM
    ejb.ejbPostCreate(param0);
    ^
    2 errors
    Compilation failed ...

    Can anyone give me a clue what I did wrong?
    If you need more information, I will post it.

    Thanks,

    Ren

    DB:2.45:Problem Deploying a7

    Hello Ken,

    thank you very much for watching at the code!
    Your aswer helped to deploy my application.

    Thanks again,

    Ren

  • RELEVANCY SCORE 2.45

    DB:2.45:Benefits Of Compiling Source Distributions m3


    can anybody tell me if there is a benefit in compiling source dsitros of java apps
    say tomcat for example and install the built result instead of installing from a binary distro .
    i know that in C or C++ this has its benefits because you get the chance to
    optimize the compiling and linking process by providing hints to the different stages of the build.

    DB:2.45:Benefits Of Compiling Source Distributions m3

    The upcoming version of Java, Java SE 7, is available as Open Source software here: http://openjdk.java.net/

  • RELEVANCY SCORE 2.45

    DB:2.45:Kawa 4.01a - Jdk Debug Classes Path jf


    Hello,

    I am using Kawa 4.01a. Everytime I start Kawa, I will see a warning box telling me that it is unable to find JDK classes.zip file, which may cause problems for the debugger.

    Hence, I do not what to specify for "JDK Debug Classes Path" in Customize/Options/Directories/Advanced Paths.

    I am currently using Java2,SDK-version 1.3.1, and Win 98SE.

    I have no problems compiling Java programs. The bin and lib directories have been set to C:\jdk1.3.1\bin and C:\jdk1.3.1\lib respectively.

    Thank you.

    Best Regards.

    DB:2.45:Kawa 4.01a - Jdk Debug Classes Path jf

    I seem to recall that it was necessary to download a file from Tek-Tools to provide debugging capabilities, and I think that's what you had to point to in "JDK Debug Classes Path". However, now that Allaire owns Kawa, I wouldn't know where to begin looking...

    Just as a heads up though, if you're a paid-up Kawa owner, then you should be entitled to a one-time free upgrade to Kawa 5.0 from Allaire - I got mine, and it looks like the separate debug class path setting has now gone away.

  • RELEVANCY SCORE 2.45

    DB:2.45:Compile Woes On Win2000 Prof zk


    I'm having problems compiling hello world on Windows 2000 professional. My file Hello.java looks like...

    package hello;
    public class Hello extends Object
    {
    System.out.println("Hello world!");
    }

    The file is in C:\...\codebase\hello\Hello.java

    I set my CLASSPATH to C:\...\codebase in my environment settings.
    I go into directory C:\...\codebase\hello and type
    javac *.java
    I get an error like
    Hello.java:4: identifier expected
    System.out.println("Hello world!");
    ^
    with the carret pointing at the opening parenthesis.
    Thanks for any help.
    - Jim Robertson

    DB:2.45:Compile Woes On Win2000 Prof zk

    yeah, windows is fun.

    so, lessons learned:

    in windows, you can use spaces in your pathnames in your classpath

    when posting your classpath info, paste it exactly as you have it
    not : c:\coding\...\mydir

    (=

  • RELEVANCY SCORE 2.45

    DB:2.45:How Can I Verify Build Or Update Numbers Of Intel C++ Compiler At Compile Time? 8p



    How can I verify Build or Update numbers of Intel C++ compiler at compile time? I'm currently using three versions of Intel C++ compiler and when compiling some sources their outputs look like: [ Version 8.1 ] ... Compiling with Intel(R) C++ Compiler 8.1.038 [IA-32]... (Intel C++ Environment) Stdphf.cpp ... [ Version 12.1.3 ] ... Compiling with Intel(R) C++ Compiler XE 12.1.3.300 [IA-32]... (Intel C++ Environment) Stdphf.cpp ... [ Version 13.0.0 ] ... Compiling with Intel(R) C++ Compiler XE 13.0.0.089 [IA-32]... (Intel C++ Environment) Stdphf.cpp ... and I changed a font to bold for numbers I need to verify at compile time. I know that Intel C++ compiler specific macros __INTEL_COMPILER and __INTEL_COMPILER_BUILD_DATE provide information about some release and they could be used. So, I wonder if another Intel C++ compiler specific macros with some additional information about release exist? Thanks in advance.

    DB:2.45:How Can I Verify Build Or Update Numbers Of Intel C++ Compiler At Compile Time? 8p


    Sergy,

    I believe Rich Text or Not Rich Text has no effect on what occures with using [;xxx]...[;/xxx]; (ampersand nad semicolon removed)
    Where xxx is one of: bash, csharp, cpp, css, fortran, jscript, java, perl, php, plain, python, r, ruby, sql, xml, html, javascript, s, splus.

    The two tags are not html either, rather the websit script uses these identifiers to reformat the enclosed text in a format familliar with the language specified. Example of which is cpp programmers tend to prefer that a newline at the end of a statement is not removed by the editor and shows as a new line as opposed to new paragraph.

    Jim Dempsey

  • RELEVANCY SCORE 2.45

    DB:2.45:Compiling Example In C 8k


    Hi!I have problems compiling the example sigar_ps.c, i downloaded the binary distribution and already copied the sigar-bin/lib contents into /usr/lib and the sigar-bin/include contents into /usr/include, when i try to compile with the following command:gcc sigar_ps.c -o sigar_ps -lsigar-x86-linuxI get the following error messages:/usr/lib/gcc/i486-linux-gnu/4.1.3/../../../../lib/libsigar-x86-linux.so: undefined reference to `dlsym'/usr/lib/gcc/i486-linux-gnu/4.1.3/../../../../lib/libsigar-x86-linux.so: undefined reference to `dlopen'/usr/lib/gcc/i486-linux-gnu/4.1.3/../../../../lib/libsigar-x86-linux.so: undefined reference to `dlclose'any ideas? i'm using xubuntu 7.10Thanks!Edit: i've already found a solution, i just have to add -ldl to the command prompt like: gcc sigar_ps.c -lsigar-x86-linux -ldlThanks anyway, i hope this post helps anothers newbs compiling sigar :)Message was edited by: Nikolodeon

    DB:2.45:Compiling Example In C 8k

    Hi!I have problems compiling the example sigar_ps.c, i downloaded the binary distribution and already copied the sigar-bin/lib contents into /usr/lib and the sigar-bin/include contents into /usr/include, when i try to compile with the following command:gcc sigar_ps.c -o sigar_ps -lsigar-x86-linuxI get the following error messages:/usr/lib/gcc/i486-linux-gnu/4.1.3/../../../../lib/libsigar-x86-linux.so: undefined reference to `dlsym'/usr/lib/gcc/i486-linux-gnu/4.1.3/../../../../lib/libsigar-x86-linux.so: undefined reference to `dlopen'/usr/lib/gcc/i486-linux-gnu/4.1.3/../../../../lib/libsigar-x86-linux.so: undefined reference to `dlclose'any ideas? i'm using xubuntu 7.10Thanks!Edit: i've already found a solution, i just have to add -ldl to the command prompt like: gcc sigar_ps.c -lsigar-x86-linux -ldlThanks anyway, i hope this post helps anothers newbs compiling sigar :)Message was edited by: Nikolodeon

  • RELEVANCY SCORE 2.45

    DB:2.45:G3/G4 Cpu Upgrade For Powermac G3 B/W md


    Which 3rd party CPU upgrades work well with no problems in OSX? I do not need the Altivec(sp?) features in the G4. Looking for good general performance.

    Thanks,
    RL

    DB:2.45:G3/G4 Cpu Upgrade For Powermac G3 B/W md

    Thanks for the info.

    It seems for the money the G3/1000 is the best. The G4/700 is an alternative.

    RL

  • RELEVANCY SCORE 2.44

    DB:2.44:Compile Error In C++ 5.8 When Using Typedef 8x


    Hello all,

    I am new to using Sun Studio 11 C++ 5.8 compiler.

    an error occurs to me when I put this line on my header file

    typedef DWORD int;

    line6: Error: "," expected instead of "int".

    When I replace the line with this line

    typedef DWORD ,;

    then the error disappers.

    I tried compiling it using g++ and I encounter no problems.

    I am using Solaris 10 and I installed patched the C++ 5.8 compiler with patch 121017-10

    I don't know what is causing the problem..
    Please help.
    Thanks in advance.

    Marc Glenn

  • RELEVANCY SCORE 2.44

    DB:2.44:C++ Complile/Manifest Problem Vs2008 3.5 Sp1 px


    I am having problems compiling legacy C++ code with VS2008.  I receive unresolved symbols for __forceCRTManifestCLR and  see two versions in CRT in the manifest

    DB:2.44:C++ Complile/Manifest Problem Vs2008 3.5 Sp1 px


    I suggest posting in the Visual C++ General forum

  • RELEVANCY SCORE 2.44

    DB:2.44:Missing-- Package Javax.Applet Does Not Exist px


    While compiling a short program to work with an image in jcreator I get a javax.applet does not exist error. I've checked the boards for this error as well as the bin dir and didn't see this package in there. Am I looking in the right place?

    C:\j2sdk1.4.1_02\bin...Also looked in the jre folder as there were some others with similar problems.

    Thanks in advance
    Baccoitalia

    DB:2.44:Missing-- Package Javax.Applet Does Not Exist px

    Woops - I missed what eewest saw - you're importing a nonexistent package.

  • RELEVANCY SCORE 2.44

    DB:2.44:Compiling C Programs Within Pemapi Dir xc



    Has anyone had problems compiling any of the C programs with pemapi directory.I have been getting the following error message:send_receive.c:2: *** missing separator. Stop.

    DB:2.44:Compiling C Programs Within Pemapi Dir xc


    Probably you don't have a full compiler installed on your machine.You could download and install gcc if you OS doesn't come with a proper compiler by default (like Solaris and HP for example)-- Geert

  • RELEVANCY SCORE 2.44

    DB:2.44:Sdk/Edk 14.3 Cannot Compile Bsp Package ds


    After successful went thought the design flow on XPS 14.3, I export the design to SDK 14.3. I created a BSP project for standalone_bsp_0. But it compiled with errors. Would anyone point me to how to fix the errors. I am working on ML510 board and PPC440. The Xilinx application version is 14.3.

    make -k all
    libgen -hw ../ml510_dual_vxworks_ppc440_14_hw_platform/system​.xml\
    \
    -pe ppc440_0 \
    -log libgen.log \
    system.mss
    libgen
    Xilinx EDK 14.3 Build EDK_P.40xd
    Copyright (c) 1995-2012 Xilinx, Inc. All rights reserved.

    Command Line: libgen -hw ../ml510_dual_vxworks_ppc440_14_hw_platform/system​.xml
    -pe ppc440_0 -log libgen.log system.mss

    Staging source files.
    Running DRCs.
    Running generate.
    XPS_BRAM_IF_CNTLR_1 not connected

    DDR2_SDRAM_DIMM1 not connected

    Running post_generate.
    Running include - 'make -s include "COMPILER=powerpc-eabi-gcc"
    "ARCHIVER=powerpc-eabi-ar" "COMPILER_FLAGS=-mfpu=dp_full -mcpu=440 -O2 -c"
    "EXTRA_COMPILER_FLAGS=-g"'.

    Running libs - 'make -s libs "COMPILER=powerpc-eabi-gcc"
    "ARCHIVER=powerpc-eabi-ar" "COMPILER_FLAGS=-mfpu=dp_full -mcpu=440 -O2 -c"
    "EXTRA_COMPILER_FLAGS=-g"'.
    "Compiling common"
    powerpc-eabi-ar: creating ../../../lib/libxil.a
    "Compiling llfifo"
    "Compiling lldma"
    "Compiling dma"
    "Compiling standalone"
    "Compiling lltemac"
    "Compiling llfifo"
    "Compiling iic"
    "Compiling gpio"
    "Compiling pci"
    "Compiling uartns550"
    "Compiling spi"
    "Compiling sysace"
    "Compiling bram"
    "Compiling intc"
    "Compiling tft"
    xtft.c: In function 'XTft_GetPixel':
    xtft.c:368: error: expected ')' before ';' token
    xtft.c:370: error: expected ';' before '}' token
    make[1]: *** [libs] Error 1
    "Compiling cpu_ppc440"
    ERROR:EDK:369 - make failed for target "libs"
    ERROR:EDK:3418 - Error(s) while running make.
    make: *** [ppc440_0/lib/libxil.a] Error 2
    make: Target `all' not remade because of errors.

    DB:2.44:Sdk/Edk 14.3 Cannot Compile Bsp Package ds


    I looked at the code. It is missing the ')". Xilinx did not test before shipped the product.

    Thanks,

  • RELEVANCY SCORE 2.44

    DB:2.44:Re: Compiling Problem s1


    I wrote

    C:\..\direjava -classpath .. B

    but then show up the short message

    Exception in thread "main" java.lang.NoClassDefFoundError: B

    DB:2.44:Re: Compiling Problem s1

    Strongly I suggest you check your CLASSPATH.

  • RELEVANCY SCORE 2.44

    DB:2.44:[Help]Problem With Bmd Simulation k9



    I meet a problem when I simulate the DMA free_ware.

    Here is the excerpt of the Modelsim log showing the errors at elaboration time :

    do simulate_mti.do

    # ** Warning: (vlib-34) Library already exists at "work".# Reading D:\modeltech_6.4d\win32/../modelsim.ini# "work" maps to directory work. (Default mapping)# Model Technology ModelSim SE vlog 6.4d Compiler 2009.03 Mar 16 2009# -- Compiling module boardx04# -- Compiling module sys_clk_gen# -- Compiling module sys_clk_gen_ds# -- Compiling module BMD# -- Compiling module BMD_64_RX_ENGINE# -- Compiling module BMD_64_TX_ENGINE# -- Compiling module BMD_EP_MEM_ACCESS# -- Compiling module BMD_EP_MEM# -- Compiling module BMD_EP# -- Compiling module BMD_INTR_CTRL# -- Compiling module BMD_TO_CTRL# -- Compiling module xilinx_pci_exp_4_lane_ep# -- Compiling module endpoint_blk_plus_v1_5# -- Compiling module glbl# -- Compiling module pci_exp_64b_app# -- Compiling module xilinx_pci_exp_4_lane_downstream_port# -- Compiling module xilinx_pci_exp_4_lane_dsport# -- Compiling module dsport_cfg# -- Compiling module pci_exp_usrapp_rx# -- Compiling module pci_exp_usrapp_tx# -- Compiling module pci_exp_usrapp_com# -- Compiling module pci_exp_usrapp_cfg# -- Compiling module pci_exp_4_lane_64b_dsport# -- Scanning library directory 'D:\Xilinx\10.1\ISE/verilog/src/simprims'# -- Scanning library directory 'D:\Xilinx\10.1\ISE/verilog/src/unisims'# -- Compiling module IBUFDS# -- Compiling module IBUF# -- Compiling module VCC# -- Compiling module GND# -- Compiling module INV# -- Compiling module LUT5# -- Compiling module LUT3# -- Compiling module LUT4# -- Compiling module FDR# -- Compiling module LUT2# -- Compiling module LUT6# -- Compiling module FDC# -- Compiling module FDCE# -- Compiling module FDP# -- Compiling module BUFG# -- Compiling module PLL_ADV# -- Compiling module PCIE_INTERNAL_1_1# -- Compiling module RAMB36_EXP# -- Compiling module RAMB36SDP_EXP# -- Compiling module FDRE# -- Compiling module GTP_DUAL# -- Compiling module LDP_1# -- Compiling module FD# -- Compiling module FDE# -- Compiling module SRLC16E# -- Compiling module MUXF7# -- Compiling module FDRS# -- Compiling module LUT1# -- Compiling module FDRSE# -- Compiling module FDS# -- Compiling module FDSE# -- Compiling module MUXCY# -- Compiling module XORCY# -- Compiling module RAM32X1D# -- Compiling module GT11CLK_MGT# -- Compiling module OBUF# -- Compiling module LUT4_L# -- Compiling module LUT1_L# -- Compiling module LUT2_L# -- Compiling module LUT3_L# -- Compiling module MUXF5# -- Compiling module FDPE# -- Compiling module BUF# -- Compiling module DCM_ADV# -- Compiling module dcm_adv_clock_divide_by_2# -- Compiling module dcm_adv_maximum_period_check# -- Compiling module dcm_adv_clock_lost# -- Compiling module BUFGMUX_VIRTEX4# -- Compiling module MUXCY_L# -- Compiling module SRLC16# -- Compiling module SRL16# -- Compiling module GT11# -- Compiling module RAM16X1D# -- Compiling module SRL16E# -- Compiling module RAMB16_S18_S18# -- Compiling module MULT_AND# -- Compiling module MUXF6# -- Compiling module ARAMB36_INTERNAL# -- Compiling module BUFGCTRL# -- Scanning library directory 'D:\Xilinx\10.1\ISE/smartmodel/nt/wrappers/mtiverilog'# -- Compiling module PCIE_INTERNAL_1_1_SWIFT# -- Compiling module GTP_DUAL_FAST# -- Compiling module GTP_DUAL_SWIFT# -- Compiling module GT11_SWIFT# -- Compiling module PCIE_INTERNAL_1_1_SWIFT_BIT# -- Compiling module GTP_DUAL_FAST_BIT# -- Compiling module GTP_DUAL_SWIFT_BIT# -- Compiling module GT11_SWIFT_BIT# # Top level modules:# boardx04# glbl# vsim +notimingchecks +TESTNAME=sample_smoke_test0 -L work work.boardx04 glbl # ** Note: (vsim-3813) Design is being optimized due to module recompilation...# ** Note: (vsim-3865) Due to PLI being present, full design access is being specified.# Loading D:\Xilinx\10.1\ISE\smartmodel\nt\installed_nt/lib/pcnt.lib/swiftpli_mti.dll# Loading work.boardx04(fast)# Loading work.xilinx_pci_exp_4_lane_ep(fast)# Loading work.IBUFDS(fast)# Loading work.IBUF(fast)# Loading work.pci_exp_64b_app(fast)# Loading work.BMD(fast)# Loading work.BMD_EP(fast)# Loading work.BMD_EP_MEM_ACCESS(fast)# Loading work.BMD_EP_MEM(fast)# Loading work.BMD_64_RX_ENGINE(fast)# Loading work.BMD_64_TX_ENGINE(fast)# Loading work.BMD_INTR_CTRL(fast)# Loading work.BMD_TO_CTRL(fast)# Loading work.endpoint_blk_plus_v1_5(fast)# Loading work.VCC(fast)# Loading work.GND(fast)# Loading work.INV(fast)# Loading work.LUT5(fast)# Loading work.LUT3(fast)# Loading work.LUT4(fast)# Loading work.FDR(fast)# Loading work.LUT2(fast)# Loading work.LUT6(fast)# Loading work.LUT2(fast__1)# Loading work.LUT2(fast__2)# Loading work.LUT2(fast__3)# Loading work.LUT2(fast__4)# Loading work.FDC(fast)# Loading work.FDCE(fast)# Loading work.FDP(fast)# Loading work.BUFG(fast)# Loading work.PLL_ADV(fast)# Loading work.PCIE_INTERNAL_1_1(fast)# Loading work.PCIE_INTERNAL_1_1_SWIFT(fast)# Loading work.PCIE_INTERNAL_1_1_SWIFT_BIT(fast)# Loading work.RAMB36_EXP(fast)# Loading work.ARAMB36_INTERNAL(fast)# Loading work.RAMB36SDP_EXP(fast)# Loading work.ARAMB36_INTERNAL(fast__1)# Loading work.FDRE(fast)# Loading work.GTP_DUAL(fast)# Loading work.GTP_DUAL_FAST(fast)# Loading work.GTP_DUAL_FAST_BIT(fast)# Loading work.GTP_DUAL(fast__1)# Loading work.LDP_1(fast)# Loading work.FD(fast)# Loading work.FD(fast__1)# Loading work.FDE(fast)# Loading work.SRLC16E(fast)# Loading work.MUXF7(fast)# Loading work.RAMB36SDP_EXP(fast__1)# Loading work.ARAMB36_INTERNAL(fast__2)# Loading work.LUT2(fast__5)# Loading work.LUT2(fast__6)# Loading work.FDRS(fast)# Loading work.LUT1(fast)# Loading work.FDRSE(fast)# Loading work.FDS(fast)# Loading work.LUT2(fast__7)# Loading work.FDSE(fast)# Loading work.FDRSE(fast__1)# Loading work.FDE(fast__1)# Loading work.MUXCY(fast)# Loading work.XORCY(fast)# Loading work.FDSE(fast__1)# Loading work.RAM32X1D(fast)# Loading work.xilinx_pci_exp_4_lane_downstream_port(fast)# Loading work.xilinx_pci_exp_4_lane_dsport(fast)# Loading work.GT11CLK_MGT(fast)# Loading work.OBUF(fast)# Loading work.pci_exp_4_lane_64b_dsport(fast)# Loading work.LUT1(fast__1)# Loading work.LUT2(fast__8)# Loading work.LUT4_L(fast)# Loading work.LUT1_L(fast)# Loading work.LUT2_L(fast)# Loading work.LUT2_L(fast__1)# Loading work.LUT2_L(fast__2)# Loading work.LUT3_L(fast)# Loading work.LUT2(fast__9)# Loading work.MUXF5(fast)# Loading work.LUT2_L(fast__3)# Loading work.LUT2_L(fast__4)# Loading work.LUT2_L(fast__5)# Loading work.FDPE(fast)# Loading work.BUF(fast)# Loading work.DCM_ADV(fast)# Loading work.dcm_adv_clock_divide_by_2(fast)# Loading work.dcm_adv_maximum_period_check(fast)# Loading work.dcm_adv_maximum_period_check(fast__1)# Loading work.dcm_adv_clock_lost(fast)# Loading work.BUFGMUX_VIRTEX4(fast)# Loading work.BUFGCTRL(fast)# Loading work.MUXCY_L(fast)# Loading work.LUT2_L(fast__6)# Loading work.SRLC16(fast)# Loading work.SRL16(fast)# Loading work.LUT1_L(fast__1)# Loading work.GT11(fast)# Loading work.GT11_SWIFT(fast)# Loading work.GT11_SWIFT_BIT(fast)# Loading work.GT11(fast__1)# Loading work.GT11(fast__2)# Loading work.LUT2_L(fast__7)# Loading work.RAM16X1D(fast)# Loading work.LUT2_L(fast__8)# Loading work.LUT2_L(fast__9)# Loading work.SRL16E(fast)# Loading work.RAMB16_S18_S18(fast)# Loading work.MULT_AND(fast)# Loading work.MUXF6(fast)# Loading work.dsport_cfg(fast)# Loading work.pci_exp_usrapp_rx(fast)# Loading work.pci_exp_usrapp_tx(fast)# Loading work.pci_exp_usrapp_cfg(fast)# Loading work.pci_exp_usrapp_com(fast)# Loading work.sys_clk_gen_ds(fast)# Loading work.sys_clk_gen(fast)# Loading work.sys_clk_gen_ds(fast__1)# Loading work.sys_clk_gen(fast__1)# Loading work.glbl(fast)# ** Warning: (vsim-PLI-3003) ../board.v(123): [TOFD] - System task or function '$fsdbDumpfile' is not defined.# Region: /boardx04# ** Warning: (vsim-PLI-3003) ../board.v(124): [TOFD] - System task or function '$fsdbDumpvars' is not defined.# Region: /boardx04# ** Warning: (vsim-3015) D:/Xilinx/10.1/ISE/verilog/src/unisims/GTP_DUAL.v(3488): [PCDPC] - Port size (9 or 9) does not match connection size (12) for port 'SIM_PLL_PERDIV2'.# Region: /boardx04/xilinx_pci_exp_4_lane_ep/ep/\BU2/U0/pcie_ep0/pcie_blk/SIO/.pcie_gt_wrapper_i/GTD[2].GT_i /genblk1/gtp_dual_fast_1# ** Warning: (vsim-3015) D:/Xilinx/10.1/ISE/verilog/src/unisims/GTP_DUAL.v(3488): [PCDPC] - Port size (9 or 9) does not match connection size (12) for port 'SIM_PLL_PERDIV2'.# Region: /boardx04/xilinx_pci_exp_4_lane_ep/ep/\BU2/U0/pcie_ep0/pcie_blk/SIO/.pcie_gt_wrapper_i/GTD[0].GT_i /genblk1/gtp_dual_fast_1# ** Warning: (vsim-3015) ../dsport/xilinx_pci_exp_dsport.v(551): [PCDPC] - Port size (5 or 5) does not match connection size (3) for port 'trn_tbuf_av'.# Region: /boardx04/xilinx_pci_exp_4_lane_downstream_port/xilinx_pci_exp_4_lane_dsport/pci_exp_4_lane_64b_dsport# Runtime, LMTV v12.4# Copyright (c) 1984-2009 Synopsys Inc. ALL RIGHTS RESERVED# You can use the Browser tool to configure the SmartModel# Library and access information about SmartModels:# $LMC_HOME/bin/sl_browser# # SmartModel product documentation is available here:# $LMC_HOME/doc/smartmodel/manuals/intro.pdf# http://www.synopsys.com/products/lm/doc/smartmodel.html# # (LMTV) (3006)Error: Model named 'PCIE_INTERNAL_1_1_SWIFT' was not installed at $LMC_HOME/models/PCIE_INTERNAL_1_1_SWIFT for this platform - # $lm_model failed to find model. Verify that instance path is correct.# (LMTV) (3006)Error: Model named 'GTP_DUAL_FAST' was not installed at $LMC_HOME/models/GTP_DUAL_FAST for this platform - # $lm_model failed to find model. Verify that instance path is correct.# (LMTV) (3006)Error: Model named 'GTP_DUAL_FAST' was not installed at $LMC_HOME/models/GTP_DUAL_FAST for this platform - # $lm_model failed to find model. Verify that instance path is correct.# Model gt11_swift: Model Vendor: xilinx'.# Running test {sample_smoke_test0}......# [ 0] : System Reset Asserted...# [ 4995000] : System Reset De-asserted...# [ 8522100] : Transaction Reset Is De-asserted...# Break key hit

    I have changed the file modelsim.ini and comipled the library with the following command:

    compxlib -s mti_se -arch all -lib all -l verilog -w

    but'PCIE_INTERNAL_1_1_SWIFT' and 'GTP_DUAL_FAST' arenot appear in the model list, andsome models are lost too. WHY?

    How to correct the errors? Please help!
    Message Edited by hithust on 06-08-2009 08:51 PMMessage Edited by hithust on 06-09-2009 12:34 AMMessage Edited by hithust on 06-09-2009 01:39 AM

    DB:2.44:[Help]Problem With Bmd Simulation k9


    I don't believe that Modelsim supports SmartModels in 6.4.

    When you use secureip, make sure to add the reference to the library in your vsim command:

    vsim +notimingchecks +TESTNAME=sample_smoke_test0 -L secureip -L work work.boardx04 glbl

  • RELEVANCY SCORE 2.44

    DB:2.44:Deployment Error cx


    I receive the following error when comm stubs are being generated during deployment to Oracle 8i release 2 using jdeveloper 3.1. It appears that the generated code is having trouble with inheritance. The TaggedMutableTreeNode class extends the javax.swing.tree.DefaultMutableTreeNode class. It appears as though the necessary Helper class is not being generated though the generated code expects it to be there. Are there known problems with inheritance in the deployment tools? Any suggestions on how I might fix this would be greatly appreciated.

    Here is the actual error:

    *** Executing deployment profile C:\lsenew\HierarchyEJB.prf ***
    *** Generating archive file C:\lsenew\HierarchyEJBSource.jar ***
    Compiling the project...done
    Validating the profile...done
    Initializing deployment...done
    Scanning project files...done
    Generating classpath dependencies...done
    Generating archive entries table...done
    *** Archive generation completed ***
    *** Deploying the EJB to JServer ***
    EJB deployment argument list:
    "C:\Program Files\Oracle\JDeveloper 3.1\java1.2\jre\bin\javaw"
    "-DPATH=C:\Program Files\Oracle\JDeveloper 3.1\bin;C:\Program Files\Oracle\JDeveloper 3.1\java1.2\bin"
    -classpath
    "C:\Program Files\Oracle\JDeveloper 3.1\jdbc\lib\oracle8.1.6\classes12.zip;C:\lsenew\lib;C:\Program Files\Oracle\JDeveloper 3.1\aurora\lib\aurora_client.jar;C:\Program Files\Oracle\JDeveloper 3.1\aurora\lib\vbjorb.jar;C:\Program Files\Oracle\JDeveloper 3.1\aurora\lib\vbjapp.jar;C:\Program Files\Oracle\JDeveloper 3.1\aurora\lib\vbjtools.jar;C:\Program Files\Oracle\JDeveloper 3.1\aurora\lib\vbj30ssl.jar;C:\Program Files\Oracle\JDeveloper 3.1\aurora\lib\aurora.zip;C:\Program Files\Oracle\JDeveloper 3.1\sqlj\lib\translator.zip;C:\lsenew\lib\development\PropertyTypeListEJBGenerated.jar;C:\lsenew\lib\development\ListEJBGenerated.jar;C:\lsenew\lib\development\ProjectFeatureListEJ BGenerated.jar;C:\lsenew\lib\development\ProjectListEJBGenerated.jar;C:\lsenew\lib\development\ProjectPropertyListEJBGenerated.jar;C:\lsenew\lib\development\PropertyListEJBGenerate d.jar;C:\lsenew\lib\development\FeatureHierarchyEJBGenerated.jar;C:\lsenew\lib\development\StructurePropertyListEJBGenerated.jar;C:\lsenew\lib\development\ProjectS
    ructurePropertyListEJBGenerated.jar;C:\lsenew\lib\development\ProjectStructureListEJBGenerated.jar;C:\Program Files\Oracle\JDeveloper 3.1\lib\javax_ejb.zip;C:\Program Files\Oracle\JDeveloper 3.1\jdbc\lib\oracle8.1.6\classes12.zip;C:\jdk1.3\lib\dt.jar;C:\jdk1.3\jre\lib\rt.jar;C:\jdk1.3\jre\lib\i18n.jar"
    oracle.aurora.ejb.deployment.GenerateEjb
    -u
    lsedevejb
    -p
    lsedevejb
    -s
    sess_iiop://server-3:2481:lsetest
    -republish
    -keep
    -temp
    TEMP
    -descriptor
    "C:\lsenew\HierarchyEJB.dd"
    -generated
    "C:\lsenew\HierarchyEJBGenerated.jar"
    "C:\lsenew\HierarchyEJBSource.jar"
    Reading Deployment Descriptor...done
    Verifying Deployment Descriptor...done
    Gathering users...done
    Generating Comm Stubs...................................................done
    Compiling Stubs...Errors compiling the communication stubs
    C:\lsenew\TEMP\com\cms\genoa\common\data\TaggedMutableTreeNodeHelper.java:45: Undefined variable, class, or package name: javax
    type = ((com.visigenic.vbroker.orb.ORB)orb()).create_estruct_tc(id(), "TaggedMutableTreeNode", javax.swing.tree.DefaultMutableTreeNodeHelper.type(), members);
    ^
    1 error
    *** Errors occurred while deploying the EJB to JServer ***
    *** Deployment completed ***
    null

    DB:2.44:Deployment Error cx

    John,

    Thanks for your reply. Unfortunately in this case there is a need to deploy a non gui component that inherits from the javax.swing.DefaultMutableTreeNode. The derived class I have created and need to deploy is TaggedMutableTreeNode and is declared as follows:

    public class TaggedMutableTreeNode extends DefaultMutableTreeNode...

    Anyhow the problem appears to be that the necessary comm stubs are not being generated due to some problem in the way the comm stub generator deals with inheritance. If I change the signatures to just pass DefaultMutableTreeNodes everything is fine.

    Do you know anything about how the comm stub generator handles inheritance?

    Thanks,

    Michael

  • RELEVANCY SCORE 2.44

    DB:2.44:Dynamically Compiling C++ a7


    Is there anyway to dynamically compile C++ files in visual studio 8?
    I know i can use codedom namespace for compiling C# sources but im
    wondering if there is a way to do the same with C++ source files.

    DB:2.44:Dynamically Compiling C++ a7

    create a dummy vc-solution, replace the codefiles with your (dynamically) created ones. then create a process witch runs msbuild.call the created exe file or if you create a library you can dynamically access it (using reflection).

  • RELEVANCY SCORE 2.44

    DB:2.44:Re: Problems Compiling And Running A Servlet 9z


    which IDE are you using??

    You need to add the servlet.jar in your path

    DB:2.44:Re: Problems Compiling And Running A Servlet 9z

    I am working on a project which requires I write a servlet program to receive requests. It is true I am a novice here and isn't this why we have forums?

  • RELEVANCY SCORE 2.43

    DB:2.43:C++ Runtime Linking Problems fa



    Hi

    I'm using the new GOLD SDK 10.0.9.1673 and simulator for C++ dev on BB10 using Mac OS Mountain Lion. I have a problem compiling a library, getting 'memcpy was not delared in this scope errors'. I'm using the C++ Dinkum with exceptions as the runtimelibrary. I have included cstring header. How can I get this code to compile which includes memcpy.

    Thanks

    DB:2.43:C++ Runtime Linking Problems fa


    memcpy() is standard C function and declared in string.h

  • RELEVANCY SCORE 2.43

    DB:2.43:Newbie: Compiling Problems fz


    Hello
     
    I am brand new to C#. Using Visual C# 2008 EE.
    I have a console app that I compile - but I don't know where it goes. I see the the window with the command prompt for a flash then I'm back in Visual C#.
    How do I easily find the exe file to be able to run it?
     
    TIA
     
    Mart

    DB:2.43:Newbie: Compiling Problems fz

     mstabrey wrote:

    Hello
     
    I am brand new to C#. Using Visual C# 2008 EE.
    I have a console app that I compile - but I don't know where it goes. I see the the window with the command prompt for a flash then I'm back in Visual C#.
    How do I easily find the exe file to be able to run it?
     
    TIA
     
    Mart

  • RELEVANCY SCORE 2.43

    DB:2.43:Problems Setting Path On Win Me j1


    I'm new to java. I'm using Win ME. I've set up my Path to C:\Java\jdk1.3.1_01\bin. Keep in mind I have not set up classpath yet. I have saved source file HelloWorldApp.java in C:\javasrc and was successful compiling using "javac HelloWorldApp.java". Now I have a HelloWorldApp.class in C:\javasrc, so I should be able to run this class by typing in "java HelloWorldApp", but I keep getting
    "Error : could not open c:\downloads\bin\lib\i386\jvm.cfg".

    Can someone shed some light as to what this error message means?

    DB:2.43:Problems Setting Path On Win Me j1

    Finally figured out why I got that message. I had downloaded different versions of both sdk and jre so many times that the registry settings in ME were still pointing to an old path. That's what happens when you don't uninstall software properly. For those of you who are getting messages about Registry key 'Software\JavaSoft\Java Runtime Environment ..'" not being current, I suggest updating the JRE registry to the current version by running regedit--HKEY_LOCAL MACHINE--Software--JavaSoft--Java Runtime Environment and change current version to the version you're using. Every time you install jdk/jre, ME automatically creates keys in C:\Program Files for Java Development Kit, Java Plugins and Java Runtime Environment.

    I was able to set PATH and CLASSPATH using the instructions specified at http://java.sun.com/j2se/1.3/install-windows.html#Environment

  • RELEVANCY SCORE 2.43

    DB:2.43:Multicore And Vector Unit Access sx


    Hi,I am considering using XNA Game Studio Express and have a pair of technical questions that I couldn't find an answer for when I searched the forum.1. Is it possible for my C# code to operate on more than 1 of the X-Box360 CPU cores?  I'm not even sure if there is a multi-threading library that will work on X-Box360.2. Is it possible for my C# code to use the PowerPC Vector Units (I think they are called Altivec)?I'm interested in working on some bleeding edge algorithms to see if real performance can be tapped using C# on X-Box.Thanks.

    DB:2.43:Multicore And Vector Unit Access sx

    1: Yes. This uses the standard .NET threading APIs, along with a new
    method in System.Threading.Thread to control which core each thread
    will run on.

    2: No.

  • RELEVANCY SCORE 2.43

    DB:2.43:Problems In Vc Compiling In Winvista jx


    I succesfully used Visual Studio (2005, 2008) on my notebook for a long time. But recently when compiling it appeared that no *.obj files are generated. Then linker says about error no obj files found. After reinstalling VC 2008 Express and even Visual
    Studio 2010 everything repeated (both accurately registered). What may it be, virus or simply something in system (Vista Ultimate) ? Along with it Borland C Builder works successfully as usual. Users accounts control is not activated. Thanks for any help.

    DB:2.43:Problems In Vc Compiling In Winvista jx


    Sam i think you misread the post.The ans was with respect to that till the time we will have no idea what's going on behind picture .we can't help :) as in my post you can see there i mentioned to use cl.exe etc.
    Perhaps I misunderstood, but I know I don't understand what you are trying to say. I understand that you are doing the best you can to communicate in a language that is not your native language; I am not making a judgment, just simply saying I don't understand.
    Sam Hobbs; see my SimpleSamples.Info

  • RELEVANCY SCORE 2.43

    DB:2.43:Forte C++ Compiler For Compiling Pro C pd


    Hi,
    Can Forte C++ compiler be used for Pro*C compilation on Solaris 10. If yes, what would be the steps for compiling the same. I am not looking for the detailed process. Just an overview would suffice.
    Thanks in advance!!

    DB:2.43:Forte C++ Compiler For Compiling Pro C pd

    Hello,

    If you have MetaLink (My Oracle Support) access you may want to check out Note:43208.1 (Certified Compilers).

    Regards,

    Mark

  • RELEVANCY SCORE 2.43

    DB:2.43:Widget Compiling Error! Help! kd



    I am trying to compile my widget using beta2. I get as far as "Start compiling and building..." and then I get the following error:

    java.io.IOException: Cannot run program ""C:\Program" (in directory "C:\Users\MYUSWER~1\AppData\Local\Temp\widgetGen.1​0819749264114361588.tmp"): CreateProcess

    error=206, The filename or extension is too long

    [ERROR]Error happened when running rapc.exe!

    Any ideas?

    DB:2.43:Widget Compiling Error! Help! kd


    That is likely going to vary based on configuration settings that you use for your widget.




    Tim NeilDirector, Application Platform Tools Product ManagementFollow me on Twitter

  • RELEVANCY SCORE 2.43

    DB:2.43:C# Project Compiling Timestamp? 7z


    How do I get C# project compiling timestamp, i.e Tuesday Oct 11, 2005 13:45:23? It's quite easy in C++, but cannot find a hint in C#. Thanks!

  • RELEVANCY SCORE 2.43

    DB:2.43:Compiling Error az


    Hello Everyone,I am getting a compilation error in c++ ,as my window is in 64 bit platform and maya is 32 bit.my question is can we compile a c++ plugin with this difference.

    DB:2.43:Compiling Error az

    Maya forums are in the next section down on the main discussions page - this one is for Max.



    Max 4.2 through 2015 (SP3+EXT2), Composite 2014.Win7Pro x64 (SP1). i5-3570K @ 4.4GHz, 8Gb Ram, DX11.nVidia GTX760 (2GB) (Driver 335.23).

  • RELEVANCY SCORE 2.42

    DB:2.42:Question:How To Use Altivec Lib (Down From Www.Freescale.Com/Altivec)In Environment Of Windriver's Os Vxworks xj



    Hello everyone:

    I want to consult some problems about freescale Altivec lib down from web www.freescale.com/AltiVec.

    First I must introduce my development environment.The development environment is Processor Mpc8641D run in windriver's Os VxWorks6.8 and use Ide workbench 3.2 PPC32_SMP compiler.

    I have downloaded the AltiVec lib form web 'www.freescale.com/AltiVec' ,for example 'LIBMOTOVEC.zip' some algorithm about cossin.But I can't compile the Lib correctly.

    QuestionHelp:How to compile the Lib correctly in my development environment.

    Thanks.

    DB:2.42:Question:How To Use Altivec Lib (Down From Www.Freescale.Com/Altivec)In Environment Of Windriver's Os Vxworks xj


    Hello everyone:

    I want to consult some problems about freescale Altivec lib down from web www.freescale.com/AltiVec.

    First I must introduce my development environment.The development environment is Processor Mpc8641D run in windriver's Os VxWorks6.8 and use Ide workbench 3.2 PPC32_SMP compiler.

    I have downloaded the AltiVec lib form web 'www.freescale.com/AltiVec' ,for example 'LIBMOTOVEC.zip' some algorithm about cossin.But I can't compile the Lib correctly.

    QuestionHelp:How to compile the Lib correctly in my development environment.

    Thanks.

  • RELEVANCY SCORE 2.42

    DB:2.42:Problems Compiling Simulation Libraries In Xps m8



    I'm trying to reproduce the test drives in "EDK Concepts, Tools, and Techniques", but when it comes to simulation, when I try to compile the simulation libraries i get the following errors:

    - Compiling the ISE libraries shows 1 error, but the log file just ends with a "Compiling verilog unisim library ..." and nothing more.

    - Compiling EDK libraries I get lots or errors similar to: "
    Modifying C:\complibe\modelsim.iniExecuting: vcom -93 -quiet -work util_flipflop_v1_10_a -f C:/complibe/CompileListFiles/util_flipflop_v1_10_a​_compile_order** Error: C:/EDK/hw/XilinxProcessorIPLib/pcores/util_flipflo​p_v1_10_a/hdl/vhdl/util_flipflop.vhd(76): Library unisim not found.** Error: C:/EDK/hw/XilinxProcessorIPLib/pcores/util_flipflo​p_v1_10_a/hdl/vhdl/util_flipflop.vhd(77): (vcom-1136) Unknown identifier "unisim".** Error: C:/EDK/hw/XilinxProcessorIPLib/pcores/util_flipflo​p_v1_10_a/hdl/vhdl/util_flipflop.vhd(79): VHDL Compiler exitingERROR:: Failed to execute vcom -93 -quiet -work util_flipflop_v1_10_a -f C:/complibe/CompileListFiles/util_flipflop_v1_10_a​_compile_order : Compiling microblaze_v5_00_cExecuting: unzip -q -o C:/EDK/hw/XilinxProcessorIPLib/pcores/microblaze_v​5_00_c/simmodels/mti_vhdl.zip -d C:/complibe

    But I still can generate Simulation HDL files succesfully. Then I run ModelSim and type "c" and everything seems to run OK until I get "

    # -- Loading package std_logic_1164# ** Error: (vcom-11) Could not find proc_common_v2_00_a.inferred_lut4.# ** Error: C:/EDK/hw/XilinxProcessorIPLib/pcores/wrpfifo_v1_0​1_b/hdl/vhdl/pf_dly1_mux.vhd(96): (vcom-1195) Cannot find expanded name "proc_common_v2_00_a.inferred_lut4".# -- Loading package vcomponents# ** Error: C:/EDK/hw/XilinxProcessorIPLib/pcores/wrpfifo_v1_0​1_b/hdl/vhdl/pf_dly1_mux.vhd(107): VHDL Compiler exiting# ** Error: D:/Modeltech_pe_edu_6.4b/win32pe_edu/vcom failed.# Error in macro ./system.do line 70# D:/Modeltech_pe_edu_6.4b/win32pe_edu/vcom failed."

    I use ISE and EDK 9.1 updated to the latest SPs, and ModelSim PE Student Edition 6.4b.

    Any kind of help would be appreciated.

    DB:2.42:Problems Compiling Simulation Libraries In Xps m8


    I'm trying to reproduce the test drives in "EDK Concepts, Tools, and Techniques", but when it comes to simulation, when I try to compile the simulation libraries i get the following errors:

    - Compiling the ISE libraries shows 1 error, but the log file just ends with a "Compiling verilog unisim library ..." and nothing more.

    - Compiling EDK libraries I get lots or errors similar to: "
    Modifying C:\complibe\modelsim.iniExecuting: vcom -93 -quiet -work util_flipflop_v1_10_a -f C:/complibe/CompileListFiles/util_flipflop_v1_10_a​_compile_order** Error: C:/EDK/hw/XilinxProcessorIPLib/pcores/util_flipflo​p_v1_10_a/hdl/vhdl/util_flipflop.vhd(76): Library unisim not found.** Error: C:/EDK/hw/XilinxProcessorIPLib/pcores/util_flipflo​p_v1_10_a/hdl/vhdl/util_flipflop.vhd(77): (vcom-1136) Unknown identifier "unisim".** Error: C:/EDK/hw/XilinxProcessorIPLib/pcores/util_flipflo​p_v1_10_a/hdl/vhdl/util_flipflop.vhd(79): VHDL Compiler exitingERROR:: Failed to execute vcom -93 -quiet -work util_flipflop_v1_10_a -f C:/complibe/CompileListFiles/util_flipflop_v1_10_a​_compile_order : Compiling microblaze_v5_00_cExecuting: unzip -q -o C:/EDK/hw/XilinxProcessorIPLib/pcores/microblaze_v​5_00_c/simmodels/mti_vhdl.zip -d C:/complibe

    But I still can generate Simulation HDL files succesfully. Then I run ModelSim and type "c" and everything seems to run OK until I get "

    # -- Loading package std_logic_1164# ** Error: (vcom-11) Could not find proc_common_v2_00_a.inferred_lut4.# ** Error: C:/EDK/hw/XilinxProcessorIPLib/pcores/wrpfifo_v1_0​1_b/hdl/vhdl/pf_dly1_mux.vhd(96): (vcom-1195) Cannot find expanded name "proc_common_v2_00_a.inferred_lut4".# -- Loading package vcomponents# ** Error: C:/EDK/hw/XilinxProcessorIPLib/pcores/wrpfifo_v1_0​1_b/hdl/vhdl/pf_dly1_mux.vhd(107): VHDL Compiler exiting# ** Error: D:/Modeltech_pe_edu_6.4b/win32pe_edu/vcom failed.# Error in macro ./system.do line 70# D:/Modeltech_pe_edu_6.4b/win32pe_edu/vcom failed."

    I use ISE and EDK 9.1 updated to the latest SPs, and ModelSim PE Student Edition 6.4b.

    Any kind of help would be appreciated.

  • RELEVANCY SCORE 2.42

    DB:2.42:Compiling C/C++ Code With Accessbridge Api pf


    Hi,

    I have downloaded accessBridge 1.0.4 and followed the instruction, I was able to run its examples javaFerret javaMonkey with no problems. Now I want to make use of accessBridge api in my program. Can someone please guide me how to do this. I think I have to link with WindowsAccessBridge.dll and include accessbridgecalls.h file need to compile accessbridgecalls.c, but I am getting compiler errors as I am trying to compile this in c++ project (vc++).

    Can someone help me.

    Thanks,
    Ram

    DB:2.42:Compiling C/C++ Code With Accessbridge Api pf

    Infact I dont have AccessBridgeCalls.c file, I searched in the net but couldnt locate anywhere. In the documentation it was mentioned that AcessBridgeCalls.c file need to be compiled and linked with WindowsAccessBridge.dll to use Access Bridge api in the code such as initializeAccessBridge, IsJavaWindow, etc.,

    Does anyone know where to get AccessBridgeCalls.c file in the net..

    Thanks,
    Ram

  • RELEVANCY SCORE 2.42

    DB:2.42:Simulation Compile Error Of Example Design File pj



    I face simulation error for compiling the example design file ofAC701 board ----ac701-pcie-rdf0225-2013.2-c,

    does anyone have this error and help me solve it?

    Thanks a lot

    OS: winXP--x64 32 bit

    Tool:Vivado 2013.2

    Compiling module secureip.xil_pcie_fuji_mod3(TIEOFF="1",T_...Compiling module secureip.xil_pcie_fuji_mod3(TIEOFF="1",T_...Compiling module secureip.xil_pcie_fuji_mod3(TIEOFF="0",T_...Compiling module secureip.xil_pcie_fuji_mod3(TIEOFF="0",T_...Compiling module secureip.xil_pcie_fuji_mod3(TIEOFF="0",T_...Compiling module secureip.xil_pcie_fuji_mod3(TIEOFF="0",T_...Compiling module secureip.xil_pcie_fuji_mod3(TIEOFF="0",T_...Compiling module secureip.xil_pcie_fuji_mod3(TIEOFF="0",T_...Compiling module secureip.xil_pcie_fuji_mod3(TIEOFF="0",T_...Compiling module secureip.xil_pcie_fuji_mod3(TIEOFF="0",T_...Compiling module secureip.xil_pcie_fuji_mod3(TIEOFF="1",T_...Compiling module secureip.xil_pcie_fuji_mod3(TIEOFF="1",T_...Compiling module secureip.xil_pcie_fuji_mod3(TIEOFF="1",T_...Compiling module secureip.xil_pcie_fuji_mod3(TIEOFF="1",T_...Compiling module secureip.xil_pcie_fuji_mod3(TIEOFF="0",T_...Compiling module secureip.xil_pcie_fuji_mod3(TIEOFF="0",T_...Compiling module secureip.xil_pcie_fuji_mod3(TIEOFF="0",T_...Compiling module secureip.xil_pcie_fuji_mod3(TIEOFF="0",T_...Compiling module secureip.xil_pcie_fuji_mod3(TIEOFF="0",T_...Compiling module secureip.xil_pcie_fuji_mod3(TIEOFF="1",T_...Compiling module secureip.xil_pcie_fuji_mod3(TIEOFF="1",T_...Compiling module secureip.xil_pcie_fuji_mod3(TIEOFF="1",T_...Compiling module secureip.xil_pcie_fuji_mod3(TIEOFF="1",T_...Compiling module secureip.xil_pcie_fuji_mod3(TIEOFF="0",T_...Compiling module secureip.xil_pcie_fuji_mod3(TIEOFF="0",T_...Compiling module secureip.xil_pcie_fuji_mod3(TIEOFF="1",T_...Compiling module secureip.xil_pcie_fuji_mod3(TIEOFF="0",T_...Compiling module secureip.xil_pcie_fuji_mod3(TIEOFF="0",T_...Compiling module secureip.xil_pcie_fuji_mod3(TIEOFF="0",T_...Compiling module secureip.xil_pcie_fuji_mod3(TIEOFF="0",T_...Compiling module secureip.xil_pcie_fuji_mod3(TIEOFF="0",T_...Compiling module secureip.xil_pcie_fuji_mod3(TIEOFF="1",T_...Compiling module secureip.xil_pcie_fuji_mod3(TIEOFF="1",T_...Compiling module secureip.xil_pcie_fuji_mod3(TIEOFF="1",T_...Compiling module secureip.xil_pcie_fuji_mod3(TIEOFF="0",T_...Compiling module secureip.xil_pcie_fuji_mod3(TIEOFF="0",T_...Compiling module secureip.xil_pcie_fuji_mod3(TIEOFF="0",T_...Compiling module secureip.xil_pcie_fuji_mod3(TIEOFF="0",T_...Compiling module secureip.xil_pcie_fuji_mod3(TIEOFF="0",T_...Compiling module secureip.xil_pcie_fuji_mod3(TIEOFF="0",T_...Compiling module secureip.xil_pcie_fuji_mod3(TIEOFF="1",T_...Compiling module secureip.xil_pcie_fuji_mod3(TIEOFF="0",T_...Compiling module secureip.xil_pcie_fuji_mod3(TIEOFF="0",T_...Compiling module secureip.xil_pcie_fuji_mod3(TIEOFF="1",T_...Compiling module secureip.xil_pcie_fuji_mod3(TIEOFF="1",T_...Compiling module secureip.xil_pcie_fuji_mod3(TIEOFF="DoNot...Compiling module secureip.xil_pcie_fuji_mod3(TIEOFF="1",T_...Compiling module secureip.xil_pcie_fuji_mod3(TIEOFF="1",T_...Compiling module secureip.xil_pcie_fuji_mod3(TIEOFF="1",T_...Compiling module secureip.xil_pcie_fuji_mod3(TIEOFF="1",T_...Compiling module secureip.xil_pcie_fuji_mod3(TIEOFF="1",T_...Compiling module secureip.xil_pcie_fuji_mod3(TIEOFF="0",T_...Compiling module secureip.xil_pcie_fuji_mod3(TIEOFF="0",T_...Compiling module secureip.xil_pcie_fuji_mod3(TIEOFF="0",T_...Compiling module secureip.xil_pcie_fuji_mod3(TIEOFF="0",T_...Compiling module secureip.xil_pcie_fuji_mod3(TIEOFF="1",T_...Compiling module secureip.xil_pcie_fuji_mod3(TIEOFF="1",T_...Compiling module secureip.xil_pcie_fuji_mod3(TIEOFF="1",T_...Compiling module secureip.xil_pcie_fuji_mod3(TIEOFF="1",T_...Compiling module secureip.xil_pcie_fuji_mod3(TIEOFF="1",T_...Compiling module secureip.xil_pcie_fuji_mod3(TIEOFF="1",T_...Compiling module secureip.xil_pcie_fuji_mod3(TIEOFF="DoNot...Compiling module secureip.xil_pcie_fuji_mod3(TIEOFF="1",T_...Compiling module secureip.xil_pcie_fuji_mod3(TIEOFF="0",T_...Compiling module secureip.xil_pcie_fuji_mod3(TIEOFF="0",T_...Compiling module secureip.xil_pcie_fuji_mod3(TIEOFF="0",T_...Compiling module secureip.xil_pcie_fuji_mod3(TIEOFF="0",T_...Compiling module secureip.xil_pcie_fuji_mod3(TIEOFF="1",T_...Compiling module secureip.xil_pcie_fuji_mod3(TIEOFF="1",T_...Compiling module secureip.xil_pcie_fuji_mod3(TIEOFF="DoNot...Compiling module secureip.xil_pcie_fuji_mod3(TIEOFF="1",T_...Compiling module secureip.xil_pcie_fuji_mod3(TIEOFF="0",T_...Compiling module secureip.xil_pcie_fuji_mod3(TIEOFF="0",T_...Compiling module secureip.xil_pcie_fuji_mod3(TIEOFF="1",T_...Compiling module secureip.xil_pcie_fuji_mod3(TIEOFF="0",T_...Compiling module secureip.xil_pcie_fuji_mod3(TIEOFF="0",T_...Compiling module secureip.xil_pcie_fuji_mod3(TIEOFF="0",T_...Compiling module secureip.xil_pcie_fuji_mod3(TIEOFF="0",T_...Compiling module secureip.xil_pcie_fuji_mod3(TIEOFF="0",T_...Compiling module secureip.xil_pcie_fuji_mod3(TIEOFF="1",T_...Compiling module secureip.xil_pcie_fuji_mod3(TIEOFF="1",T_...Compiling module secureip.xil_pcie_fuji_mod3(TIEOFF="1",T_...Compiling module secureip.xil_pcie_fuji_mod3(TIEOFF="1",T_...Compiling module secureip.xil_pcie_fuji_mod3(TIEOFF="DoNot...Compiling module secureip.xil_pcie_fuji_mod3(TIEOFF="0",T_...Compiling module secureip.xil_pcie_fuji_mod3(TIEOFF="0",T_...Compiling module secureip.xil_pcie_fuji_mod3(TIEOFF="0",T_...Compiling module secureip.xil_pcie_fuji_mod3(TIEOFF="0",T_...Compiling module secureip.xil_pcie_fuji_mod3(TIEOFF="1",T_...Compiling module secureip.xil_pcie_fuji_mod3(TIEOFF="0",T_...Compiling module secureip.xil_pcie_fuji_mod3(TIEOFF="0",T_...Compiling module secureip.xil_pcie_fuji_mod3(TIEOFF="1",T_...Compiling module secureip.xil_pcie_fuji_mod3(TIEOFF="1",T_...Compiling module secureip.xil_pcie_fuji_mod3(TIEOFF="1",T_...Compiling module secureip.xil_pcie_fuji_mod3(TIEOFF="1",T_...Compiling module secureip.xil_pcie_fuji_mod3(TIEOFF="1",T_...Compiling module secureip.xil_pcie_fuji_mod3(TIEOFF="1",T_...Compiling module secureip.xil_pcie_fuji_mod3(TIEOFF="1",T_...Compiling module secureip.xil_pcie_fuji_mod3(TIEOFF="DoNot...Compiling module secureip.xil_pcie_fuji_mod3(TIEOFF="0",T_...Compiling module secureip.xil_pcie_fuji_mod3(TIEOFF="0",T_...Compiling module secureip.xil_pcie_fuji_mod3(TIEOFF="0",T_...Compiling module secureip.xil_pcie_fuji_mod3(TIEOFF="0",T_...Compiling module secureip.xil_pcie_fuji_mod3(TIEOFF="1",T_...Compiling module secureip.xil_pcie_fuji_mod3(TIEOFF="1",T_...Compiling module secureip.xil_pcie_fuji_mod3(TIEOFF="1",T_...Compiling module secureip.xil_pcie_fuji_mod3(TIEOFF="1",T_...Compiling module secureip.xil_pcie_fuji_mod3(TIEOFF="1",T_...Compiling module secureip.xil_pcie_fuji_mod3(TIEOFF="1",T_...Compiling module secureip.xil_pcie_fuji_mod3(TIEOFF="DoNot...Compiling module secureip.xil_pcie_fuji_mod3(TIEOFF="1",T_...Compiling module secureip.xil_pcie_fuji_mod3(TIEOFF="1",T_...Compiling module secureip.xil_pcie_fuji_mod3(TIEOFF="0",T_...Compiling module secureip.xil_pcie_fuji_mod3(TIEOFF="0",T_...Compiling module secureip.xil_pcie_fuji_mod3(TIEOFF="0",T_...Compiling module secureip.xil_pcie_fuji_mod3(TIEOFF="1",T_...Compiling module secureip.xil_pcie_fuji_mod3(TIEOFF="1",T_...Compiling module secureip.xil_pcie_fuji_mod3(TIEOFF="1",T_...Compiling module secureip.xil_pcie_fuji_mod3(TIEOFF="1",T_...Compiling module secureip.xil_pcie_fuji_mod3(TIEOFF="1",T_...Compiling module secureip.xil_pcie_fuji_mod3(TIEOFF="1",T_...Compiling module secureip.xil_pcie_fuji_mod3(TIEOFF="1",T_...Compiling module secureip.xil_pcie_fuji_mod3(TIEOFF="1",T_...Compiling module secureip.xil_pcie_fuji_mod3(TIEOFF="1",T_...Compiling module secureip.xil_pcie_fuji_mod3(TIEOFF="DoNot...Compiling module secureip.xil_pcie_fuji_mod3(TIEOFF="0",T_...Compiling module secureip.xil_pcie_fuji_mod3(TIEOFF="0",T_...Compiling module secureip.xil_pcie_fuji_mod3(TIEOFF="0",T_...Compiling module secureip.xil_pcie_fuji_mod3(TIEOFF="0",T_...Compiling module secureip.xil_pcie_fuji_mod3(TIEOFF="0",T_...Compiling module secureip.xil_pcie_fuji_mod3(TIEOFF="0",T_...Compiling module secureip.xil_pcie_fuji_mod3(TIEOFF="0",T_...Compiling module secureip.xil_pcie_fuji_mod3(TIEOFF="DoNot...Compiling module secureip.xil_pcie_fuji_mod3(TIEOFF="0",T_...Compiling module secureip.xil_pcie_fuji_mod3(TIEOFF="0",T_...Compiling module secureip.xil_pcie_fuji_mod3(TIEOFF="0",T_...Compiling module secureip.xil_pcie_fuji_mod3(TIEOFF="0",T_...Compiling module secureip.xil_pcie_fuji_mod3(TIEOFF="1",T_...Compiling module secureip.xil_pcie_fuji_mod3(TIEOFF="1",T_...Compiling module secureip.xil_pcie_fuji_mod3(TIEOFF="1",T_...Compiling module secureip.xil_pcie_fuji_mod3(TIEOFF="1",T_...Compiling module secureip.xil_pcie_fuji_mod3(TIEOFF="0",T_...Compiling module secureip.xil_pcie_fuji_mod3(TIEOFF="0",T_...Compiling module secureip.xil_pcie_fuji_mod3(TIEOFF="0",T_...Compiling module secureip.xil_pcie_fuji_mod3(TIEOFF="0",T_...Compiling module secureip.xil_pcie_fuji_mod3(TIEOFF="0",T_...Compiling module secureip.xil_pcie_fuji_mod3(TIEOFF="0",T_...Compiling module secureip.xil_pcie_fuji_mod3(TIEOFF="0",T_...Compiling module secureip.xil_pcie_fuji_mod3(TIEOFF="0",T_...Compiling module secureip.xil_pcie_fuji_mod3(TIEOFF="0",T_...Compiling module secureip.xil_pcie_fuji_mod3(TIEOFF="0",T_...Compiling module secureip.xil_pcie_fuji_mod3(TIEOFF="0",T_...Compiling module secureip.xil_pcie_fuji_mod3(TIEOFF="0",T_...Compiling module secureip.xil_pcie_fuji_mod3(TIEOFF="0",T_...Compiling module secureip.xil_pcie_fuji_mod3(TIEOFF="0",T_...Compiling module secureip.xil_pcie_fuji_mod3(TIEOFF="0",T_...Compiling module secureip.xil_pcie_fuji_mod3(TIEOFF="0",T_...Compiling module secureip.xil_pcie_fuji_mod3(TIEOFF="0",T_...Compiling module secureip.xil_pcie_fuji_mod3(TIEOFF="0",T_...Compiling module secureip.xil_pcie_fuji_mod3(TIEOFF="0",T_...Compiling module secureip.xil_pcie_fuji_mod3(TIEOFF="0",T_...Compiling module secureip.xil_pcie_fuji_mod3(TIEOFF="0",T_...Compiling module secureip.xil_pcie_fuji_mod3(TIEOFF="0",T_...Compiling module secureip.xil_pcie_fuji_mod3(TIEOFF="1",T_...Compiling module secureip.xil_pcie_fuji_mod3(TIEOFF="0",T_...Compiling module secureip.xil_pcie_fuji_mod3(TIEOFF="0",T_...Compiling module secureip.xil_pcie_fuji_mod3(TIEOFF="0",T_...Compiling module secureip.xil_pcie_fuji_mod3(TIEOFF="0",T_...Compiling module secureip.xil_pcie_fuji_mod3(TIEOFF="0",T_...Compiling module secureip.xil_pcie_fuji_mod3(TIEOFF="0",T_...Compiling module secureip.xil_pcie_fuji_mod3(TIEOFF="0",T_...Compiling module secureip.xil_pcie_fuji_mod3(TIEOFF="0",T_...Compiling module secureip.xil_pcie_fuji_mod3(TIEOFF="0",T_...Compiling module secureip.xil_pcie_fuji_mod3(TIEOFF="1",T_...Compiling module secureip.xil_pcie_fuji_mod3(TIEOFF="0",T_...Compiling module secureip.xil_pcie_fuji_mod3(TIEOFF="1",T_...Compiling module secureip.xil_pcie_fuji_mod3(TIEOFF="0",T_...Compiling module secureip.xil_pcie_fuji_mod3(TIEOFF="1",T_...Compiling module secureip.xil_pcie_fuji_mod3(TIEOFF="1",T_...Compiling module secureip.xil_pcie_fuji_mod3(TIEOFF="1",T_...Compiling module secureip.xil_pcie_fuji_mod3(TIEOFF="1",T_...Compiling module secureip.xil_pcie_fuji_mod3(TIEOFF="0",T_...Compiling module secureip.xil_pcie_fuji_mod3(TIEOFF="0",T_...Compiling module secureip.xil_pcie_fuji_mod3(TIEOFF="0",T_...Compiling module secureip.xil_pcie_fuji_mod3(TIEOFF="0",T_...Compiling module secureip.xil_pcie_fuji_mod3(TIEOFF="1",T_...Compiling module secureip.xil_pcie_fuji_mod3(TIEOFF="1",T_...Compiling module secureip.xil_pcie_fuji_mod3(TIEOFF="1",T_...Compiling module secureip.xil_pcie_fuji_mod3(TIEOFF="1",T_...Compiling module secureip.xil_pcie_fuji_mod3(TIEOFF="1",T_...Compiling module secureip.xil_pcie_fuji_mod3(TIEOFF="1",T_...Compiling module secureip.xil_pcie_fuji_mod3(TIEOFF="0",T_...Compiling module secureip.xil_pcie_fuji_mod3(TIEOFF="0",T_...Compiling module secureip.xil_pcie_fuji_mod3(TIEOFF="0",T_...Compiling module secureip.xil_pcie_fuji_mod3(TIEOFF="0",T_...Compiling module secureip.xil_pcie_fuji_mod3(TIEOFF="1",T_...Compiling module secureip.xil_pcie_fuji_mod3(TIEOFF="1",T_...Compiling module secureip.xil_pcie_fuji_mod3(TIEOFF="1",T_...Compiling module secureip.xil_pcie_fuji_mod3(TIEOFF="1",T_...Compiling module secureip.xil_pcie_fuji_mod3(TIEOFF="1",T_...Compiling module secureip.xil_pcie_fuji_mod3(TIEOFF="1",T_...Compiling module secureip.xil_pcie_fuji_mod3(TIEOFF="0",T_...Compiling module secureip.xil_pcie_fuji_mod3(TIEOFF="0",T_...Compiling module secureip.xil_pcie_fuji_mod3(TIEOFF="0",T_...Compiling module secureip.xil_pcie_fuji_mod3(TIEOFF="0",T_...Compiling module secureip.xil_pcie_fuji_mod3(TIEOFF="1",T_...Compiling module secureip.xil_pcie_fuji_mod3(TIEOFF="1",T_...Compiling module secureip.xil_pcie_fuji_mod3(TIEOFF="1",T_...Compiling module secureip.xil_pcie_fuji_mod3(TIEOFF="1",T_...Compiling module secureip.xil_pcie_fuji_mod3(TIEOFF="1",T_...Compiling module secureip.xil_pcie_fuji_mod3(TIEOFF="1",T_...Compiling module secureip.xil_pcie_fuji_mod3(TIEOFF="0",T_...Compiling module secureip.xil_pcie_fuji_mod3(TIEOFF="0",T_...Compiling module secureip.xil_pcie_fuji_mod3(TIEOFF="0",T_...Compiling module secureip.xil_pcie_fuji_mod3(TIEOFF="0",T_...Compiling module secureip.xil_pcie_fuji_mod3(TIEOFF="1",T_...Compiling module secureip.xil_pcie_fuji_mod3(TIEOFF="1",T_...Compiling module secureip.xil_pcie_fuji_mod3(TIEOFF="1",T_...Compiling module secureip.xil_pcie_fuji_mod3(TIEOFF="1",T_...Compiling module secureip.xil_pcie_fuji_mod3(TIEOFF="1",T_...Compiling module secureip.xil_pcie_fuji_mod3(TIEOFF="1",T_...Compiling module secureip.xil_pcie_fuji_mod3(TIEOFF="0",T_...Compiling module secureip.xil_pcie_fuji_mod3(TIEOFF="0",T_...Compiling module secureip.xil_pcie_fuji_mod3(TIEOFF="0",T_...Compiling module secureip.xil_pcie_fuji_mod3(TIEOFF="0",T_...Compiling module secureip.xil_pcie_fuji_mod3(TIEOFF="0",T_...Compiling module secureip.xil_pcie_fuji_mod3(TIEOFF="0",T_...Compiling module secureip.xil_pcie_fuji_mod3(TIEOFF="1",T_...Compiling module secureip.xil_pcie_fuji_mod3(TIEOFF="1",T_...Compiling module secureip.xil_pcie_fuji_mod3(TIEOFF="1",T_...Compiling module secureip.xil_pcie_fuji_mod3(TIEOFF="1",T_...Compiling module secureip.xil_pcie_fuji_mod3(TIEOFF="0",T_...Compiling module secureip.xil_pcie_fuji_mod3(TIEOFF="0",T_...Compiling module secureip.xil_pcie_fuji_mod3(TIEOFF="0",T_...Compiling module secureip.xil_pcie_fuji_mod3(TIEOFF="0",T_...Compiling module secureip.xil_pcie_fuji_mod3(TIEOFF="0",T_...Compiling module secureip.xil_pcie_fuji_mod3(TIEOFF="0",T_...Compiling module secureip.xil_pcie_fuji_mod3(TIEOFF="1",T_...Compiling module secureip.xil_pcie_fuji_mod3(TIEOFF="1",T_...Compiling module secureip.xil_pcie_fuji_mod3(TIEOFF="1",T_...Compiling module secureip.xil_pcie_fuji_mod3(TIEOFF="1",T_...Compiling module secureip.xil_pcie_fuji_mod3(TIEOFF="0",T_...Compiling module secureip.xil_pcie_fuji_mod3(TIEOFF="0",T_...Compiling module secureip.xil_pcie_fuji_mod3(TIEOFF="0",T_...Compiling module secureip.xil_pcie_fuji_mod3(TIEOFF="0",T_...Compiling module secureip.xil_pcie_fuji_mod3(TIEOFF="0",T_...Compiling module secureip.xil_pcie_fuji_mod3(TIEOFF="0",T_...Compiling module secureip.xil_pcie_fuji_mod3(TIEOFF="1",T_...Compiling module secureip.xil_pcie_fuji_mod3(TIEOFF="1",T_...Compiling module secureip.xil_pcie_fuji_mod3(TIEOFF="1",T_...Compiling module secureip.xil_pcie_fuji_mod3(TIEOFF="1",T_...Compiling module secureip.xil_pcie_fuji_mod3(TIEOFF="0",T_...Compiling module secureip.xil_pcie_fuji_mod3(TIEOFF="0",T_...Compiling module secureip.xil_pcie_fuji_mod3(TIEOFF="0",T_...Compiling module secureip.xil_pcie_fuji_mod3(TIEOFF="0",T_...Compiling module secureip.xil_pcie_fuji_mod3(TIEOFF="0",T_...Compiling module secureip.xil_pcie_fuji_mod3(TIEOFF="0",T_...Compiling module secureip.xil_pcie_fuji_mod3(TIEOFF="1",T_...Compiling module secureip.xil_pcie_fuji_mod3(TIEOFF="1",T_...Compiling module secureip.xil_pcie_fuji_mod3(TIEOFF="1",T_...Compiling module secureip.xil_pcie_fuji_mod3(TIEOFF="1",T_...Compiling module secureip.xil_pcie_fuji_mod3(TIEOFF="0",T_...Compiling module secureip.xil_pcie_fuji_mod3(TIEOFF="0",T_...Compiling module secureip.xil_pcie_fuji_mod3(TIEOFF="0",T_...Compiling module secureip.xil_pcie_fuji_mod3(TIEOFF="0",T_...Compiling module secureip.xil_pcie_fuji_mod3(TIEOFF="0",T_...Compiling module secureip.xil_pcie_fuji_mod3(TIEOFF="0",T_...Compiling module secureip.xil_pcie_fuji_mod3(TIEOFF="0",T_...Compiling module secureip.xil_pcie_fuji_mod3(TIEOFF="1",T_...Compiling module secureip.xil_pcie_fuji_mod3(TIEOFF="0",T_...Compiling module secureip.xil_pcie_fuji_mod3(TIEOFF="1",T_...Compiling module secureip.xil_pcie_fuji_mod3(TIEOFF="0",T_...Compiling module secureip.xil_pcie_fuji_mod3(TIEOFF="0",T_...Compiling module secureip.xil_pcie_fuji_mod3(TIEOFF="0",T_...Compiling module secureip.xil_pcie_fuji_mod3(TIEOFF="0",T_...Compiling module secureip.xil_pcie_fuji_mod3(TIEOFF="0",T_...Compiling module secureip.xil_pcie_fuji_mod3(TIEOFF="0",T_...Compiling module secureip.xil_pcie_fuji_mod3(TIEOFF="0",T_...Compiling module secureip.xil_pcie_fuji_mod3(TIEOFF="0",T_...Compiling module secureip.xil_pcie_fuji_mod3(TIEOFF="0",T_...Compiling module secureip.xil_pcie_fuji_mod3(TIEOFF="0",T_...Compiling module secureip.xil_pcie_fuji_mod3(TIEOFF="0",T_...Compiling module secureip.xil_pcie_fuji_mod3(TIEOFF="0",T_...Compiling module secureip.xil_pcie_fuji_mod3(TIEOFF="0",T_...Compiling module secureip.xil_pcie_fuji_mod3(TIEOFF="0",T_...Compiling module secureip.xil_pcie_fuji_mod3(TIEOFF="0",T_...Compiling module secureip.xil_pcie_fuji_mod3(TIEOFF="0",T_...Compiling module secureip.xil_pcie_fuji_mod3(TIEOFF="0",T_...Compiling module secureip.xil_pcie_fuji_mod3(TIEOFF="0",T_...Compiling module secureip.xil_pcie_fuji_mod3(TIEOFF="0",T_...Compiling module secureip.xil_pcie_fuji_mod3(TIEOFF="0",T_...Compiling module secureip.xil_pcie_fuji_mod3(TIEOFF="0",T_...Compiling module secureip.xil_pcie_fuji_mod3(TIEOFF="0",T_...Compiling module secureip.xil_pcie_fuji_mod3(TIEOFF="0",T_...Compiling module secureip.xil_pcie_fuji_mod3(TIEOFF="0",T_...Compiling module secureip.xil_pcie_fuji_mod3(TIEOFF="0",T_...Compiling module secureip.xil_pcie_fuji_mod3(TIEOFF="0",T_...Compiling module secureip.xil_pcie_fuji_mod3(TIEOFF="1",T_...Compiling module secureip.xil_pcie_fuji_mod3(TIEOFF="1",T_...Compiling module secureip.xil_pcie_fuji_mod3(TIEOFF="0",T_...Compiling module secureip.xil_pcie_fuji_mod3(TIEOFF="0",T_...Compiling module secureip.xil_pcie_fuji_mod3(TIEOFF="1",T_...Compiling module secureip.xil_pcie_fuji_mod3(TIEOFF="1",T_...Compiling module secureip.xil_pcie_fuji_mod3(TIEOFF="0",T_...Compiling module secureip.xil_pcie_fuji_mod3(TIEOFF="0",T_...Compiling module secureip.xil_pcie_fuji_mod3(TIEOFF="1",T_...Compiling module secureip.xil_pcie_fuji_mod3(TIEOFF="1",T_...Compiling module secureip.xil_pcie_fuji_mod3(TIEOFF="0",T_...Compiling module secureip.xil_pcie_fuji_mod3(TIEOFF="0",T_...Compiling module secureip.xil_pcie_fuji_mod3(TIEOFF="1",T_...Compiling module secureip.xil_pcie_fuji_mod3(TIEOFF="1",T_...Compiling module secureip.xil_pcie_fuji_mod3(TIEOFF="1",T_...Compiling module secureip.xil_pcie_fuji_mod3(TIEOFF="1",T_...Compiling module secureip.xil_pcie_fuji_mod3(TIEOFF="0",T_...Compiling module secureip.xil_pcie_fuji_mod3(TIEOFF="0",T_...Compiling module secureip.xil_pcie_fuji_mod3(TIEOFF="0",T_...Compiling module secureip.xil_pcie_fuji_mod3(TIEOFF="0",T_...Compiling module secureip.xil_pcie_fuji_mod3(TIEOFF="0",T_...Compiling module secureip.xil_pcie_fuji_mod3(TIEOFF="0",T_...Compiling module secureip.xil_pcie_fuji_mod3(TIEOFF="1",T_...Compiling module secureip.xil_pcie_fuji_mod3(TIEOFF="1",T_...Compiling module secureip.xil_pcie_fuji_mod3(TIEOFF="1",T_...Compiling module secureip.xil_pcie_fuji_mod3(TIEOFF="1",T_...Compiling module secureip.xil_pcie_fuji_mod3(TIEOFF="0",T_...Compiling module secureip.xil_pcie_fuji_mod3(TIEOFF="0",T_...Compiling module secureip.xil_pcie_fuji_mod3(TIEOFF="0",T_...Compiling module secureip.xil_pcie_fuji_mod3(TIEOFF="0",T_...Compiling module secureip.xil_pcie_fuji_mod3(TIEOFF="0",T_...Compiling module secureip.xil_pcie_fuji_mod3(TIEOFF="0",T_...Compiling module secureip.xil_pcie_fuji_mod3(TIEOFF="1",T_...Compiling module secureip.xil_pcie_fuji_mod3(TIEOFF="1",T_...Compiling module secureip.xil_pcie_fuji_mod3(TIEOFF="1",T_...Compiling module secureip.xil_pcie_fuji_mod3(TIEOFF="1",T_...Compiling module secureip.xil_pcie_fuji_mod3(TIEOFF="0",T_...Compiling module secureip.xil_pcie_fuji_mod3(TIEOFF="0",T_...Compiling module secureip.xil_pcie_fuji_mod3(TIEOFF="0",T_...Compiling module secureip.xil_pcie_fuji_mod3(TIEOFF="0",T_...Compiling module secureip.xil_pcie_fuji_mod3(TIEOFF="0",T_...Compiling module secureip.xil_pcie_fuji_mod3(TIEOFF="0",T_...Compiling module secureip.xil_pcie_fuji_mod3(TIEOFF="1",T_...Compiling module secureip.xil_pcie_fuji_mod3(TIEOFF="1",T_...Compiling module secureip.xil_pcie_fuji_mod3(TIEOFF="1",T_...Compiling module secureip.xil_pcie_fuji_mod3(TIEOFF="1",T_...Compiling module secureip.xil_pcie_fuji_mod3(TIEOFF="0",T_...Compiling module secureip.xil_pcie_fuji_mod3(TIEOFF="0",T_...Compiling module secureip.xil_pcie_fuji_mod3(TIEOFF="0",T_...Compiling module secureip.xil_pcie_fuji_mod3(TIEOFF="0",T_...Compiling module secureip.xil_pcie_fuji_mod3(TIEOFF="0",T_...Compiling module secureip.xil_pcie_fuji_mod3(TIEOFF="0",T_...Compiling module secureip.xil_pcie_fuji_mod3(TIEOFF="1",T_...Compiling module secureip.xil_pcie_fuji_mod3(TIEOFF="1",T_...Compiling module secureip.xil_pcie_fuji_mod3(TIEOFF="1",T_...Compiling module secureip.xil_pcie_fuji_mod3(TIEOFF="1",T_...Compiling module secureip.xil_pcie_fuji_mod3(TIEOFF="0",T_...Compiling module secureip.xil_pcie_fuji_mod3(TIEOFF="0",T_...Compiling module secureip.xil_pcie_fuji_mod3(TIEOFF="0",T_...Compiling module secureip.xil_pcie_fuji_mod3(TIEOFF="0",T_...Compiling module secureip.xil_pcie_fuji_mod3(TIEOFF="0",T_...Compiling module secureip.xil_pcie_fuji_mod3(TIEOFF="0",T_...Compiling module secureip.xil_pcie_fuji_mod3(TIEOFF="1",T_...Compiling module secureip.xil_pcie_fuji_mod3(TIEOFF="1",T_...Compiling module secureip.xil_pcie_fuji_mod3(TIEOFF="1",T_...Compiling module secureip.xil_pcie_fuji_mod3(TIEOFF="1",T_...Compiling module secureip.xil_pcie_fuji_mod3(TIEOFF="0",T_...Compiling module secureip.xil_pcie_fuji_mod3(TIEOFF="0",T_...Compiling module secureip.xil_pcie_fuji_mod3(TIEOFF="0",T_...Compiling module secureip.xil_pcie_fuji_mod3(TIEOFF="0",T_...Compiling module secureip.xil_pcie_fuji_mod3(TIEOFF="0",T_...Compiling module secureip.xil_pcie_fuji_mod3(TIEOFF="0",T_...Compiling module secureip.xil_pcie_fuji_mod3(TIEOFF="1",T_...Compiling module secureip.xil_pcie_fuji_mod3(TIEOFF="1",T_...Compiling module secureip.xil_pcie_fuji_mod3(TIEOFF="1",T_...Compiling module secureip.xil_pcie_fuji_mod3(TIEOFF="1",T_...Compiling module secureip.xil_pcie_fuji_mod3(TIEOFF="0",T_...Compiling module secureip.xil_pcie_fuji_mod3(TIEOFF="0",T_...Compiling module secureip.xil_pcie_fuji_mod3(TIEOFF="0",T_...Compiling module secureip.xil_pcie_fuji_mod3(TIEOFF="1",T_...Compiling module secureip.xil_pcie_fuji_mod3(TIEOFF="0",T_...Compiling module secureip.xil_pcie_fuji_mod3(TIEOFF="1",T_...Compiling module secureip.xil_pcie_fuji_mod3(TIEOFF="0",T_...Compiling module secureip.xil_pcie_fuji_mod3(TIEOFF="0",T_...Compiling module secureip.xil_pcie_fuji_mod3(TIEOFF="0",T_...Compiling module secureip.xil_pcie_fuji_mod3(TIEOFF="0",T_...Compiling module secureip.xil_pcie_fuji_mod3(TIEOFF="1",T_...Compiling module secureip.xil_pcie_fuji_mod3(TIEOFF="0",T_...Compiling module secureip.xil_pcie_fuji_mod3(TIEOFF="1",T_...Compiling module secureip.xil_pcie_fuji_mod3(TIEOFF="0",T_...Compiling module secureip.xil_pcie_fuji_mod3(TIEOFF="1",T_...Compiling module secureip.xil_pcie_fuji_mod3(TIEOFF="1",T_...Compiling module secureip.xil_pcie_fuji_mod3(TIEOFF="0",T_...Compiling module secureip.xil_pcie_fuji_mod3(TIEOFF="0",T_...Compiling module secureip.xil_pcie_fuji_mod3(TIEOFF="0",T_...Compiling module secureip.xil_pcie_fuji_mod3(TIEOFF="0",T_...Compiling module secureip.xil_pcie_fuji_mod3(TIEOFF="0",T_...Compiling module secureip.xil_pcie_fuji_mod3(TIEOFF="0",T_...Compiling module secureip.xil_pcie_fuji_mod3(TIEOFF="1",T_...Compiling module secureip.xil_pcie_fuji_mod3(TIEOFF="1",T_...Compiling module secureip.xil_pcie_fuji_mod3(TIEOFF="1",T_...Compiling module secureip.xil_pcie_fuji_mod3(TIEOFF="1",T_...Compiling module secureip.xil_pcie_fuji_mod3(TIEOFF="0",T_...Compiling module secureip.xil_pcie_fuji_mod3(TIEOFF="0",T_...Compiling module secureip.xil_pcie_fuji_mod3(TIEOFF="0",T_...Compiling module secureip.xil_pcie_fuji_mod3(TIEOFF="1",T_...Compiling module secureip.xil_pcie_fuji_mod3(TIEOFF="1",T_...Compiling module secureip.xil_pcie_fuji_mod3(TIEOFF="1",T_...Compiling module secureip.xil_pcie_fuji_mod3(TIEOFF="1",T_...Compiling module secureip.xil_pcie_fuji_mod3(TIEOFF="1",T_...Compiling module secureip.xil_pcie_fuji_mod3(TIEOFF="1",T_...Compiling module secureip.xil_pcie_fuji_mod3(TIEOFF="1",T_...Compiling module secureip.xil_pcie_fuji_mod3(TIEOFF="0",T_...Compiling module secureip.xil_pcie_fuji_mod3(TIEOFF="0",T_...Compiling module secureip.xil_pcie_fuji_mod3(TIEOFF="1",T_...Compiling module secureip.xil_pcie_fuji_mod3(TIEOFF="1",T_...Compiling module secureip.xil_pcie_fuji_mod3(TIEOFF="1",T_...Compiling module secureip.xil_pcie_fuji_mod3(TIEOFF="0",T_...Compiling module secureip.xil_pcie_fuji_mod3(TIEOFF="1",T_...Compiling module secureip.xil_pcie_fuji_mod3(TIEOFF="1",T_...Compiling module secureip.xil_pcie_fuji_mod3(TIEOFF="1",T_...Compiling module secureip.xil_pcie_fuji_mod3(TIEOFF="1",T_...Compiling module secureip.xil_pcie_fuji_mod3(TIEOFF="0",T_...Compiling module secureip.xil_pcie_fuji_mod3(TIEOFF="0",T_...Compiling module secureip.xil_pcie_fuji_mod3(TIEOFF="1",T_...Compiling module secureip.xil_pcie_fuji_mod3(TIEOFF="1",T_...Compiling module secureip.xil_pcie_fuji_mod3(TIEOFF="0",T_...Compiling module secureip.xil_pcie_fuji_mod3(TIEOFF="0",T_...Compiling module secureip.xil_pcie_fuji_mod3(TIEOFF="0",T_...Compiling module secureip.xil_pcie_fuji_mod3(TIEOFF="0",T_...Compiling module secureip.xil_pcie_fuji_mod3(TIEOFF="0",T_...Compiling module secureip.xil_pcie_fuji_mod3(TIEOFF="0",T_...Compiling module secureip.xil_pcie_fuji_mod3(TIEOFF="0",T_...Compiling module secureip.xil_pcie_fuji_mod3(TIEOFF="0",T_...Compiling module secureip.xil_pcie_fuji_mod3(TIEOFF="1",T_...Compiling module secureip.xil_pcie_fuji_mod3(TIEOFF="1",T_...Compiling module secureip.xil_pcie_fuji_mod3(TIEOFF="1",T_...Compiling module secureip.xil_pcie_fuji_mod3(TIEOFF="0",T_...Compiling module secureip.xil_pcie_fuji_mod3(TIEOFF="0",T_...Compiling module secureip.xil_pcie_fuji_mod3(TIEOFF="1",T_...Compiling module secureip.xil_pcie_fuji_mod3(TIEOFF="0",T_...Compiling module secureip.xil_pcie_fuji_mod3(TIEOFF="0",T_...Compiling module secureip.xil_pcie_fuji_mod3(TIEOFF="0",T_...Compiling module secureip.xil_pcie_fuji_mod3(TIEOFF="0",T_...Compiling module secureip.xil_pcie_fuji_mod3(TIEOFF="0",T_...Compiling module secureip.xil_pcie_fuji_mod3(TIEOFF="1",T_...Compiling module secureip.xil_pcie_fuji_mod3(TIEOFF="0",T_...Compiling module secureip.xil_pcie_fuji_mod3(TIEOFF="0",T_...Compiling module secureip.xil_pcie_fuji_mod3(TIEOFF="0",T_...Compiling module secureip.xil_pcie_fuji_mod3(TIEOFF="0",T_...Compiling module secureip.xil_pcie_fuji_mod3(TIEOFF="0",T_...Compiling module secureip.xil_pcie_fuji_mod3(TIEOFF="0",T_...Compiling module secureip.xil_pcie_fuji_mod3(TIEOFF="0",T_...Compiling module secureip.xil_pcie_fuji_mod3(TIEOFF="1",T_...Compiling module secureip.xil_pcie_fuji_mod3(TIEOFF="0",T_...Compiling module secureip.xil_pcie_fuji_mod3(TIEOFF="0",T_...Compiling module secureip.xil_pcie_fuji_mod3(TIEOFF="0",T_...Compiling module secureip.xil_pcie_fuji_mod3(TIEOFF="0",T_...Compiling module secureip.xil_pcie_fuji_mod3(TIEOFF="0",T_...Compiling module secureip.xil_pcie_fuji_mod3(TIEOFF="0",T_...Compiling module secureip.xil_pcie_fuji_mod3(TIEOFF="0",T_...Compiling module secureip.xil_pcie_fuji_mod3(TIEOFF="0",T_...Compiling module secureip.xil_pcie_fuji_mod3(TIEOFF="1",T_...Compiling module secureip.xil_pcie_fuji_mod3(TIEOFF="0",T_...Compiling module secureip.xil_pcie_fuji_mod3(TIEOFF="0",T_...Compiling module secureip.xil_pcie_fuji_mod3(TIEOFF="0",T_...Compiling module secureip.xil_pcie_fuji_mod3(TIEOFF="0",T_...Compiling module secureip.xil_pcie_fuji_mod3(TIEOFF="0",T_...Compiling module secureip.xil_pcie_fuji_mod3(TIEOFF="0",T_...Compiling module secureip.xil_pcie_fuji_mod3(TIEOFF="0",T_...Compiling module secureip.xil_pcie_fuji_mod3(TIEOFF="0",T_...Compiling module secureip.xil_pcie_fuji_mod3(TIEOFF="0",T_...Compiling module secureip.xil_pcie_fuji_mod3(TIEOFF="0",T_...Compiling module secureip.xil_pcie_fuji_mod3(TIEOFF="0",T_...Compiling module secureip.xil_pcie_fuji_mod3(TIEOFF="0",T_...Compiling module secureip.xil_pcie_fuji_mod3(TIEOFF="0",T_...Compiling module secureip.xil_pcie_fuji_mod3(TIEOFF="0",T_...Compiling module secureip.xil_pcie_fuji_mod3(TIEOFF="0",T_...Compiling module secureip.xil_pcie_fuji_mod3(TIEOFF="0",T_...Compiling module secureip.xil_pcie_fuji_mod3(TIEOFF="1",T_...Compiling module secureip.xil_pcie_fuji_mod3(TIEOFF="0",T_...Compiling module secureip.xil_pcie_fuji_mod3(TIEOFF="0",T_...Compiling module secureip.xil_pcie_fuji_mod3(TIEOFF="1",T_...Compiling module secureip.xil_pcie_fuji_mod3(TIEOFF="0",T_...Compiling module secureip.xil_pcie_fuji_mod3(TIEOFF="0",T_...Compiling module secureip.xil_pcie_fuji_mod3(TIEOFF="0",T_...Compiling module secureip.xil_pcie_fuji_mod3(TIEOFF="0",T_...Compiling module secureip.xil_pcie_fuji_mod3(TIEOFF="0",T_...Compiling module secureip.xil_pcie_fuji_mod3(TIEOFF="0",T_...Compiling module secureip.xil_pcie_fuji_mod3(TIEOFF="0",T_...Compiling module secureip.xil_pcie_fuji_mod3(TIEOFF="0",T_...Compiling module secureip.xil_pcie_fuji_mod3(TIEOFF="0",T_...Compiling module secureip.xil_pcie_fuji_mod3(TIEOFF="0",T_...Compiling module secureip.xil_pcie_fuji_mod3(TIEOFF="0",T_...Compiling module secureip.xil_pcie_fuji_mod3(TIEOFF="0",T_...Compiling module secureip.xil_pcie_fuji_mod3(TIEOFF="0",T_...Compiling module secureip.xil_pcie_fuji_mod3(TIEOFF="1",T_...Compiling module secureip.xil_pcie_fuji_mod3(TIEOFF="0",T_...Compiling module secureip.xil_pcie_fuji_mod3(TIEOFF="0",T_...Compiling module secureip.xil_pcie_fuji_mod3(TIEOFF="0",T_...Compiling module secureip.xil_pcie_fuji_mod3(TIEOFF="0",T_...Compiling module secureip.xil_pcie_fuji_mod3(TIEOFF="0",T_...Compiling module secureip.xil_pcie_fuji_mod3(TIEOFF="0",T_...Compiling module secureip.xil_pcie_fuji_mod3(TIEOFF="0",T_...Compiling module secureip.xil_pcie_fuji_mod3(TIEOFF="0",T_...Compiling module secureip.xil_pcie_fuji_mod3(TIEOFF="1",T_...Compiling module secureip.xil_pcie_fuji_mod3(TIEOFF="0",T_...Compiling module secureip.xil_pcie_fuji_mod3(TIEOFF="0",T_...Compiling module secureip.xil_pcie_fuji_mod3(TIEOFF="0",T_...Compiling module secureip.xil_pcie_fuji_mod3(TIEOFF="0",T_...Compiling module secureip.xil_pcie_fuji_mod3(TIEOFF="0",T_...Compiling module secureip.xil_pcie_fuji_mod3(TIEOFF="0",T_...Compiling module secureip.xil_pcie_fuji_mod3(TIEOFF="0",T_...Compiling module secureip.xil_pcie_fuji_mod3(TIEOFF="0",T_...Compiling module secureip.xil_pcie_fuji_mod3(TIEOFF="0",T_...Compiling module secureip.xil_pcie_fuji_mod3(TIEOFF="0",T_...Compiling module secureip.xil_pcie_fuji_mod3(TIEOFF="0",T_...Compiling module secureip.xil_pcie_fuji_mod3(TIEOFF="0",T_...Compiling module secureip.xil_pcie_fuji_mod3(TIEOFF="0",T_...Compiling module secureip.xil_pcie_fuji_mod3(TIEOFF="0",T_...Compiling module secureip.xil_pcie_fuji_mod3(TIEOFF="0",T_...Compiling module secureip.xil_pcie_fuji_mod3(TIEOFF="0",T_...Compiling module secureip.xil_pcie_fuji_mod3(TIEOFF="0",T_...Compiling module secureip.xil_pcie_fuji_mod3(TIEOFF="0",T_...Compiling module secureip.xil_pcie_fuji_mod3(TIEOFF="0",T_...Compiling module secureip.xil_pcie_fuji_mod3(TIEOFF="0",T_...Compiling module secureip.xil_pcie_fuji_mod3(TIEOFF="0",T_...Compiling module secureip.xil_pcie_fuji_mod3(TIEOFF="0",T_...Compiling module secureip.xil_pcie_fuji_mod3(TIEOFF="0",T_...Compiling module secureip.xil_pcie_fuji_mod3(TIEOFF="0",T_...Compiling module secureip.xil_pcie_fuji_mod3(TIEOFF="1",T_...Compiling module secureip.xil_pcie_fuji_mod3(TIEOFF="1",T_...Compiling module secureip.xil_pcie_fuji_mod3(TIEOFF="1",T_...Compiling module secureip.xil_pcie_fuji_mod3(TIEOFF="1",T_...Compiling module secureip.xil_pcie_fuji_mod3(TIEOFF="0",T_...Compiling module secureip.xil_pcie_fuji_mod3(TIEOFF="0",T_...Compiling module secureip.xil_pcie_fuji_mod3(TIEOFF="0",T_...Compiling module secureip.xil_pcie_fuji_mod3(TIEOFF="0",T_...Compiling module secureip.xil_pcie_fuji_mod3(TIEOFF="0",T_...Compiling module secureip.xil_pcie_fuji_mod3(TIEOFF="0",T_...Compiling module secureip.xil_pcie_fuji_mod3(TIEOFF="1",T_...Compiling module secureip.xil_pcie_fuji_mod3(TIEOFF="0",T_...Compiling module secureip.xil_pcie_fuji_mod3(TIEOFF="0",T_...Compiling module secureip.xil_pcie_fuji_mod3(TIEOFF="1",T_...Compiling module secureip.xil_pcie_fuji_mod3(TIEOFF="0",T_...Compiling module secureip.xil_pcie_fuji_mod3(TIEOFF="0",T_...Compiling module secureip.xil_pcie_fuji_mod3(TIEOFF="0",T_...Compiling module secureip.xil_pcie_fuji_mod3(TIEOFF="0",T_...Compiling module secureip.xil_pcie_fuji_mod3(TIEOFF="0",T_...Compiling module secureip.xil_pcie_fuji_mod3(TIEOFF="0",T_...Compiling module secureip.xil_pcie_fuji_mod3(TIEOFF="0",T_...Compiling module secureip.xil_pcie_fuji_mod3(TIEOFF="1",T_...Compiling module secureip.xil_pcie_fuji_mod3(TIEOFF="0",T_...Compiling module secureip.xil_pcie_fuji_mod3(TIEOFF="0",T_...Compiling module secureip.xil_pcie_fuji_mod3(TIEOFF="0",T_...Compiling module secureip.xil_pcie_fuji_mod3(TIEOFF="0",T_...Compiling module secureip.xil_pcie_fuji_mod3(TIEOFF="0",T_...Compiling module secureip.xil_pcie_fuji_mod3(TIEOFF="1",T_...Compiling module secureip.xil_pcie_fuji_mod3(TIEOFF="0",T_...Compiling module secureip.xil_pcie_fuji_mod3(TIEOFF="0",T_...Compiling module secureip.xil_pcie_fuji_mod3(TIEOFF="0",T_...Compiling module secureip.xil_pcie_fuji_mod3(TIEOFF="0",T_...Compiling module secureip.xil_pcie_fuji_mod3(TIEOFF="0",T_...Compiling module secureip.xil_pcie_fuji_mod3(TIEOFF="0",T_...Compiling module secureip.xil_pcie_fuji_mod3(TIEOFF="0",T_...Compiling module secureip.xil_pcie_fuji_mod3(TIEOFF="0",T_...Compiling module secureip.xil_pcie_fuji_mod3(TIEOFF="1",T_...Compiling module secureip.xil_pcie_fuji_mod3(TIEOFF="0",T_...Compiling module secureip.xil_pcie_fuji_mod3(TIEOFF="0",T_...Compiling module secureip.xil_pcie_fuji_mod3(TIEOFF="0",T_...Compiling module secureip.xil_pcie_fuji_mod3(TIEOFF="0",T_...Compiling module secureip.xil_pcie_fuji_mod3(TIEOFF="0",T_...Compiling module secureip.xil_pcie_fuji_mod3(TIEOFF="0",T_...Compiling module secureip.xil_pcie_fuji_mod3(TIEOFF="0",T_...Compiling module secureip.xil_pcie_fuji_mod3(TIEOFF="0",T_...Compiling module secureip.xil_pcie_fuji_mod3(TIEOFF="0",T_...Compiling module secureip.xil_pcie_fuji_mod3(TIEOFF="0",T_...Compiling module secureip.xil_pcie_fuji_mod3(TIEOFF="0",T_...Compiling module secureip.xil_pcie_fuji_mod3(TIEOFF="0",T_...Compiling module secureip.xil_pcie_fuji_mod3(TIEOFF="0",T_...Compiling module secureip.xil_pcie_fuji_mod3(TIEOFF="0",T_...Compiling module secureip.xil_pcie_fuji_mod3(TIEOFF="0",T_...Compiling module secureip.xil_pcie_fuji_mod3(TIEOFF="0",T_...Compiling module secureip.xil_pcie_fuji_mod3(TIEOFF="1",T_...Compiling module secureip.xil_pcie_fuji_mod3(TIEOFF="0",T_...Compiling module secureip.xil_pcie_fuji_mod3(TIEOFF="0",T_...Compiling module secureip.xil_pcie_fuji_mod3(TIEOFF="1",T_...Compiling module secureip.xil_pcie_fuji_mod3(TIEOFF="0",T_...Compiling module secureip.xil_pcie_fuji_mod3(TIEOFF="0",T_...Compiling module secureip.xil_pcie_fuji_mod3(TIEOFF="0",T_...Compiling module secureip.xil_pcie_fuji_mod3(TIEOFF="0",T_...Compiling module secureip.xil_pcie_fuji_mod3(TIEOFF="0",T_...Compiling module secureip.xil_pcie_fuji_mod3(TIEOFF="0",T_...Compiling module secureip.xil_pcie_fuji_mod3(TIEOFF="0",T_...Compiling module secureip.xil_pcie_fuji_mod3(TIEOFF="0",T_...Compiling module secureip.xil_pcie_fuji_mod3(TIEOFF="0",T_...Compiling module secureip.xil_pcie_fuji_mod3(TIEOFF="0",T_...Compiling module secureip.xil_pcie_fuji_mod3(TIEOFF="0",T_...Compiling module secureip.xil_pcie_fuji_mod3(TIEOFF="0",T_...Compiling module secureip.xil_pcie_fuji_mod3(TIEOFF="0",T_...Compiling module secureip.xil_pcie_fuji_mod3(TIEOFF="1",T_...Compiling module secureip.xil_pcie_fuji_mod3(TIEOFF="0",T_...Compiling module secureip.xil_pcie_fuji_mod3(TIEOFF="0",T_...Compiling module secureip.xil_pcie_fuji_mod3(TIEOFF="0",T_...Compiling module secureip.xil_pcie_fuji_mod3(TIEOFF="0",T_...Compiling module secureip.xil_pcie_fuji_mod3(TIEOFF="0",T_...Compiling module secureip.xil_pcie_fuji_mod3(TIEOFF="0",T_...Compiling module secureip.xil_pcie_fuji_mod3(TIEOFF="0",T_...Compiling module secureip.xil_pcie_fuji_mod3(TIEOFF="0",T_...Compiling module secureip.xil_pcie_fuji_mod3(TIEOFF="1",T_...Compiling module secureip.xil_pcie_fuji_mod3(TIEOFF="0",T_...Compiling module secureip.xil_pcie_fuji_mod3(TIEOFF="0",T_...Compiling module secureip.xil_pcie_fuji_mod3(TIEOFF="0",T_...Compiling module secureip.xil_pcie_fuji_mod3(TIEOFF="0",T_...Compiling module secureip.xil_pcie_fuji_mod3(TIEOFF="0",T_...Compiling module secureip.xil_pcie_fuji_mod3(TIEOFF="0",T_...Compiling module secureip.xil_pcie_fuji_mod3(TIEOFF="0",T_...Compiling module secureip.xil_pcie_fuji_mod3(TIEOFF="0",T_...Compiling module secureip.xil_pcie_fuji_mod3(TIEOFF="0",T_...Compiling module secureip.xil_pcie_fuji_mod3(TIEOFF="0",T_...Compiling module secureip.xil_pcie_fuji_mod3(TIEOFF="0",T_...Compiling module secureip.xil_pcie_fuji_mod3(TIEOFF="0",T_...Compiling module secureip.xil_pcie_fuji_mod3(TIEOFF="0",T_...Compiling module secureip.xil_pcie_fuji_mod3(TIEOFF="0",T_...Compiling module secureip.xil_pcie_fuji_mod3(TIEOFF="0",T_...Compiling module secureip.xil_pcie_fuji_mod3(TIEOFF="0",T_...Compiling module secureip.xil_pcie_fuji_mod3(TIEOFF="0",T_...Compiling module secureip.xil_pcie_fuji_mod3(TIEOFF="0",T_...Compiling module secureip.xil_pcie_fuji_mod3(TIEOFF="0",T_...Compiling module secureip.xil_pcie_fuji_mod3(TIEOFF="0",T_...Compiling module secureip.xil_pcie_fuji_mod3(TIEOFF="0",T_...Compiling module secureip.xil_pcie_fuji_mod3(TIEOFF="0",T_...Compiling module secureip.xil_pcie_fuji_mod12Compiling module secureip.xil_pcie_fuji_mod13Compiling module secureip.xil_pcie_fuji_mod14Compiling module secureip.xil_pcie_fuji_mod15Compiling module secureip.xil_pcie_fuji_mod9Compiling module secureip.xil_pcie_fuji_mod8Compiling module secureip.xil_pcie_fuji_mod11Compiling module secureip.xil_pcie_fuji_mod10Compiling module secureip.xil_pcie_fuji_mod17Compiling module secureip.xil_pcie_fuji_mod21_defaultCompiling module secureip.xil_pcie_fuji_mod22Compiling module secureip.xil_pcie_fuji_mod27Compiling module secureip.xil_pcie_fuji_mod29Compiling module secureip.xil_pcie_fuji_mod0Compiling module secureip.xil_pcie_fuji_mod30Compiling module secureip.xil_pcie_fuji_mod36Compiling module secureip.xil_pcie_fuji_mod2Compiling module secureip.xil_pcie_fuji_mod37Compiling module secureip.xil_pcie_fuji_mod38Compiling module secureip.xil_pcie_fuji_mod35Compiling module secureip.xil_pcie_fuji_mod40Compiling module secureip.xil_pcie_fuji_mod41_defaultCompiling module secureip.xil_pcie_fuji_mod42Compiling module secureip.xil_pcie_fuji_mod39Compiling module secureip.xil_pcie_fuji_mod44Compiling module secureip.xil_pcie_fuji_mod43Compiling module secureip.xil_pcie_fuji_mod46Compiling module secureip.xil_pcie_fuji_mod47Compiling module secureip.xil_pcie_fuji_mod45Compiling module secureip.xil_pcie_fuji_mod34(NO_OF_LANES=...Compiling module secureip.xil_pcie_fuji_mod33Compiling module secureip.xil_pcie_fuji_mod31(NO_OF_LANES=...Compiling module secureip.xil_pcie_fuji_mod52Compiling module secureip.xil_pcie_fuji_mod51Compiling module secureip.xil_pcie_fuji_mod50Compiling module secureip.xil_pcie_fuji_mod49Compiling module secureip.xil_pcie_fuji_mod48(NO_OF_LANES=...Compiling module secureip.xil_pcie_fuji_mod26Compiling module secureip.xil_pcie_fuji_mod24Compiling module secureip.xil_pcie_fuji_mod25Compiling module secureip.xil_pcie_fuji_mod23_defaultCompiling module secureip.xil_pcie_fuji_mod20(NO_OF_LANES=...Compiling module secureip.xil_pcie_fuji_mod53(IMPL_TARGET=...Compiling module secureip.xil_pcie_fuji_mod75Compiling module secureip.xil_pcie_fuji_mod78Compiling module secureip.xil_pcie_fuji_mod79Compiling module secureip.xil_pcie_fuji_mod80Compiling module secureip.xil_pcie_fuji_mod74Compiling module secureip.xil_pcie_fuji_mod83(DW=64,TCQ=1)Compiling module secureip.xil_pcie_fuji_mod56(DEPTH=4,STYL...Compiling module secureip.xil_pcie_fuji_mod81Compiling module secureip.xil_pcie_fuji_mod77Compiling module secureip.xil_pcie_fuji_mod76Compiling module secureip.xil_pcie_fuji_mod82(TCQ=1)Compiling module secureip.xil_pcie_fuji_mod84(NUM_LANES=8,...Compiling module secureip.xil_pcie_fuji_mod69Compiling module secureip.xil_pcie_fuji_mod70Compiling module secureip.xil_pcie_fuji_mod71Compiling module secureip.xil_pcie_fuji_mod72Compiling module secureip.xil_pcie_fuji_mod73Compiling module secureip.xil_pcie_fuji_mod68Compiling module secureip.xil_pcie_fuji_mod55(TCQ=1,SCALE=...Compiling module secureip.xil_pcie_fuji_mod55(TCQ=1,DELAY_...Compiling module secureip.xil_pcie_fuji_mod67(TCQ=1,LINK_S...Compiling module secureip.xil_pcie_fuji_mod59(LINK_STATES=...Compiling module secureip.xil_pcie_fuji_mod65Compiling module secureip.xil_pcie_fuji_mod62(TCQ=1)Compiling module secureip.xil_pcie_fuji_mod63(TCQ=1)Compiling module secureip.xil_pcie_fuji_mod64Compiling module secureip.xil_pcie_fuji_mod60(TCQ=1)Compiling module secureip.xil_pcie_fuji_mod58Compiling module secureip.xil_pcie_fuji_mod61(TCQ=1)Compiling module secureip.xil_pcie_fuji_mod66(TCQ=1)Compiling module secureip.xil_pcie_fuji_mod57(TCQ=1)Compiling module secureip.xil_pcie_fuji_mod117(TCQ=1,DW=64...Compiling module secureip.xil_pcie_fuji_mod87(TCQ=1,IMPL_T...Compiling module secureip.xil_pcie_fuji_mod119(TCQ=1,TBAW=...Compiling module secureip.xil_pcie_fuji_mod118(TCQ=1)Compiling module secureip.xil_pcie_fuji_mod89Compiling module secureip.xil_pcie_fuji_mod88(TCQ=1,DW=64,...Compiling module secureip.xil_pcie_fuji_mod87(TCQ=1,IMPL_T...Compiling module secureip.xil_pcie_fuji_mod87(TCQ=1,IMPL_T...Compiling module secureip.xil_pcie_fuji_mod112(TCQ=1,TRAW=...Compiling module secureip.xil_pcie_fuji_mod111(TCQ=1,DW=64...Compiling module secureip.xil_pcie_fuji_mod110(DW=64,TBCW=...Compiling module secureip.xil_pcie_fuji_mod87(TCQ=1,IMPL_T...Compiling module secureip.xil_pcie_fuji_mod113(TCQ=1,TBAW=...Compiling module secureip.xil_pcie_fuji_mod87(TCQ=1,IMPL_T...Compiling module secureip.xil_pcie_fuji_mod87(TCQ=1,IMPL_T...Compiling module secureip.xil_pcie_fuji_mod87(TCQ=1,IMPL_T...Compiling module secureip.xil_pcie_fuji_mod114(TCQ=1,FCW=7...Compiling module secureip.xil_pcie_fuji_mod115(TCQ=1,TBAW=...Compiling module secureip.xil_pcie_fuji_mod116(TCQ=1,RETIM...Compiling module secureip.xil_pcie_fuji_mod109(TCQ=1,DW=64...Compiling module secureip.xil_pcie_fuji_mod120(TCQ=1,TBCW=...Compiling module secureip.xil_pcie_fuji_mod108(TCQ=1,DW=64...Compiling module secureip.xil_pcie_fuji_mod88(TCQ=1,DW=64,...Compiling module secureip.xil_pcie_fuji_mod101(DW=64,DMW=7...Compiling module secureip.xil_pcie_fuji_mod87(TCQ=1,IMPL_T...Compiling module secureip.xil_pcie_fuji_mod94(DW=64,DMW=72...Compiling module secureip.xil_pcie_fuji_mod87(TCQ=1,IMPL_T...Compiling module secureip.xil_pcie_fuji_mod93(DW=64,DMW=72...Compiling module secureip.xil_pcie_fuji_mod87(TCQ=1,IMPL_T...Compiling module secureip.xil_pcie_fuji_mod87(TCQ=1,IMPL_T...Compiling module secureip.xil_pcie_fuji_mod95(IMPL_TARGET=...Compiling module secureip.xil_pcie_fuji_mod96(DW=64,REG_CT...Compiling module secureip.xil_pcie_fuji_mod99(BARW=8,SBW_I...Compiling module secureip.xil_pcie_fuji_mod92(DW=64,DMW=72...Compiling module secureip.xil_pcie_fuji_mod98(FC_TYPE=2'b0...Compiling module secureip.xil_pcie_fuji_mod98(FC_TYPE=2'b0...Compiling module secureip.xil_pcie_fuji_mod98(FC_TYPE=2'b1...Compiling module secureip.xil_pcie_fuji_mod97(DW=64,MPS=10...Compiling module secureip.xil_pcie_fuji_mod100(DW=64,TCQ=1...Compiling module secureip.xil_pcie_fuji_mod91(RRAW=13,DW=6...Compiling module secureip.xil_pcie_fuji_mod105(DW=64,FCW=9...Compiling module secureip.xil_pcie_fuji_mod104(TCQ=1)Compiling module secureip.xil_pcie_fuji_mod103(DW=64,FCW=9...Compiling module secureip.xil_pcie_fuji_mod106(TCQ=1)Compiling module secureip.xil_pcie_fuji_mod102(DW=64,TCQ=1...Compiling module secureip.xil_pcie_fuji_mod107(OQ_HEADERS=...Compiling module secureip.xil_pcie_fuji_mod90(DW=64,DMW=72...Compiling module secureip.xil_pcie_fuji_mod86(TCQ=1)Compiling module secureip.xil_pcie_fuji_mod85(IMPL_TARGET=...Compiling module secureip.xil_pcie_fuji_mod56(WIDTH=137,DE...Compiling module secureip.xil_pcie_fuji_mod122(TCQ=1)Compiling module secureip.xil_pcie_fuji_mod123Compiling module secureip.xil_pcie_fuji_mod124(TCQ=1)Compiling module secureip.xil_pcie_fuji_mod56(WIDTH=16,DEP...Compiling module secureip.xil_pcie_fuji_mod56(WIDTH=133,DE...Compiling module secureip.xil_pcie_fuji_mod125(IMPL_TARGET...Compiling module secureip.xil_pcie_fuji_mod56(WIDTH=49,DEP...Compiling module secureip.xil_pcie_fuji_mod56(WIDTH=50,DEP...Compiling module secureip.xil_pcie_fuji_mod126(TCQ=1)Compiling module secureip.xil_pcie_fuji_mod127(LTW=15,TCQ=...Compiling module secureip.xil_pcie_fuji_mod128(TCQ=1)Compiling module secureip.xil_pcie_fuji_mod129(TCQ=1)Compiling module secureip.xil_pcie_fuji_mod130(TCQ=1)Compiling module secureip.xil_pcie_fuji_mod55(TCQ=1,LTW=15...Compiling module secureip.xil_pcie_fuji_mod121(TCQ=1,IMPL_...Compiling module secureip.xil_pcie_fuji_mod54(IMPL_TARGET=...Compiling module secureip.xil_pcie_fuji_mod131_defaultCompiling module secureip.xil_pcie_fuji_mod132(PROCESS="28...Compiling module secureip.xil_pcie_fuji_mod133Compiling module secureip.xil_pcie_fuji_mod19(PLM_NO_OF_LA...Compiling module secureip.xil_pcie_fuji_mod18Compiling module secureip.xil_pcie_fuji_mod7Compiling module secureip.xil_pcie_fuji_mod6Compiling module secureip.xil_pcie_fuji_mod5Compiling module secureip.xil_pcie_fuji_mod4(AER_BASE_PTR=...ERROR: [XSIM 43-3294] Signal EXCEPTION_ACCESS_VIOLATION receivedERROR: [XSIM 43-3294] Signal EXCEPTION_ACCESS_VIOLATION received










    Attachments:







    error.txt ‏85 KB

    DB:2.42:Simulation Compile Error Of Example Design File pj


    HiYash,

    Can you simulateac701-pcie-rdf0225-2013.2-c file on vivado 2013.2 Version for window xp x86?

    Thanks.

  • RELEVANCY SCORE 2.42

    DB:2.42:Problems Compiling With Packages js


    Hi,

    I wonder if anyone could help me.

    I have had problems compiling using a package. I have altered the classpath in autoexec.bat with:

    SET CLASSPATH=%classpath%;C:\jdk1.3.1_02\classes;.

    the package class files are stored in C:\jdk1.3.1_02\classes\helliker\id3

    and I have imported the class with:

    import helliker.id3.*;

    I am getting the following error:

    C:\My Documents\Uni work\mp3 project\test\Driver.java:1: package helliker.id3 does not exist
    import helliker.id3.*;
    ^

    Can anybody help?

    Thanks,

    Dave

    DB:2.42:Problems Compiling With Packages js

    Perhaps the version of Windows you are using does not use autoexec.bat. For example, in NT and XP, you set Classpath using ControlPanel/System/Advanced/Environment Variables.

    Perhaps there is a typo in your Classpath, for example an extra space.

    On a command line, try this:

    javac -classpath C:\jdk1.3.1_02\classes C:\My Documents\Uni work\mp3 project\test\Driver.java

    If that works, then definitely Classpath is not set as you think it is.

  • RELEVANCY SCORE 2.42

    DB:2.42:Problems Compiling sa


    I'm having troubles compiling my program and I'm not sure why it isn't generating the correct names.G:\RadASM\Cpp\Projects\TypeSpeechcl TypeSpeech.cpp /link /nodefaultlib kernel32.lib user32.lib gdi32.lib ole32.lib sapi.libMicrosoft (R) 32-bit C/C++ Optimizing Compiler Version 14.00.50727.42 for 80x86Copyright (C) Microsoft Corporation. All rights reserved.TypeSpeech.cppMicrosoft (R) Incremental Linker Version 8.00.50727.42Copyright (C) Microsoft Corporation. All rights reserved./out:TypeSpeech.exe/nodefaultlibkernel32.libuser32.libgdi32.libole32.libsapi.libTypeSpeech.objTypeSpeech.obj : error LNK2019: unresolved external symbol ___security_cookie referenced in function "long __stdcall WndProc(struct HWND__ *,unsigned int,unsigned int,long)" (?WndProc@@YGJPAUHWND__@@IIJ@Z)TypeSpeech.obj : error LNK2019: unresolved external symbol @__security_check_cookie@4 referenced in function "long __stdcall WndProc(struct HWND__ *,unsigned int,unsigned int,long)" (?WndProc@@YGJPAUHWND__@@IIJ@Z)TypeSpeech.obj : error LNK2019: unresolved external symbol _atexit referenced in function "void __cdecl `dynamic initializer for 'g_ISpVoice''(void)" (??__Eg_ISpVoice@@YAXXZ)TypeSpeech.exe : fatal error LNK1120: 3 unresolved externals

    DB:2.42:Problems Compiling sa

    Silly me, Trying to compile with VC++ express. It all works fine with VC98.

  • RELEVANCY SCORE 2.42

    DB:2.42:Ejb Query Language:- Problem Using 'Like' 97



    Hi,I am writing my first entity bean using CMP.I have a problem using the 'LIKE' operator in an EJB query.I've not had any problems using the "=" operator.The error I get on deployment is:Error compiling EJB-QL statement 'SELECT OBJECT(c) FROM Contract c WHERE c.lastName LIKE ?1'; - nested throwable: (org.jboss.ejb.plugins.cmp.ejbql.ParseException: Encountered "1" at line 2, column 35.Was expecting: STRING_LITERAL ...The section from my ejb-jar is: query-method method-namefindByLastName/method-name method-paramsmethod-paramjava.lang.String/method-param /method-params /query-method ejb-ql SELECT OBJECT(c) FROM Contract c WHERE c.lastName LIKE ?1 /ejb-qlAny help is much appreciated.CheersJohn )]

  • RELEVANCY SCORE 2.42

    DB:2.42:Sun Studio C++ da


    we are using SUN SPARC SERVERS.
    In that SUN STUDIO was loaded.
    If we create C++ files they are not compiling
    We are compiling as follows

    CC source file name

    then we are getting message that
    CC : not found.

    Please help me regarding as quickly as possible.
    It is most urgent

    DB:2.42:Sun Studio C++ da

    Sun Studio installs to /opt/SUNWspro/bin/ by default. Try adding this directory to PATH.

  • RELEVANCY SCORE 2.42

    DB:2.42:Errors In Compiling Simulation Library With Modelsim Se 6.4 7m


    Hello,
    I’ve got some problems with compiling the simulation library files.
    By compiling the ISE files, the gui shows me 1 error. But If I click on “View Log” I won’t find an error message.
    In the LogFile of EDK compilation, there are about 100 errors.
    ERROR:: Cannot locate library unisimERROR:: Cannot locate library simprimERROR:: Cannot locate library XilinxCoreLibERROR:: Cannot locate library unisims_verERROR:: Cannot locate library simprims_ver ERROR:: Cannot locate library XilinxCoreLib_ver
    The rest of the errors is like:
    ** Error: C:/Xilinx/10.1/EDK/hw/XilinxProcessorIPLib/pcores/chipscope_icon_v1_02_a/simhdl/vhdl/chipscope_icon.vhd(5): Library unisim not found.** Error: C:/Xilinx/10.1/EDK/hw/XilinxProcessorIPLib/pcores/chipscope_icon_v1_02_a/simhdl/vhdl/chipscope_icon.vhd(6): (vcom-1136) Unknown identifier "unisim".** Error: C:/Xilinx/10.1/EDK/hw/XilinxProcessorIPLib/pcores/chipscope_icon_v1_02_a/simhdl/vhdl/chipscope_icon.vhd(8): VHDL Compiler exiting ERROR:: Failed to execute vcom -93 -novopt -quiet -work chipscope_icon_v1_02_a -f C:/simlib/EDK10.1.01_mti_se_nt/EDK_Lib/CompileListFiles/chipscope_icon_v1_02_a_compile_order :
    Can somebody help me, please.
    Best regards,
    Michi
    EDK 10.1 Service Pack 1
    ISE 10.1 Service Pack 1
    Modelsim SE 6.4
    Win XP Pro







    Solved!
    Go to Solution.

  • RELEVANCY SCORE 2.42

    DB:2.42:Compiling And Executing A C++ Program In C# sm


    I want to know step-to-step how to compile a C++ program in C#, and execute him, and then get the output from the program.The c++ source can be in a file/string. I want also all error to can show them to the user who is compiling the C++ file.Thanks

    DB:2.42:Compiling And Executing A C++ Program In C# sm

     Like I said before, you can use the System.Diagnostics.Process class.  This can be used to run any program, including command line C++ compilers.  I believe that you can even receive and process the output and error messages from it using this class.  You can also use the Process class to run the programs after they have been compiled.  Look at the documentation here:http://msdn.microsoft.com/en-us/library/system.diagnostics.process.aspx

  • RELEVANCY SCORE 2.41

    DB:2.41:How Do You Use Multidim With Js? jx



    as the developer said just create a C# script and copy the C# code of that wiki page to it. then you can use it in your scripts. if still you have errors copy the c# script to standard assets folder to prevent compiling order problems. the methods of the class are static so you don't need to create an instance of MultiDim.

    var intarray = MultiDim.intArray(100,200,300);


    it will create a 100X200X300 (3d) and puts the reference in intarray.

    DB:2.41:How Do You Use Multidim With Js? jx



    Can you make these arrays static as well? I use the same 'MultiDim' class.




    static var gamersArr = MultiDim.StringArray(100,100); gamersArr[0,0] = TestTekst;




    If i try to retrieve the value, it stays empty. If i use it specificly in a script without static, it works just fine.




    Im pretty new to unity so i must be doing something wrong....

  • RELEVANCY SCORE 2.41

    DB:2.41:Problems Compiling I.Mx53 Sabre Compact 7 Bsp mk



    I have downloaded and installed the Sabre BSP when I compile the iMX53_SMD_mobility bsp I get the following error:

    BUILD: [03:0000001103:ERRORE] Error(s) in directory "C:\WINCE700\platform\iMX53_SMD\SRC\DRIVERS\IPUV3\DISPLAY\". {log="C:\WINCE700\platform\iMX53_SMD\bldsys.log(487)"}

    Any suggestions on what causes this error and how to correct it?

    Thank-you

    Dennis Essenmacher

    DB:2.41:Problems Compiling I.Mx53 Sabre Compact 7 Bsp mk


    Problem solved needed to check catalog items I2c and PMIC and rebuild libraries.

  • RELEVANCY SCORE 2.41

    DB:2.41:Re: New To Forms, Need Help In Installing The Summit Application 8c


    I then tried creating the fmx file manually as You had suggested, from programsdevsuiteforms developer forms compiler.

    i specified the customer.fmb file name from the c:\summit folder, put the id, password and database name as summit/summit@orcl

    and it gave me the following long error and created the customers.fmx file. And i tried to open this file again in the forms builder, it did not open.

    FRM-18108: Failed to load the following objects.

    Source Module:stndrd20.olb
    Source Object: STD_BUTTON_ICONIC_SMALL
    Source Module:stndrd20.olb
    Source Object: STD_BUTTON_ICONIC_SMALL
    Source Module:stndrd20.olb
    Source Object: STD_BUTTON_ICONIC_SMALL
    Source Module:stndrd20.olb
    Source Object: STD_BUTTON_ICONIC_SMALL
    Source Module:stndrd20.olb
    Source Object: STD_TOOLTIP
    Compiling procedure COLLAPSE_ALL...
    No compilation errors.

    Compiling procedure EXPAND_ALL...
    No compilation errors.

    Compiling procedure REFRESH_TREE_COUNTRY...
    No compilation errors.

    Compiling procedure REFRESH_TREE_SALESREP...
    No compilation errors.

    Compiling procedure CHECK_PACKAGE_FAILURE...
    No compilation errors.

    Compiling procedure QUERY_MASTER_DETAILS...
    No compilation errors.

    Compiling procedure CLEAR_ALL_MASTER_DETAILS...
    No compilation errors.

    Compiling PRE-FORM trigger on form...
    No compilation errors.

    Compiling WHEN-WINDOW-CLOSED trigger on form...
    No compilation errors.

    Compiling WHEN-NEW-FORM-INSTANCE trigger on form...
    No compilation errors.

    Compiling KEY-EXIT trigger on form...
    No compilation errors.

    Compiling ON-CLEAR-DETAILS trigger on form...
    No compilation errors.

    Compiling ON-ERROR trigger on form...
    No compilation errors.

    Compiling WHEN-BUTTON-PRESSED trigger on PROMPT_CUSTNAME item in CONTROL data block...
    No compilation errors.

    Compiling WHEN-BUTTON-PRESSED trigger on PROMPT_PHONE item in CONTROL data block...
    No compilation errors.

    Compiling WHEN-BUTTON-PRESSED trigger on PROMPT_SALES_NAME item in CONTROL data block...
    No compilation errors.

    Compiling WHEN-BUTTON-PRESSED trigger on SALES_LOV_BUTTON item in CONTROL data block...
    No compilation errors.

    Compiling WHEN-BUTTON-PRESSED trigger on EXIT item in CONTROL data block...
    No compilation errors.

    Compiling WHEN-LIST-CHANGED trigger on VIEW item in NAV_CONTROL data block...
    No compilation errors.

    Compiling WHEN-BUTTON-PRESSED trigger on PB_EXPAND item in NAV_CONTROL data block...
    No compilation errors.

    Compiling WHEN-BUTTON-PRESSED trigger on PB_COLLAPSE item in NAV_CONTROL data block...
    No compilation errors.

    Compiling WHEN-BUTTON-PRESSED trigger on PB_EXPANDALL item in NAV_CONTROL data block...
    No compilation errors.

    Compiling WHEN-BUTTON-PRESSED trigger on PB_COLLAPSEALL item in NAV_CONTROL data block...
    No compilation errors.

    Compiling WHEN-TREE-NODE-SELECTED trigger on NAVIGATOR data block...
    No compilation errors.

    Compiling WHEN-TREE-NODE-ACTIVATED trigger on TREE_CUST item in NAVIGATOR data block...
    No compilation errors.

    Compiling ON-POPULATE-DETAILS trigger on S_CUSTOMER1 data block...
    No compilation errors.

    Compiling ON-CHECK-DELETE-MASTER trigger on S_CUSTOMER1 data block...
    No compilation errors.

    Compiling POST-QUERY trigger on S_CUSTOMER1 data block...
    No compilation errors.

    Compiling POST-QUERY trigger on S_CUSTOMER data block...
    No compilation errors.

    Compiling WHEN-MOUSE-DOUBLECLICK trigger on COMMENTS item in S_CUSTOMER data block...
    No compilation errors.

    Created form file C:\Documents and Settings\ravid\Desktop\summit\customers.fmx

    what should i do now?

    DB:2.41:Re: New To Forms, Need Help In Installing The Summit Application 8c

    The summit demo app is available on this page: http://www.oracle.com/technology/products/forms/techlisting.html
    I just added a 10gR2 version to that page. It has new images. They were missing in the 6i version. I also updated the instructions to reflect the 10gR2 nomenclature.

  • RELEVANCY SCORE 2.41

    DB:2.41:Auto Storage-Class Specifier In Visual Studio 2010 9d


    What storage-class specifier is automatically used by compiler for function parameters that weren't explicitly declared with storage-class specifier by the user? I surely can't declare them as auto - produces 4042warning when compiling.
    Compiling C code, not C.

    DB:2.41:Auto Storage-Class Specifier In Visual Studio 2010 9d

    Just never type auto along with a datatype, in new or old C or C, and you'll be fine.

  • RELEVANCY SCORE 2.41

    DB:2.41:Problems Formatting/Burning jx


    I burnt a few test copies of my DVD project successfully.
    But then had to make some changes.

    I recompressed my files and it all played fine in the simulator, but now when I try to burn a copy it gets right across to 95% and then I get the following log:

    Starting DVD Build LFF...
    Compiler Initializing...
    Precompiling Project LFF
    Compiling VMG Information...
    Created 10 PGCs in VTSM1
    Created 8 PGCs in VMG.
    4 Menu(s) will be created...
    Compiling Menu PGCs...
    Compiling Menu#1 (Tutorials)...
    Compiling Menu#2 (Billy Movies)...
    Compiling Menu#3 (Extras)...
    Compiling Menu#4 (Main Menu)...
    Writing VIDEO_TS.VOB
    1 VTSs and 4 Titles will be created...
    Compiling VTS#1 (Track 1)...
    Muxing VTS011.VOB
    Video File Read Error

    Build cancelled
    Building was not successful. See log.

    My DVD data size is 4.1GB.

    Can anyone help??
    Thanks in advance

    DB:2.41:Problems Formatting/Burning jx

    Looks like it was just a glich.

    Deleted it all again and re-compressed and it's worked.

    Thanks for your help.

  • RELEVANCY SCORE 2.40

    DB:2.40:Kamailio Presence Server On Freescale P2020rdb-Pca 18




    Hi,

    I'm getting the following Error when I trying to make kamailio presence server in Freescale P2020rdb-pca.

    AltiVec and E500 instructions cannot coexist

    Your recommendations would be very much appreciated.

    Thanks Ashwin

    DB:2.40:Kamailio Presence Server On Freescale P2020rdb-Pca 18


    Hello,

    Thank you for your post, however please consider moving it to the right community place (e.g. QorIQ Processors ) to get it visible for active members.

    For details please see general advice Where to post a Discussion? (https://community.freescale.com/docs/DOC-99909 )

    Thank you for using Freescale Community.

  • RELEVANCY SCORE 2.40

    DB:2.40:Problems When Compiling C Program From Rfc Sdk On Aix 5.2 am



    Hi friends,

    When I compile c program from RFC SDK, some problems occured. The OS is AIX 5.2 and I use standard C compiler on AIX.

    The compiling command is "xlc -q64 sapinfo.c -I... -L... sapinfo.c librfc.a -o sapinfo".

    In "ld" step of compiling process, the problem is:

    ld: 0711-317 ERROR: Undefined symbol: .__vn__FUl

    ld: 0711-317 ERROR: Undefined symbol: .__vd__FPv

    ld: 0711-317 ERROR: Undefined symbol: __PureVirtualCalled

    ld: 0711-317 ERROR: Undefined symbol: .__dl__FPv

    ld: 0711-317 ERROR: Undefined symbol: __dl_FPv

    ld: 0711-317 ERROR: Undefined symbol: .__nw__FUl

    ld: 0711-345 Use the -bloadmap or -bnoquiet option to obtain more information.

    I thought it seem to RFC SDK uses some C++ functions. So I change the file name into

    "sapinfo.C".

    The compiling command is "xlc -q64 sapinfo.C -I... -L... sapinfo.c librfc.a -o sapinfo"

    to compile.

    Then the error information comed:

    ld: 0711-317 ERROR: Undefined symbol: .operator new[](unsighned long)

    ld: 0711-317 ERROR: Undefined symbol: .operator delete[](void*)

    ld: 0711-317 ERROR: Undefined symbol: __PureVirtualCalled

    ld: 0711-317 ERROR: Undefined symbol: .operator delete(void*)

    ld: 0711-317 ERROR: Undefined symbol: operator delete(void*)

    ld: 0711-317 ERROR: Undefined symbol: .operator new(unsigned long)

    ld: 0711-345 Use the -bloadmap or -bnoquiet option to obtain more information.

    I hope someone can tell me the reason and how I can get it through.

    3x

    DB:2.40:Problems When Compiling C Program From Rfc Sdk On Aix 5.2 am


    Hi,

    see this post :

    Problem when compiling C program from RFC SDK on AIX 5.2

    Adding -lC seems to work ...

  • RELEVANCY SCORE 2.40

    DB:2.40:Linking Problems pp


    Hi everyone.

    I'm migrating from a 15K SUN Server to a 25K SUN Server.

    We have installed Studio 11 compilers.

    In our migration tests I'm compiling all our batch process to the new compiler, everything woks fine except when I'm compiling Oracle Pro*C programs, the compiler includes a library path in the command line, that library path doesn't exist on the new machine (/opt/SUNWcluster/lib).

    I have checked the make files from Oracle and they doesn't include the path above, how can exclude that library path (or any parameter) from the compiler command line?

    Thanks in advance.

    DB:2.40:Linking Problems pp

    Thank you for your answer, I will double check and dig deeper inside the make files and environment variables.

    Regards

  • RELEVANCY SCORE 2.40

    DB:2.40:Compiling C++ In Terminal x3


    hey how can i compile and execute c++ programs in terminal?

    kindly assist

    DB:2.40:Compiling C++ In Terminal x3

    try this site.

    [C++ Annotations|http://www.icce.rug.nl/documents/cplusplus

  • RELEVANCY SCORE 2.40

    DB:2.40:Compiling c8


    Hy. How can I compile *.c or *.cpp files in Visual C++ 2005 Express Edition Beta 2?

    DB:2.40:Compiling c8

    If you're in the IDE, use theBuild | Compile menuoption.On command line use the cl.exe tool.Marinus

  • RELEVANCY SCORE 2.40

    DB:2.40:Pro*C Sqlcxt Undefined dp


    Sorry to post this in LINUX, my problem is on Windows. There doesn't seem to be a place to post poblems with windows c programming problems with pro*c. Also, no downloads seem to be available to fix problems with pro*c.

    I am getting this error when compiling and linking:

    makegcc -oreplaceCard.exe C:\oracle\ora92\precomp\lib\msvc\oraSQL9.lib replaceCard.c

    c:/djgpp/tmp/ccqESSA5.o(.text+0x58a):replaceCard.c: undefined reference to `_sqlcxt'
    c:/djgpp/tmp/ccqESSA5.o(.text+0x11a7):replaceCard.c: undefined reference to `_sqlcxt'
    collect2: ld returned 1 exit status
    make.exe: *** [replaceCard] Error 1

    Does my makefile look OK:

    CC = gcc
    LIB = C:\oracle\ora92\precomp\lib\msvc\oraSQL9.lib
    all: replaceCard
    replaceCard: replaceCard.c
    $(CC) -oreplaceCard.exe $(LIB) replaceCard.c

    DB:2.40:Pro*C Sqlcxt Undefined dp

    Thank you.

    I fixed the makefile but still get the undefined reference to _sqlcxt.

    Any more help available?

  • RELEVANCY SCORE 2.40

    DB:2.40:Problems With Compiling zj


    when I compile this projekct I got the following error meassage:
    85, 41 Type error in argument 1 to `Combo_NewComboBox'; found 'pointer to __cdecl int function(int,int,pointer to void,int,int)' expected 'int'.what is the problem?

    samuel









    Attachments:






    test.zip ‏303 KB

    DB:2.40:Problems With Compiling zj

    Samuel,

    Combo_NewComboBox transforms a string control into a combo box custom
    control. As arguments, it takes the panel handle and the control
    constant that specify the string control you want to make into a combo
    box. Instead of passing MainPanelCallback, pass it
    gMainWindow.panel.

    Mert A.
    National Instruments

  • RELEVANCY SCORE 2.40

    DB:2.40:C++ Streams p1


    When compiling the following program, the program fails to
    output text as it should. std::strings do work though, just
    std::cout and other streams such as std::stringstream seem to cause
    problems.

    DB:2.40:C++ Streams p1

    When compiling the following program, the program fails to
    output text as it should. std::strings do work though, just
    std::cout and other streams such as std::stringstream seem to cause
    problems.

  • RELEVANCY SCORE 2.40

    DB:2.40:Performance Bottleneck In Compiling A Solution In Visual C++ zd


    Hi,

    DB:2.40:Performance Bottleneck In Compiling A Solution In Visual C++ zd

    Thanks. I will inform the SI team to see if they can help on the VM performance.Wutipong W.

  • RELEVANCY SCORE 2.40

    DB:2.40:Pdcurses And Mingw32 17



    hello, I have some problems compiling pdcurses on linux for using it with the mingw32 cross compiler.Im using the following gide http://www.mail-archive.com/pdcurses-l@ … 00053.htmlbut when compiling it i get the following error:

    i486-mingw32-gcc -c -O2 -Wall -static -I/home/ilcra1989/cross/PDCurses-2.5 -I/usr/i486-mingw32/include -opdcwin.o /home/ilcra1989/cross/PDCurses-2.5/pdcurses/pdcwin.ci486-mingw32-gcc rcv pdcurses.a *.oi486-mingw32-gcc: rcv: No such file or directoryi486-mingw32-gcc: pdcurses.a: No such file or directorymake: *** [pdcurses.a] Error 1

    in the makefile rcv is in teh variable LIBFLAGSwhat is rcv?, how can i fix this?

    DB:2.40:Pdcurses And Mingw32 17


    ok, its solved, but I still have curiosity for knowing what is rcv, so if anyone knows it, please, say it.

  • RELEVANCY SCORE 2.40

    DB:2.40:Compiling Problems fj


    I can't get my .java files to compile. I entered the javac command to the enviromental variables on the advanced tab in the system folder. When i try to use the "javac" command it gives me an error message saying its not a known command. The wierd thing is if i put the file in the c:\jdk1.5.0\bin folder with javac.exe it'll compile. What can i do. THanks a lot

    DB:2.40:Compiling Problems fj

    hi
    there will ba an environmental variable by name path
    select that .Dont change the variable name. in the value field appned
    ;c:\jdk1.5.0\bin at the end and restart your machine

    now your javac command will be recognized.

  • RELEVANCY SCORE 2.40

    DB:2.40:Problems Building A Set Of Libraries jf


    Hello,I am trying to build a set of libraries for a 3D visualization package called vtk using VC++ 6.0. I am using a centrino duo xp system with swap space set to 2000 MB. The compiler seems to freeze in attempt to link and build the a library called vtkzlib. At this point the CPU utilization drops to zero. Below is a copy of the compiler output leading up to the freezing point. I am not sure whether this is a vtk or a vc 6.0 issue. Does anyone know what is causing this or can point me in the right direction into solving this problem?Thank you,Daina--------------------Configuration: vtkGraphics - Win32 Debug--------------------Compiling...vtkAppendFilter.cxxvtkAppendPolyData.cxxvtkApproximatingSubdivisionFilter.cxxvtkArrayCalculator.cxxvtkArrowSource.cxxvtkAssignAttribute.cxxvtkAttributeDataToFieldDataFilter.cxxvtkAxes.cxxvtkBandedPolyDataContourFilter.cxxvtkBlankStructuredGrid.cxxvtkBlankStructuredGridWithImage.cxxvtkBoxClipDataSet.cxxvtkBrownianPoints.cxxvtkButterflySubdivisionFilter.cxxvtkButtonSource.cxxvtkBSPCuts.cxxvtkBSPIntersections.cxxvtkCellCenterDepthSort.cxxvtkCellCenters.cxxvtkCellDataToPointData.cxxGenerating Code...Compiling...vtkCellDerivatives.cxxvtkCleanPolyData.cxxvtkClipDataSet.cxxvtkClipPolyData.cxxvtkClipVolume.cxxvtkConeSource.cxxvtkConnectivityFilter.cxxvtkContourFilter.cxxvtkContourGrid.cxxvtkCubeSource.cxxvtkCursor3D.cxxvtkCutter.cxxvtkCurvatures.cxxvtkCylinderSource.cxxvtkDashedStreamLine.cxxvtkDataObjectToDataSetFilter.cxxvtkDataSetSurfaceFilter.cxxvtkDataSetToDataObjectFilter.cxxvtkDataSetTriangleFilter.cxxvtkDecimatePro.cxxGenerating Code...Compiling...vtkDelaunay2D.cxxvtkDelaunay3D.cxxvtkDicer.cxxvtkDiscreteMarchingCubes.cxxvtkDiskSource.cxxvtkEdgePoints.cxxvtkElevationFilter.cxxvtkEllipticalButtonSource.cxxvtkExtractCells.cxxvtkExtractDataOverTime.cxxvtkExtractEdges.cxxvtkExtractGeometry.cxxvtkExtractGrid.cxxvtkExtractPolyDataGeometry.cxxvtkExtractRectilinearGrid.cxxvtkExtractTensorComponents.cxxvtkExtractUnstructuredGrid.cxxvtkExtractVectorComponents.cxxvtkFeatureEdges.cxxvtkFieldDataToAttributeDataFilter.cxxGenerating Code...Compiling...vtkGeometryFilter.cxxvtkGlyph2D.cxxvtkGlyph3D.cxxvtkGlyphSource2D.cxxvtkGraphLayoutFilter.cxxvtkGridSynchronizedTemplates3D.cxxvtkHierarchicalDataSetGeometryFilter.cxxvtkHedgeHog.cxxvtkHierarchicalDataExtractDataSets.cxxvtkHierarchicalDataExtractLevel.cxxvtkHierarchicalDataLevelFilter.cxxvtkHull.cxxvtkHyperStreamline.cxxvtkIdFilter.cxxvtkImageDataGeometryFilter.cxxvtkImageMarchingCubes.cxxvtkImplicitTextureCoords.cxxvtkInterpolateDataSetAttributes.cxxvtkInterpolatingSubdivisionFilter.cxxvtkKdNode.cxxGenerating Code...Compiling...vtkKdTree.cxxvtkLineSource.cxxvtkLinearExtrusionFilter.cxxvtkLinearSubdivisionFilter.cxxvtkLinkEdgels.cxxvtkLoopSubdivisionFilter.cxxvtkMarchingContourFilter.cxxvtkMarchingCubes.cxxvtkMarchingSquares.cxxvtkMaskFields.cxxvtkMaskPoints.cxxvtkMaskPolyData.cxxvtkMassProperties.cxxvtkMergeDataObjectFilter.cxxvtkMergeCells.cxxvtkMergeFields.cxxvtkMergeFilter.cxxvtkMeshQuality.cxxvtkModelMetadata.cxxvtkOBBDicer.cxxGenerating Code...Compiling...vtkOBBTree.cxxvtkOutlineCornerFilter.cxxvtkOutlineCornerSource.cxxvtkOutlineFilter.cxxvtkOutlineSource.cxxvtkParametricFunctionSource.cxxvtkPlaneSource.cxxvtkPlanesIntersection.cxxvtkPlatonicSolidSource.cxxvtkPointDataToCellData.cxxvtkPointsProjectedHull.cxxvtkPointSource.cxxvtkPolyDataConnectivityFilter.cxxvtkPolyDataNormals.cxxvtkPolyDataStreamer.cxxvtkProbeFilter.cxxvtkProgrammableAttributeDataFilter.cxxvtkProgrammableDataObjectSource.cxxvtkProgrammableFilter.cxxvtkProgrammableGlyphFilter.cxxGenerating Code...Compiling...vtkProgrammableSource.cxxvtkProjectedTexture.cxxvtkQuadricClustering.cxxvtkQuadricDecimation.cxxvtkQuantizePolyDataPoints.cxxvtkRearrangeFields.cxxvtkRectangularButtonSource.cxxvtkRectilinearGridClip.cxxvtkRectilinearGridGeometryFilter.cxxvtkRectilinearGridToTetrahedra.cxxvtkRectilinearSynchronizedTemplates.cxxvtkRecursiveDividingCubes.cxxvtkReflectionFilter.cxxvtkRegularPolygonSource.cxxvtkReverseSense.cxxvtkRibbonFilter.cxxvtkRotationalExtrusionFilter.cxxvtkRotationFilter.cxxvtkRuledSurfaceFilter.cxxvtkSelectPolyData.cxxGenerating Code...Compiling...vtkShrinkFilter.cxxvtkShrinkPolyData.cxxvtkSimpleElevationFilter.cxxvtkSliceCubes.cxxvtkSmoothPolyDataFilter.cxxvtkSortDataArray.cxxvtkSpatialRepresentationFilter.cxxvtkSpherePuzzle.cxxvtkSpherePuzzleArrows.cxxvtkSphereSource.cxxvtkSplineFilter.cxxvtkSplitField.cxxvtkStreamLine.cxxvtkStreamPoints.cxxvtkStreamTracer.cxxvtkStreamer.cxxvtkStripper.cxxvtkStructuredGridClip.cxxvtkStructuredGridGeometryFilter.cxxvtkStructuredGridOutlineFilter.cxxGenerating Code...Compiling...vtkStructuredPointsGeometryFilter.cxxvtkSubPixelPositionEdgels.cxxvtkSubdivideTetra.cxxvtkSuperquadricSource.cxxvtkSynchronizedTemplates2D.cxxvtkSynchronizedTemplates3D.cxxvtkSynchronizedTemplatesCutter3D.cxxvtkTensorGlyph.cxxvtkTextSource.cxxvtkTextureMapToCylinder.cxxvtkTextureMapToPlane.cxxvtkTextureMapToSphere.cxxvtkTexturedSphereSource.cxxvtkThreshold.cxxvtkThresholdPoints.cxxvtkThresholdTextureCoords.cxxvtkTransformFilter.cxxvtkTransformPolyDataFilter.cxxvtkTransformTextureCoords.cxxvtkTriangleFilter.cxxGenerating Code...Compiling...vtkTriangularTCoords.cxxvtkTubeFilter.cxxvtkVectorDot.cxxvtkVectorNorm.cxxvtkVisibilitySort.cxxvtkVoxelContoursToSurfaceFilter.cxxvtkWarpLens.cxxvtkWarpScalar.cxxvtkWarpTo.cxxvtkWarpVector.cxxvtkWindowedSincPolyDataFilter.cxxvtkGraphicsInstantiator.cxxGenerating Code...Linking...   Creating library D:\ITK\VTK_binary\bin\Debug/vtkGraphics.lib and object D:\ITK\VTK_binary\bin\Debug/vtkGraphics.exp--------------------Configuration: vtkGenericFiltering - Win32 Debug--------------------Compiling...vtkGenericContourFilter.cxxvtkGenericGeometryFilter.cxxvtkGenericClip.cxxvtkGenericProbeFilter.cxxvtkGenericDataSetTessellator.cxxvtkGenericCutter.cxxvtkGenericGlyph3DFilter.cxxvtkGenericStreamTracer.cxxvtkGenericOutlineFilter.cxxvtkGenericFilteringInstantiator.cxxGenerating Code...Linking...   Creating library D:\ITK\VTK_binary\bin\Debug/vtkGenericFiltering.lib and object D:\ITK\VTK_binary\bin\Debug/vtkGenericFiltering.exp--------------------Configuration: vtkDICOMParser - Win32 Debug--------------------Compiling...DICOMFile.cxxDICOMParser.cxxDICOMAppHelper.cxxGenerating Code...Linking...   Creating library D:\ITK\VTK_binary\bin\Debug/vtkDICOMParser.lib and object D:\ITK\VTK_binary\bin\Debug/vtkDICOMParser.exp--------------------Configuration: vtkzlib - Win32 Debug--------------------Compiling resources...Compiling...adler32.cgzio.cinftrees.cuncompr.ccompress.cinfblock.cinfutil.czutil.ccrc32.cinfcodes.cdeflate.cinffast.cinflate.ctrees.cGenerating Code...Linking...

    DB:2.40:Problems Building A Set Of Libraries jf

    I'm afraid VC6 isn't supported by these forums. For the best possible answers, you should visit the VC newsgroups at http://msdn.microsoft.com/newsgroups.
    Checking by the support forum (if there is such a thing) of the library in question would also be a good idea. Others may have experienced the same issue.

  • RELEVANCY SCORE 2.40

    DB:2.40:Compiling Problems 39


    I'm using Microsoft Virtual C++ Express Edition and I can't find the compile button. The Build menu is missing in the software. Can anyone help me find it.

    DB:2.40:Compiling Problems 39

    If the build menue is missing, I would say, please reinstall as you might have other problems.
    Thanks,
    Ayman Shoukry
    VC++ Team

  • RELEVANCY SCORE 2.40

    DB:2.40:Libclntsh.So 7s



    I have problems compiling C code that utilizes the libclntsh.so library.
    The error generated is the following: /9.2.0/lib/libclntsh.so: wrong ELF class:
    ELFCLASS64
    CMDTUX_CAT:1832: NLS:6: Message not found, catalog CMDTUX_CAT, set 1, num 1832

    I have Tux 8.1 and Oracle 9.2.0 on Solaris.

    This codigo I compile it in versions less than Oracle without problems.

    Thanks you!

    DB:2.40:Libclntsh.So 7s


    Thanks your help. Really I was compiling with 64 bits.

    Regards,

    Edgar Alvarado

    "Per Lindstrm" Per.Lindstrom@r2m.nospam.se wrote:

    Hello Edgar,

    check if you have a lib32 directory (i.e. ora920/lib32/) for your Oracle
    library.
    Try using the libclntsh you might find there instead. My guess is that
    you (unintentionally)
    are mixing 32 and 64 bit code. If you're only using 32-bit code please
    make sure
    that everything you link with is 32 bit code as well.

    Hope this helps,

    /Per

    "Edgar Alvarado" edag70ve@hotmail.com wrote:
    I have problems compiling C code that utilizes the libclntsh.so library.

    The error generated is the following: /9.2.0/lib/libclntsh.so: wrong
    ELF class:
    ELFCLASS64
    CMDTUX_CAT:1832: NLS:6: Message not found, catalog CMDTUX_CAT, set 1,
    num 1832

    I have Tux 8.1 and Oracle 9.2.0 on Solaris.

    This codigo I compile it in versions less than Oracle without problems.

    Thanks you!

  • RELEVANCY SCORE 2.40

    DB:2.40:Vivado 2014.4 Simulation: Could Not Remove The Obj Directory z7



    Hello all,

    I'm trying to run the AXI Ethernet Subsystem testbench in the vivado simulator and at the end of the build process I get an error saying "Could not remove the obj directory: boost::filesystem::remove: The directory is not empty: "xsim.dir/gigabit_ethernet_demo_tb_behav/obj".

    The obj folder in question is empty by the time I'm notified.

    I was unable to find anything on google or the forums regarding this issue. I tried disabling multithreading thinking a process was finishing too early but that didn't help. I also tried disabling real time protection on my antivirus.

    I run windows 7 x64.

    Does anybody have any other suggestions?

    Thank you.

    Here's the log output from the simulation process

    Vivado Simulator 2014.4
    Copyright 1986-1999, 2001-2014 Xilinx, Inc. All Rights Reserved.
    Running: C:/DEV/XILINX/Vivado/2014.4/bin/unwrapped/win64.o/​xelab.exe -wto ad6f20e0af0d4d8fa062ccdca30307d3 --debug typical --relax --mt off --include ../../../ber_gen_gtx_eth.srcs/sources_1/ip/etherne​t_32to8/axis_infrastructure_v1_1/hdl/verilog --include ../../../ber_gen_gtx_eth.srcs/sources_1/ip/etherne​t_fifo/axis_infrastructure_v1_1/hdl/verilog --include ../../../ber_gen_gtx_eth.srcs/sources_1/ip/gigabit​_ethernet/bd_0/ip/ip_1/tri_mode_ethernet_mac_v8_3/​hdl -L dist_mem_gen_v8_0 -L xil_defaultlib -L blk_mem_gen_v8_2 -L microblaze_v9_3 -L iomodule_v2_2 -L lmb_bram_if_cntlr_v4_0 -L lmb_v10_v3_0 -L proc_common_v4_0 -L axi_lite_ipif_v2_0 -L mdm_v3_1 -L microblaze_mcs_v2_2 -L fifo_generator_v12_0 -L lib_bmg_v1_0 -L axi_lite_ipif_v3_0 -L axi_ethernet_buffer_v2_0 -L xbip_utils_v3_0 -L xbip_pipe_v3_0 -L xbip_bram18k_v3_0 -L mult_gen_v12_0 -L tri_mode_ethernet_mac_v8_3 -L axis_infrastructure_v1_1 -L axis_data_fifo_v1_1 -L axis_register_slice_v1_1 -L axis_dwidth_converter_v1_1 -L unisims_ver -L unimacro_ver -L secureip --snapshot gigabit_ethernet_demo_tb_behav xil_defaultlib.gigabit_ethernet_demo_tb xil_defaultlib.glbl -log elaborate.log
    Turned off multi-threading.
    Starting static elaboration
    Completed static elaboration
    Starting simulation data flow analysis
    Completed simulation data flow analysis
    Time Resolution for simulation is 1ps
    Compiling package std.standard
    Compiling package ieee.std_logic_1164
    Compiling package ieee.numeric_std
    Compiling package unisim.vcomponents
    Compiling package ieee.std_logic_arith
    Compiling package ieee.std_logic_unsigned
    Compiling package axi_lite_ipif_v3_0.ipif_pkg
    Compiling package axi_ethernet_buffer_v2_0.rx_if_pack
    Compiling package axi_ethernet_buffer_v2_0.tx_if_pack
    Compiling package axi_ethernet_buffer_v2_0.registers_pack
    Compiling package axi_ethernet_buffer_v2_0.clock_cross_pack
    Compiling package axi_ethernet_buffer_v2_0.axi_ethernet_buffer_v2_0_​pack
    Compiling package std.textio
    Compiling package ieee.vital_timing
    Compiling package ieee.vital_primitives
    Compiling package unisim.vpkg
    Compiling package synopsys.attributes
    Compiling package ieee.std_logic_misc
    Compiling package ieee.std_logic_textio
    Compiling package ieee.std_logic_signed
    Compiling package tri_mode_ethernet_mac_v8_3.bd_0_eth_mac_0_ipif_pkg
    Compiling package tri_mode_ethernet_mac_v8_3.tx_pack
    Compiling package tri_mode_ethernet_mac_v8_3.common_pack
    Compiling package tri_mode_ethernet_mac_v8_3.ptp_pack
    Compiling package tri_mode_ethernet_mac_v8_3.rx_pack
    Compiling package tri_mode_ethernet_mac_v8_3.ethernet_statistics_pac​k
    Compiling package vl.vl_types
    Compiling module xil_defaultlib.glbl
    Compiling module xil_defaultlib.gigabit_ethernet_frame_typ
    Compiling architecture gnd_v of entity unisim.GND [gnd_default]
    Compiling architecture vcc_v of entity unisim.VCC [vcc_default]
    Compiling architecture fdre_v of entity unisim.FDRE [\FDRE('0','0','0','0')\]
    Compiling architecture structural of entity axi_ethernet_buffer_v2_0.sync_block [\sync_block('0',5)\]
    Compiling architecture imp of entity axi_ethernet_buffer_v2_0.actv_hi_pulse_clk_cross [actv_hi_pulse_clk_cross_default]
    Compiling architecture rtl of entity axi_ethernet_buffer_v2_0.sync_reset [\sync_reset(5)\]
    Compiling architecture imp of entity axi_ethernet_buffer_v2_0.actv_hi_reset_clk_cross [actv_hi_reset_clk_cross_default]
    Compiling architecture imp of entity axi_ethernet_buffer_v2_0.reset_combiner [\reset_combiner(0)\]
    Compiling architecture imp of entity axi_ethernet_buffer_v2_0.reg_cr [reg_cr_default]
    Compiling architecture imp of entity axi_ethernet_buffer_v2_0.reg_tp [reg_tp_default]
    Compiling architecture imp of entity axi_ethernet_buffer_v2_0.reg_ifgp [reg_ifgp_default]
    Compiling architecture imp of entity axi_ethernet_buffer_v2_0.reg_is [reg_is_default]
    Compiling architecture imp of entity axi_ethernet_buffer_v2_0.reg_ip [reg_ip_default]
    Compiling architecture imp of entity axi_ethernet_buffer_v2_0.reg_ie [reg_ie_default]
    Compiling architecture imp of entity axi_ethernet_buffer_v2_0.reg_32b [reg_32b_default]
    Compiling architecture imp of entity axi_ethernet_buffer_v2_0.reg_16bl [reg_16bl_default]
    Compiling architecture imp of entity axi_ethernet_buffer_v2_0.registers [\registers("kintex7",0,0,0,0,0,0...]
    Compiling architecture imp of entity axi_lite_ipif_v3_0.address_decoder [\address_decoder(18,"00000000000...]
    Compiling architecture imp of entity axi_lite_ipif_v3_0.slave_attachment [\slave_attachment(("000000000000...]
    Compiling architecture imp of entity axi_lite_ipif_v3_0.axi_lite_ipif [\axi_lite_ipif(32,32,"0000000000...]
    Compiling architecture rtl of entity axi_ethernet_buffer_v2_0.addr_response_shim [\addr_response_shim(1,32,32,32,1...]
    Compiling architecture imp of entity axi_ethernet_buffer_v2_0.bus_clk_cross [\bus_clk_cross(32)\]
    Compiling architecture imp of entity axi_ethernet_buffer_v2_0.bus_clk_cross [\bus_clk_cross(16)\]
    Compiling architecture imp of entity axi_ethernet_buffer_v2_0.bus_clk_cross [\bus_clk_cross(15)\]
    Compiling architecture imp of entity axi_ethernet_buffer_v2_0.bus_and_enable_clk_cross [\bus_and_enable_clk_cross(16)\]
    Compiling architecture imp of entity axi_ethernet_buffer_v2_0.bus_clk_cross [\bus_clk_cross(8)\]
    Compiling architecture rtl of entity axi_ethernet_buffer_v2_0.rx_emac_if [\rx_emac_if(0,16384,11,8192,10,"...]
    Compiling architecture output_stage_behavioral of entity blk_mem_gen_v8_2.BLK_MEM_GEN_v8_2_output_stage [\BLK_MEM_GEN_v8_2_output_stage("...]
    Compiling architecture output_stage_behavioral of entity blk_mem_gen_v8_2.BLK_MEM_GEN_v8_2_output_stage [\BLK_MEM_GEN_v8_2_output_stage("...]
    Compiling architecture softecc_output_reg_stage_behavioral of entity blk_mem_gen_v8_2.BLK_MEM_GEN_v8_2_softecc_output_r​eg_stage [\BLK_MEM_GEN_v8_2_softecc_output...]
    Compiling architecture mem_module_behavioral of entity blk_mem_gen_v8_2.BLK_MEM_GEN_v8_2_mem_module [\BLK_MEM_GEN_v8_2_mem_module("bl...]
    Compiling architecture behavioral of entity blk_mem_gen_v8_2.blk_mem_gen_v8_2 [\blk_mem_gen_v8_2("blk_mem_gen_v...]
    Compiling architecture implementation of entity lib_bmg_v1_0.blk_mem_gen_wrapper [\blk_mem_gen_wrapper("kintex7","...]
    Compiling architecture output_stage_behavioral of entity blk_mem_gen_v8_2.BLK_MEM_GEN_v8_2_output_stage [\BLK_MEM_GEN_v8_2_output_stage("...]
    Compiling architecture output_stage_behavioral of entity blk_mem_gen_v8_2.BLK_MEM_GEN_v8_2_output_stage [\BLK_MEM_GEN_v8_2_output_stage("...]
    Compiling architecture softecc_output_reg_stage_behavioral of entity blk_mem_gen_v8_2.BLK_MEM_GEN_v8_2_softecc_output_r​eg_stage [\BLK_MEM_GEN_v8_2_softecc_output...]
    Compiling architecture mem_module_behavioral of entity blk_mem_gen_v8_2.BLK_MEM_GEN_v8_2_mem_module [\BLK_MEM_GEN_v8_2_mem_module("bl...]
    Compiling architecture behavioral of entity blk_mem_gen_v8_2.blk_mem_gen_v8_2 [\blk_mem_gen_v8_2("blk_mem_gen_v...]
    Compiling architecture implementation of entity lib_bmg_v1_0.blk_mem_gen_wrapper [\blk_mem_gen_wrapper("kintex7","...]
    Compiling architecture rtl of entity axi_ethernet_buffer_v2_0.rx_mem_if [\rx_mem_if(16384,11,8192,10,"kin...]
    Compiling architecture behavioral of entity fifo_generator_v12_0.fifo_generator_v12_0_bhv_ss [\fifo_generator_v12_0_bhv_ss("ki...]
    Compiling architecture behavioral of entity fifo_generator_v12_0.fifo_generator_v12_0_bhv_prel​oad0 [\fifo_generator_v12_0_bhv_preloa...]
    Compiling architecture behavioral of entity fifo_generator_v12_0.fifo_generator_v12_0_conv [\fifo_generator_v12_0_conv(1,0,6...]
    Compiling architecture behavioral of entity fifo_generator_v12_0.fifo_generator_vhdl_beh [\fifo_generator_vhdl_beh(1,0,6,"...]
    Compiling architecture xilinx of entity fifo_generator_v12_0.fifo_generator_v12_0 [\fifo_generator_v12_0(1,0,6,"Bla...]
    Compiling architecture implementation of entity axi_ethernet_buffer_v2_0.basic_sfifo_fg [\basic_sfifo_fg(36,32,1,6,0,2,1,...]
    Compiling architecture rtl of entity axi_ethernet_buffer_v2_0.rx_axistream_if [\rx_axistream_if(16384,11,8192,1...]
    Compiling architecture rtl of entity axi_ethernet_buffer_v2_0.rx_if [\rx_if("kintex7",0,0,16384,0,0,0...]
    Compiling architecture rtl of entity axi_ethernet_buffer_v2_0.tx_basic_if [\tx_basic_if("kintex7",0,0,16384...]
    Compiling architecture rtl of entity axi_ethernet_buffer_v2_0.tx_axistream_if [\tx_axistream_if("kintex7",0,0,1...]
    Compiling architecture output_stage_behavioral of entity blk_mem_gen_v8_2.BLK_MEM_GEN_v8_2_output_stage [\BLK_MEM_GEN_v8_2_output_stage("...]
    Compiling architecture output_stage_behavioral of entity blk_mem_gen_v8_2.BLK_MEM_GEN_v8_2_output_stage [\BLK_MEM_GEN_v8_2_output_stage("...]
    Compiling architecture mem_module_behavioral of entity blk_mem_gen_v8_2.BLK_MEM_GEN_v8_2_mem_module [\BLK_MEM_GEN_v8_2_mem_module("bl...]
    Compiling architecture behavioral of entity blk_mem_gen_v8_2.blk_mem_gen_v8_2 [\blk_mem_gen_v8_2("blk_mem_gen_v...]
    Compiling architecture implementation of entity lib_bmg_v1_0.blk_mem_gen_wrapper [\blk_mem_gen_wrapper("kintex7","...]
    Compiling architecture output_stage_behavioral of entity blk_mem_gen_v8_2.BLK_MEM_GEN_v8_2_output_stage [\BLK_MEM_GEN_v8_2_output_stage("...]
    Compiling architecture softecc_output_reg_stage_behavioral of entity blk_mem_gen_v8_2.BLK_MEM_GEN_v8_2_softecc_output_r​eg_stage [\BLK_MEM_GEN_v8_2_softecc_output...]
    Compiling architecture mem_module_behavioral of entity blk_mem_gen_v8_2.BLK_MEM_GEN_v8_2_mem_module [\BLK_MEM_GEN_v8_2_mem_module("bl...]
    Compiling architecture behavioral of entity blk_mem_gen_v8_2.blk_mem_gen_v8_2 [\blk_mem_gen_v8_2("blk_mem_gen_v...]
    Compiling architecture implementation of entity lib_bmg_v1_0.blk_mem_gen_wrapper [\blk_mem_gen_wrapper("kintex7","...]
    Compiling architecture imp of entity axi_ethernet_buffer_v2_0.tx_mem_if [\tx_mem_if("kintex7",9,9,16384,1...]
    Compiling architecture rtl of entity axi_ethernet_buffer_v2_0.tx_emac_if [\tx_emac_if("kintex7",0,16384,0,...]
    Compiling architecture imp of entity axi_ethernet_buffer_v2_0.tx_if [\tx_if("kintex7",0,0,16384,0,0,0...]
    Compiling architecture imp of entity axi_ethernet_buffer_v2_0.axi_ethernet_buffer_v2_0 [\axi_ethernet_buffer_v2_0("kinte...]
    Compiling architecture bd_0_eth_buf_0_arch of entity xil_defaultlib.bd_0_eth_buf_0 [bd_0_eth_buf_0_default]
    Compiling architecture mmcme2_adv_v of entity unisim.MMCME2_ADV [\MMCME2_ADV("OPTIMIZED",5.0,0.0,...]
    Compiling architecture bufgce_v of entity unisim.BUFGCE [\BUFGCE("SYNC",'0','0')(1,4)\]
    Compiling architecture xilinx of entity tri_mode_ethernet_mac_v8_3.bd_0_eth_mac_0_support_​clocking [bd_0_eth_mac_0_support_clocking_...]
    Compiling architecture fdpe_v of entity unisim.FDPE [\FDPE('1','0','0','0')\]
    Compiling architecture rtl of entity tri_mode_ethernet_mac_v8_3.bd_0_eth_mac_0_block_re​set_sync [\bd_0_eth_mac_0_block_reset_sync...]
    Compiling architecture structural of entity tri_mode_ethernet_mac_v8_3.bd_0_eth_mac_0_block_sy​nc_block [\bd_0_eth_mac_0_block_sync_block...]
    Compiling architecture xilinx of entity tri_mode_ethernet_mac_v8_3.bd_0_eth_mac_0_support_​resets [bd_0_eth_mac_0_support_resets_de...]
    Compiling architecture idelayctrl_v of entity unisim.IDELAYCTRL [idelayctrl_default]
    Compiling architecture rtl of entity tri_mode_ethernet_mac_v8_3.bd_0_eth_mac_0_clk_en_g​en [bd_0_eth_mac_0_clk_en_gen_defaul...]
    Compiling architecture iddr_v of entity unisim.IDDR [\IDDR("SAME_EDGE_PIPELINED",'0',...]
    Compiling architecture iobuf_v of entity unisim.IOBUF [\IOBUF(12,true,"DEFAULT","SLOW")...]
    Compiling architecture obuf_v of entity unisim.OBUF [\OBUF("DONT_CARE",12,"DEFAULT","...]
    Compiling architecture ibuf_v of entity unisim.IBUF [\IBUF("DONT_CARE","0",true,"AUTO...]
    Compiling architecture oddr_v of entity unisim.ODDR [\ODDR("SAME_EDGE",'0','0','0','0...]
    Compiling architecture bufio_v of entity unisim.BUFIO [bufio_default]
    Compiling architecture bufr_v of entity unisim.BUFR [\BUFR("BYPASS","VIRTEX4")(1,6,1,...]
    Compiling architecture idelaye2_v of entity unisim.IDELAYE2 [\IDELAYE2("FALSE","IDATAIN","FAL...]
    Compiling architecture phy_if of entity tri_mode_ethernet_mac_v8_3.bd_0_eth_mac_0_rgmii_v2​_0_if [bd_0_eth_mac_0_rgmii_v2_0_if_def...]
    Compiling architecture imp of entity tri_mode_ethernet_mac_v8_3.bd_0_eth_mac_0_counter_​f [\bd_0_eth_mac_0_counter_f(6,"nof...]
    Compiling architecture imp of entity tri_mode_ethernet_mac_v8_3.bd_0_eth_mac_0_pselect_​f [\bd_0_eth_mac_0_pselect_f(0,11,"...]
    Compiling architecture imp of entity tri_mode_ethernet_mac_v8_3.bd_0_eth_mac_0_address_​decoder [\bd_0_eth_mac_0_address_decoder(...]
    Compiling architecture rtl of entity tri_mode_ethernet_mac_v8_3.bd_0_eth_mac_0_slave_at​tachment [\bd_0_eth_mac_0_slave_attachment...]
    Compiling architecture rtl of entity tri_mode_ethernet_mac_v8_3.bd_0_eth_mac_0_axi_lite​_ipif [\bd_0_eth_mac_0_axi_lite_ipif(32...]
    Compiling architecture rtl of entity tri_mode_ethernet_mac_v8_3.bd_0_eth_mac_0_axi4_lit​e_ipif_wrapper [\bd_0_eth_mac_0_axi4_lite_ipif_w...]
    Compiling architecture rtl of entity tri_mode_ethernet_mac_v8_3.bd_0_eth_mac_0_vector_d​ecode [bd_0_eth_mac_0_vector_decode_def...]
    Compiling architecture rtl of entity tri_mode_ethernet_mac_v8_3.tri_mode_ethernet_mac_v​8_3_sync_reset [tri_mode_ethernet_mac_v8_3_sync_...]
    Compiling module tri_mode_ethernet_mac_v8_3.tri_mode_ethernet_mac_v​8_3_gmii_...
    Compiling module tri_mode_ethernet_mac_v8_3.tri_mode_ethernet_mac_v​8_3_gmii_...
    Compiling module tri_mode_ethernet_mac_v8_3.tri_mode_ethernet_mac_v​8_3_ipic_...
    Compiling module tri_mode_ethernet_mac_v8_3.tri_mode_ethernet_mac_v​8_3_tx_ax...
    Compiling module tri_mode_ethernet_mac_v8_3.tri_mode_ethernet_mac_v​8_3_rx_ax...
    Compiling module tri_mode_ethernet_mac_v8_3.tri_mode_ethernet_mac_v​8_3_rx_cn...
    Compiling module unisims_ver.LUT4
    Compiling module tri_mode_ethernet_mac_v8_3.tri_mode_ethernet_mac_v​8_3_tx_cn...
    Compiling module tri_mode_ethernet_mac_v8_3.tri_mode_ethernet_mac_v​8_3_pfc_t...
    Compiling module tri_mode_ethernet_mac_v8_3.tri_mode_ethernet_mac_v​8_3_rx_sy...
    Compiling architecture structural of entity tri_mode_ethernet_mac_v8_3.tri_mode_ethernet_mac_v​8_3_sync_block [tri_mode_ethernet_mac_v8_3_sync_...]
    Compiling module tri_mode_ethernet_mac_v8_3.tri_mode_ethernet_mac_v​8_3_tx_pa...
    Compiling module tri_mode_ethernet_mac_v8_3.tri_mode_ethernet_mac_v​8_3_contr...
    Compiling architecture muxcy_v of entity unisim.MUXCY [muxcy_default]
    Compiling architecture fdce_v of entity unisim.FDCE [\FDCE('0','0','0','0')\]
    Compiling architecture lut2_v of entity unisim.LUT2 [\LUT2("1000")(0,3)\]
    Compiling architecture xorcy_v of entity unisim.XORCY [xorcy_default]
    Compiling architecture schematic of entity tri_mode_ethernet_mac_v8_3.CC8CE [cc8ce_default]
    Compiling architecture schematic of entity tri_mode_ethernet_mac_v8_3.CC2CE [cc2ce_default]
    Compiling architecture rtl of entity tri_mode_ethernet_mac_v8_3.CRC_64_32 [crc_64_32_default]
    Compiling architecture structural of entity tri_mode_ethernet_mac_v8_3.tri_mode_ethernet_mac_v​8_3_sync_block [\tri_mode_ethernet_mac_v8_3_sync...]
    Compiling architecture rtl of entity tri_mode_ethernet_mac_v8_3.CRC32_8 [crc32_8_default]
    Compiling architecture rtl of entity tri_mode_ethernet_mac_v8_3.TX_STATE_MACH [\TX_STATE_MACH(false,0)\]
    Compiling architecture srl16e_v of entity unisim.SRL16E [\SRL16E("0000000000000000",'0')(...]
    Compiling architecture rtl of entity tri_mode_ethernet_mac_v8_3.tri_mode_ethernet_mac_v​8_3_tx [\tri_mode_ethernet_mac_v8_3_tx(0...]
    Compiling architecture rtl of entity tri_mode_ethernet_mac_v8_3.STATE_MACHINES [state_machines_default]
    Compiling architecture rtl of entity tri_mode_ethernet_mac_v8_3.DECODE_FRAME [decode_frame_default]
    Compiling architecture rtl of entity tri_mode_ethernet_mac_v8_3.PARAM_CHECK [\PARAM_CHECK(false)\]
    Compiling architecture rtl of entity tri_mode_ethernet_mac_v8_3.tri_mode_ethernet_mac_v​8_3_rx [\tri_mode_ethernet_mac_v8_3_rx(0...]
    Compiling module tri_mode_ethernet_mac_v8_3.tri_mode_ethernet_mac_v​8_3_confi...
    Compiling module tri_mode_ethernet_mac_v8_3.tri_mode_ethernet_mac_v​8_3_miim
    Compiling module tri_mode_ethernet_mac_v8_3.tri_mode_ethernet_mac_v​8_3_manag...
    Compiling module tri_mode_ethernet_mac_v8_3.tri_mode_ethernet_mac_v​8_3_int_c...
    Compiling architecture ram64x1d_v of entity unisim.RAM64X1D [\RAM64X1D("000000000000000000000...]
    Compiling architecture rtl of entity tri_mode_ethernet_mac_v8_3.increment_controller [increment_controller_default]
    Compiling architecture rtl of entity tri_mode_ethernet_mac_v8_3.tri_mode_ethernet_mac_v​8_3_sync_reset [\tri_mode_ethernet_mac_v8_3_sync...]
    Compiling architecture rtl of entity tri_mode_ethernet_mac_v8_3.pre_accumulator [pre_accumulator_default]
    Compiling architecture rtl of entity tri_mode_ethernet_mac_v8_3.tri_mode_ethernet_mac_v​8_3_statistics_core [\tri_mode_ethernet_mac_v8_3_stat...]
    Compiling module unisims_ver.RAM64X1D
    Compiling module tri_mode_ethernet_mac_v8_3.tri_mode_ethernet_mac_v​8_3_addr_...
    Compiling module unisims_ver.x_lut3_mux4
    Compiling module unisims_ver.LUT3
    Compiling module unisims_ver.SRL16E
    Compiling module tri_mode_ethernet_mac_v8_3.tri_mode_ethernet_mac_v​8_3_addr_...
    Compiling module tri_mode_ethernet_mac_v8_3.tri_mode_ethernet_mac_v​8_3_addr_...
    Compiling module tri_mode_ethernet_mac_v8_3.tri_mode_ethernet_mac_v​8_3(C_S_A...
    Compiling architecture wrapper of entity tri_mode_ethernet_mac_v8_3.bd_0_eth_mac_0_block [bd_0_eth_mac_0_block_default]
    Compiling architecture wrapper of entity tri_mode_ethernet_mac_v8_3.bd_0_eth_mac_0_support [bd_0_eth_mac_0_support_default]
    Compiling architecture wrapper of entity xil_defaultlib.bd_0_eth_mac_0 [bd_0_eth_mac_0_default]
    Compiling architecture structure of entity xil_defaultlib.bd_0 [bd_0_default]
    Compiling architecture gigabit_ethernet_arch of entity xil_defaultlib.gigabit_ethernet [gigabit_ethernet_default]
    Compiling module xil_defaultlib.gigabit_ethernet_support
    Compiling module unisims_ver.IBUFDS
    Compiling module unisims_ver.BUFG
    Compiling module unisims_ver.MMCME2_ADV(CLKIN1_PERIOD=5.0,CLK...
    Compiling module xil_defaultlib.gigabit_ethernet_clk_wiz
    Compiling module unisims_ver.ffsrce_fdpe
    Compiling module unisims_ver.FDPE
    Compiling module xil_defaultlib.gigabit_ethernet_reset_sync
    Compiling module xil_defaultlib.gigabit_ethernet_clocks_resets
    Compiling module unisims_ver.sffsrce_fdre
    Compiling module unisims_ver.FDRE
    Compiling module xil_defaultlib.gigabit_ethernet_bit_sync
    Compiling module xil_defaultlib.gigabit_ethernet_fifo(DATA=37)
    Compiling module xil_defaultlib.gigabit_ethernet_slave_loopback
    Compiling module xil_defaultlib.gigabit_ethernet_packet_gen
    Compiling module xil_defaultlib.gigabit_ethernet_packet_chk_defa...
    Compiling module xil_defaultlib.gigabit_ethernet_streaming_gener...
    Compiling module xil_defaultlib.gigabit_ethernet_axi_lite_ctrl
    Compiling module xil_defaultlib.gigabit_ethernet_example_design
    Compiling module xil_defaultlib.gigabit_ethernet_demo_tb_v(TB_MO...
    Compiling architecture imp of entity xil_defaultlib.gigabit_ethernet_demo_tb
    Built simulation snapshot gigabit_ethernet_demo_tb_behav
    Could not remove the obj directory: boost::filesystem::remove: The directory is not empty: "xsim.dir/gigabit_ethernet_demo_tb_behav/obj"







    Solved!
    Go to Solution.

    DB:2.40:Vivado 2014.4 Simulation: Could Not Remove The Obj Directory z7

    Hi,Thanks for posting the solution. Please mark your post as solution.



    Thanks,Vijay--------------------------------------------------------------------------------------------Please mark the post as an answer "Accept as solution" in case it helped resolve your query.Give kudos in case a post in case it guided to the solution.

  • RELEVANCY SCORE 2.40

    DB:2.40:Problems Compiling With Vs 2010 m3


    I use version 10.2.0.1.0 of Pro*C and I'm trying to point to VS 2010 Express header files.

    When I run proc i get error:
    PCC-S-02201, Encountered the symbol "__w64" in file vadefs.h.

    Is there any way around this?

    DB:2.40:Problems Compiling With Vs 2010 m3

    You can also instruct the precompiler to avoid parsing a particular header file. e.g.

    #ifndef ORA_PROC
    #include vadefs.h
    #endif