• RELEVANCY SCORE 3.83

    DB:3.83:Getting Strange Error Message ka




    Please help. Getting this error message on running JSP:

    JBO-33005: Configuration KATSServiceLocal not found

    DB:3.83:Getting Strange Error Message ka

    This error I discovered was due to accidentally blowing away bc4j.xml contents. Problem solved.

  • RELEVANCY SCORE 3.69

    DB:3.69:Strange Error Message xd





    I keep getting an enexpected error message when i try to convert a pdf to word

    DB:3.69:Strange Error Message xd


    I keep getting an enexpected error message when i try to convert a pdf to word

  • RELEVANCY SCORE 3.47

    DB:3.47:Getting Strange Error Message When Using Scanner Utility 1m




    i'm getting the error message:
    "cannot resolve symbol class Scanner"
    I'm doing some computer science homework and need to compile this and work on it now can anyone help me out? Love always, Nicole

    DB:3.47:Getting Strange Error Message When Using Scanner Utility 1m

    Did you put this at the top of the script:

    import java.util.Scanner;

    Then you want:

    Scanner inputin = new Scanner(System.in);
    int input = inputin.nextInt();

    Then you could have:
    System.out.println("The number you entered was " + input);

    Hope this helps :)

  • RELEVANCY SCORE 3.36

    DB:3.36:Error In Md03- f9



    Hi folks,

    I am getting a strange error while I try planning run in MD03.

    Message is Plant does not exists(Error no 61601)

    Application area 61.Message number 601.

    Material exists in the plant.MRP is activated in plant and parametrs are maintained in the plant.

    What would be the cause for this error.

    Regards,

    Deepak.

    DB:3.36:Error In Md03- f9


    Hello

    I have created the following note, which explains possible reasons for this error:

    1521177 - Error message '61601 - Plant does not exist' triggered on the MRP run

    BR

    Caetano

  • RELEVANCY SCORE 3.36

    DB:3.36:Getting Error Message Regarding Msvcr80.Dll kz


    getting error message when trying to reinstall itunes

    DB:3.36:Getting Error Message Regarding Msvcr80.Dll kz

    Thank you! Thank you! I developed a lot of new grey hairs this morning trying to download the latest "upgrade" but running it as Admin worked.

  • RELEVANCY SCORE 3.31

    DB:3.31:Unable To Start Ifs On Solaris-Corba Error zd


    Hello,

    I am getting a strange message when I try to start the ifs service:

    Unable to start iFS ServerManager
    org/omg/CORBA/UserException

    Any ideas?

    Thanks in advance,
    Scott

    DB:3.31:Unable To Start Ifs On Solaris-Corba Error zd

    Read this:
    http://technet.oracle.com:89/ubb/Forum36/HTML/000035.html

  • RELEVANCY SCORE 3.30

    DB:3.30:Accepted The Software Update And Now Mail Won't Open. jj


    I allowed the software update and now I'm getting an error message when I try to open mail. I went into applications and there a strange icon for mail but when I click it, it doesn't open. Help!!Thanks,Cindy

    DB:3.30:Accepted The Software Update And Now Mail Won't Open. jj

    I allowed the software update and now I'm getting an error message when I try to open mail. I went into applications and there a strange icon for mail but when I click it, it doesn't open. Help!!Thanks,Cindy

  • RELEVANCY SCORE 3.26

    DB:3.26:Error Message: Could Not Find A Part Of The Path Us Bing Tablet Tablet_Volumein Diagnostic_Model_Output_Raw.Csv zf


    Hello. I am getting a strange error in a score model module (though I've seen it yesterday in the same experiment in Project Columns module). The error says:

    Status Code: Failed

    DB:3.26:Error Message: Could Not Find A Part Of The Path Us Bing Tablet Tablet_Volumein Diagnostic_Model_Output_Raw.Csv zf

    Yes, apologies

    It is a function of the internal compute worker that was selected from the fabric rather than your experiment/modules - we are working on taking the affected nodes out of rotation.

    AK

  • RELEVANCY SCORE 3.25

    DB:3.25:Control Panel Error Message... aj




    Im using win2kpro on a p4 mobo.

    I keep getting this strange control panel error message all the time when i try to reach the "msi information" tab and the "msi clock" tab, it says:

    "An error occurred while windows was working with the control panel file c:winntsystem32desk.cpl"

    anyone with the same problem? what should i do?

    ?( ?( ?(

    DB:3.25:Control Panel Error Message... aj


    I had this when updating detonator drivers for my GeForce Ti4200. Solution is to uninstall your video drivers in Control Panel - Add/Remove Programs, reboot, then re-install your video drivers.

    Worked for me )

  • RELEVANCY SCORE 3.23

    DB:3.23:Error Message Failed To Initialize Shared Canvas In Live Mail 9k


    When running live mail getting error message.

    Failed to initialize shared Canvas: System. IO.FileNotFoundException

    Follow by a long text with strange error messages.

    This is having the effect that im not able to create e-mail in live.

    What should i do?

    Im using Windows Vista

    DB:3.23:Error Message Failed To Initialize Shared Canvas In Live Mail 9k

    Wonderful answers - difficult to follow if you are a simple user. Please explain step by step.

  • RELEVANCY SCORE 3.20

    DB:3.20:Error Opening Connection pz



    Post Author: tosch

    CA Forum: Data Connectivity and SQL

    I'm getting a very strange message on one of my clients machines when setting the table locations:System.Runtime.InteropServices.COMException (0x800002F4): Error opening connectionDetails: #91;Database provider code: 17#93;..... What could this message mean? Thomas

    DB:3.20:Error Opening Connection pz


    Post Author: tosch

    CA Forum: Data Connectivity and SQL

    I'm getting a very strange message on one of my clients machines when setting the table locations:System.Runtime.InteropServices.COMException (0x800002F4): Error opening connectionDetails: #91;Database provider code: 17#93;..... What could this message mean? Thomas

  • RELEVANCY SCORE 3.20

    DB:3.20:'Ghost' Usb Drive ax


    Hi,

    Having a strange problem on my Mac. I once had a usb stick drive which I accidentally removed without 'ejecting' it first. Since then I keep getting the following error message when no device is present:

    Disk Insertion
    The disk you inserted was not readable by this computer
    Initalize/Ignore/Eject

    Unfortunately the error message appears at random times during the day.
    I just click Ignore and the message disappears.

    All very strange.

    Does anyone know a way I can clear whatever setting is causing this? Thanks.

    DB:3.20:'Ghost' Usb Drive ax

    I have a similar problem. Have you found a solution? My USB drive stopped "seeing" any of my flash drives.

  • RELEVANCY SCORE 3.20

    DB:3.20:Im Getting Error Message As Windows Components Must Be Repaired While Installing Updates And Re-Directs To Strange Websites When Searching On Internet. xc


    Original title : windows update won't install, message says that components must be repaired. "Fix-it" did not resolve the issue. How do I repair components and download update?
    was trying to update windows, and was blocked. also had difficulty getting to a correct microsoft site, as my system seemd to be redirecting my search to strange websites.

    DB:3.20:Im Getting Error Message As Windows Components Must Be Repaired While Installing Updates And Re-Directs To Strange Websites When Searching On Internet. xc

    Hi,
    1. Have you made any changes to the computer prior to this issue?
    2. What is the exact error message?
    3. Are you using Internet Explorer? If yes, which version of Internet Explorer are you using?
    Find out which version of Internet Explorer you're using http://windows.microsoft.com/en-US/windows7/Find-out-which-version-of-Internet-Explorer-youre-using
    You may follow the suggestions and check.
    Method 1
    It seems that your computer is infected from virus, let’s run a complete virus scan using Microsoft Safety Scanner from the link.
    Microsoft Safety Scanner
    http://www.microsoft.com/security/scanner/en-au/default.aspx
    Note: The Microsoft Safety Scanner expires 10 days after being downloaded. To rerun a scan with the latest anti-malware definitions, download and run the Microsoft Safety Scanner. If Scanner finds any infected files, it may delete it and the data will be
    lost.

    Method 2
    You may follow the steps from the article.
    How to troubleshoot problems connecting to Windows Update or to Microsoft Update
    http://support.microsoft.com/kb/818018

    Also see:
    Troubleshoot common installation issues in Windows Update, Microsoft Update, and Windows Server Update Services
    http://support.microsoft.com/kb/906602

  • RELEVANCY SCORE 3.20

    DB:3.20:Getting Strange Error Messages During Burning Process k1


    All of the sudden I have been getting some strange Error messages when I am trying to burn a DVD. This happens during the Multiplexing/Burn Process. It ejects my DVD without burning anything onto it.

    I exported another file of the same project from FCP and proceeded to create another DVD. Still got the Error message.

    I then dragged the iDVD Preference file to the trash and attempted to create yet another DVD and STILL got the error message.

    What do I need to do to troubleshoot this further? Where could the error be coming from?

    Thanks!

    DB:3.20:Getting Strange Error Messages During Burning Process k1

    Michele

    Please start a new post and i will gladly help. that way your concern will get the attention it deserves w/o thread jacking or taking away from the original poster. (otherwise things can get very confusing, even tho you feel this is the very same issue ..... it might be slightly different).

  • RELEVANCY SCORE 3.19

    DB:3.19:Getting Strange Error While Trying To Search For Missing Vis jc



    So when I load the top-level VI, many of the subVIs have changed location, but they are all below the top level VI, and I have topvi/* set as my first search option so it should find them no problem. But during loadin I keep getting this error message:

    I press okay for how many ever times I need to, then there are mannny errors. All the errors pertain to it not being able to find a "valid type def".

    What is the deal with that error message, and why can't it find valid type defs, they are all there, they have moved but they are within the configured search paths.

    Thanks for any help

    DB:3.19:Getting Strange Error While Trying To Search For Missing Vis jc


    I think I figured out whats going on here. The VIs actually weren't in directories below the topvi, so that explains why it couldn't find them. And the error message I think is becasue the next search path on the list after topvi and topvi\* is foundvi and foundvi\* but this found vi paths only get populated when you show LabVIEW where to look for a missing VI. Since, there was no opportunity to show LabVIEW where a missing VI was, the found vi paths were nonexistent. I believe that this is what caused the errror message. There should be some error checking implemented here within labview if no found vi paths exist.... Maybe this is already in future versions, still useing 8.5...

  • RELEVANCY SCORE 3.18

    DB:3.18:Error Occured During Query Execution... Strange Error pp


    I'm getting this strange error when I run a DQL query to change an ACL. The query is:update dm_sysobject (ALL) object set acl_name = 'system_acl'set acl_domain = 'docpri01'where acl_name = 'dm_450042a680000101'The error is:Error occured during query execution :[DM_QUERY_F_UP_SAVE]fatal: "UPDATE: An error has occurred during a save operation."[DM_LOCATION_E_SAVE]error: "Save of DM_LOCATION (verity_loc) failed."[DM_LOCATION_E_CREATE_DIRECTORY]error: "Creation of file system directory for DM_LOCATION (verity_loc) failed. Operating System failed to create directory (/dmadmin/product/4.2.8/verity). Operating System error was ( errno: 2, message: No such file or directory)"The version is 5.2.5 SP3.Any ideas?ThanksMessage was edited by: dgower

  • RELEVANCY SCORE 3.18

    DB:3.18:Another Strange Error Message sx


    I keep getting the following error message "The iTunes library cannot be saved. An unknown error occurred (-50)."

    Although it says that the library cannot be saved, my new podcasts Are saved. I reinstalled the latest version of iTunes but I'm still getting that annoying message. It pops up every minute or so.

    Any suggestions? This just started with the latest version of iTunes.

    DB:3.18:Another Strange Error Message sx

    I keep getting the following error message "The iTunes library cannot be saved. An unknown error occurred (-50)."

    Although it says that the library cannot be saved, my new podcasts Are saved. I reinstalled the latest version of iTunes but I'm still getting that annoying message. It pops up every minute or so.

    Any suggestions? This just started with the latest version of iTunes.

  • RELEVANCY SCORE 3.15

    DB:3.15:Error Message At Startup Satellite P505-S8980 ka



    I bought my machine 2 weeks ago and am already getting a strange error message. At startup, the screen flashes and says one of my drives needs to be checked for consistency.

    What is causing this problem on a brand new computer? Someone help!

    DB:3.15:Error Message At Startup Satellite P505-S8980 ka


    Could be a failing hard drive (new equipment does fail at times). Could be corrupted files. Try running chkdsk and system file checker.

    http://www.w7forums.com/use-chkdsk-check-disk-t448​.html

    http://www.sevenforums.com/tutorials/1538-sfc-scan​now-command-system-file-checker.html

    To test the hard drive determine what brand of hard drive you have. You can check the Bios/Setup to find out or run SIW or Belarc Advisor. Go to that manufacturer's support site and download their Self Booting Diagnostic CD ISO image, create the CD using the Burn From Image option (see http://iso.snoekonline.com/iso.htm for more information on doing this), then boot to it and run the most exhaustive tests available. If you have a Toshiba or a Hitachi hard drive you won't be able to do this as the Hitachi Drive Fitnes Test will not run on your chipset. Hitachi is working on the problem with DFT while Toshiba doesn't think their customers are capable of running a hard drive diagnostic program to test their own hard drive and expect you to send your entire laptop in to have them test it for you.




    -------------------------------------------------------------------------------------

    If you don't post your COMPLETE model number it's very difficult to assist you. Please try to post in complete sentences with punctuation, capitals, and correct spelling. Toshiba does NOT provide any direct support in these forums. All support is User to User in their spare time.

  • RELEVANCY SCORE 3.15

    DB:3.15:Error During Gr sx



    Hello,

    I am getting a strange error while creating a GR. It reads "PGI posting period later than GR posting period" Message N0 - M7 895.

    This is related to an STO. Delivery has been created and Goods Issued in October(Mvt type 641). Trying to create a GR against the STO now and getting this error.

    Regards,

    AG

    DB:3.15:Error During Gr sx


    Hello,

    I am getting a strange error while creating a GR. It reads "PGI posting period later than GR posting period" Message N0 - M7 895.

    This is related to an STO. Delivery has been created and Goods Issued in October(Mvt type 641). Trying to create a GR against the STO now and getting this error.

    Regards,

    AG

  • RELEVANCY SCORE 3.14

    DB:3.14:Error Message cd


    keep getting error message when opening i tunes

    DB:3.14:Error Message cd

    keep getting error message when opening i tunes

  • RELEVANCY SCORE 3.14

    DB:3.14:No Receiver Found 11



    hi,

    Getting the error "No receiver found; message stopped by has no errors". The scenario is JMS - IDOC. Have verified the RA and RD - everything looks fine. The interface is production, but the strange part is when it is executed, it picks up the service from quality. What is the reason for this? Pl help.

    thx.

    DB:3.14:No Receiver Found 11


    hi,

    Thanks guys.. the problem has been solved. Was passing the wrong parameters to the adapters. All works now. Thx.

  • RELEVANCY SCORE 3.14

    DB:3.14:Divide By Zero Or Overflow Error dx


    Hello, I'm getting a strange error message when I try and run a foxpro application by the name of "Donor Perfect"

    Error message is "Divide by zero or overflow error"

    This program will run on my other windows 2000 systems but will not run on any of my new dell systems.

    This leads me to believe it might possibly be a firmware issue.

    Any ideas?

    Thanks

    Paul

    DB:3.14:Divide By Zero Or Overflow Error dx

    Never mind I found it:

    You might try the patch that Microsoft has for FoxPro 2.6. When I first
    installed TMGW in my WIN2000 based PC I had a problem with a "Divide by
    Zero" error. The FoxPro 2.6 patch takes care of this issue.

    Go to the following website for details:

    http://support.microsoft.com/support/kb/articles/Q240/9/82.asp

  • RELEVANCY SCORE 3.12

    DB:3.12:Treemap Add-In Sending Me Strange Error Message 83


    When I try to use the excel treemap add-in I keep getting an error message.
    APP ERROR,
    SOrry, you seem to have lost your network and/or internet connection...

    Even though I haven't lost my connection...

    DB:3.12:Treemap Add-In Sending Me Strange Error Message 83

    When I try to use the excel treemap add-in I keep getting an error message.
    APP ERROR,
    SOrry, you seem to have lost your network and/or internet connection...

    Even though I haven't lost my connection...

  • RELEVANCY SCORE 3.12

    DB:3.12:Thread: Strange Message In /Var/Log/Messages 99


    I made my NSS volumes on an OES2 Linux domu guest a NFS share. I then run a copy routine to a NAS device. I started getting some errors on the NAS device about it being unable to copy a couple of files due to i/o errors. I was thinking the files were open during the copy and the NAS was having problems getting the file. However, when I look at the /var/log/messages I see this strange error kernel: readpage page did not match zReadChunks page. The other thing I notice is it starts to drop my swap memory available when I look in NRM. Anyone know what this error means and either how to stop it or at least stop having it use swap.

    Thanks for any help.

    DB:3.12:Thread: Strange Message In /Var/Log/Messages 99

    David,

    It appears that in the past few days you have not received a response to your

    posting. That concerns us, and has triggered this automated reply.

    Has your problem been resolved? If not, you might try one of the following options:

    - Visit http://support.novell.com and search the knowledgebase and/or check all

    the other self support options and support programs available.

    - You could also try posting your message again. Make sure it is posted in the

    correct newsgroup. (http://support.novell.com/forums)

    Be sure to read the forum FAQ about what to expect in the way of responses:

    http://support.novell.com/forums/faq_general.html

    If this is a reply to a duplicate posting, please ignore and accept our apologies

    and rest assured we will issue a stern reprimand to our posting bot.

    Good luck!

    Your Novell Product Support Forums Team

    http://support.novell.com/forums/

  • RELEVANCY SCORE 3.12

    DB:3.12:Error Message a1



    I am getting this strange error message on a 2621 XM router with AIM-VPN/BPII module.Below is the error:

    000044: *Feb 28 18:50:05.731 MST: %VPN_HW-1-PACKET_ERROR: slot: 0 Packet Encrypt

    ion/Decryption error, Output replay error(0x08000000)

    Can any one shed some ligh on this.

    DB:3.12:Error Message a1


    Check if you are encountering this bug CSCed77526.

  • RELEVANCY SCORE 3.11

    DB:3.11:11.1.1.3 Installation Issue cm


    Hi all

    I am getting strange error message

    could not utilize start class:com.installshield.wizard.wizard

    dont know and all the installation fails with this error

    Ramnag

    DB:3.11:11.1.1.3 Installation Issue cm

    yes Sandeep . it worked now
    thanks a lot

    Ramnag

  • RELEVANCY SCORE 3.11

    DB:3.11:Strange Error Message "Translators Not Loaded..." ad



    Hi. Suddenly - and for no reason - I'm getting this error message each and every time that I open, save, or close an html file:

    Any suggestions what might be causing this I don't user or edit - directly - any of the files that are mentioned.

    DB:3.11:Strange Error Message "Translators Not Loaded..." ad


    Try #`4 on this page:

    http://kb2.adobe.com/cps/191/tn_19105.html#dat

    if that does not help, try #12.


    --E. Michael Brandtwww.divahtml.comwww.divahtml.com/products/scripts_dreamweaver_extensions.phpStandards-compliant scripts and Dreamweaver Extensionswww.valleywebdesigns.com/vwd_Vdw.aspJustSo PictureWindowJustSo PhotoAlbum, et alia--

  • RELEVANCY SCORE 3.11

    DB:3.11:Strange Error Message dc


    I am getting a strange error message when updating the acl.The operation on PlavixTollFreeInventory0117.xls sysobject was unsuccessful because it is locked by user Jackson, Tan.I checked for the document through dql,search and manuallyand it's not in the docbase.I also checked with wher r_lock_owner in query and none of the documents were checked out, infact none of the documents were checked out in the folder where i am updating the acl.I am running on 4.2.8 DA.Thanks,Vasavi

    DB:3.11:Strange Error Message dc

    All,For time being i unlocked all the documents through api and updated the ACL.Thanks all of you for your kind support.Thanks,Vasavi

  • RELEVANCY SCORE 3.10

    DB:3.10:Message Type Acpjmm Error p1



    HI experts

    I'm getting a strange error while i try to post a goods receipt or goods issue. the message says

    receipients missing in Message type ACPJMM ( message B1003)

    The Idoc is passed through a ALE layer and the message is assigned with three receipients, either enter the receipients or deactivate the message.

    What's wrong in my system? i think this is a BASIS error. Kindly let me know the steps to correct this error.

    chetan

    DB:3.10:Message Type Acpjmm Error p1


    HI Rama Jyothi

    i solved the problem, Unchecked all the entries in Table TRWCA. But i wanna know the effects due to unchecking the check box in this table..

    chetan

  • RELEVANCY SCORE 3.10

    DB:3.10:Strange Error Message 3x


    Hello,

    I am using ADF 11g. After we deploy our application to weblogic site runs fine but after some time, we are getting below error message. Any ideas?

    Caused By: java.lang.ClassCastException: oracle.adf.controller.internal.binding.DCTaskFlowBinding cannot be cast to oracle.adf.controller.internal.binding.DCTaskFlowBinding
    at oracle.adf.controller.internal.binding.DCTaskFlowBindingDef.initializeExecutableBinding(DCTaskFlowBindingDef.java:301)
    at oracle.adf.model.binding.DCBindingContainerDef.createExecutables(DCBindingContainerDef.java:590)
    at oracle.adf.model.binding.DCBindingContainerDef.initializeBindingContainer(DCBindingContainerDef.java:728)
    at oracle.adf.model.binding.DCBindingContainerDef.createBindingContainer(DCBindingContainerDef.java:944)
    at oracle.adf.model.binding.DCBindingContainerReference.createBindingContainer(DCBindingContainerReference.java:152)

    DB:3.10:Strange Error Message 3x

    I am able to reproduce this error in JDev/ADF version 11.1.1.2.0, when running the Integrated WLS in Debug mode.
    In previous versions I was able to do small changes to the ADF Java code and when compiling the classes, those changes were picked up without restarting the server.
    I see this as productivity boost, especially when changing backing bean code.

    Unfortunately, in version 11.1.1.2.0, after compilation even if the 'appropriate' notification message appears in Log Window:

    Redefined all recompiled classes that are loaded in the debuggee process.
    +[02:25:54 AM] Updated /C:/Users/florin.marcus/AppData/Roaming/JDeveloper/system11.1.2.1.38.60.81/o.j2ee/drs/Application/ViewControllerWebApp.war/WEB-INF/classes+

    On next application click, the error appears:

    java.lang.ClassCastException: oracle.adf.controller.internal.binding.DCTaskFlowBindingDef cannot be cast to oracle.adf.controller.internal.binding.DCTaskFlowBindingDef

    Florin Marcus
    www.redsamuraiconsulting.com

  • RELEVANCY SCORE 3.10

    DB:3.10:Strange Error Message While Using Blackbox!!! p1



    hi

    i get this strange error message when i try to add black box and specify the vhdl design file.

    can't figureout how to deal with this problem.

    can somebody help...










    Attachments:




    DB:3.10:Strange Error Message While Using Blackbox!!! p1


    Hi sandeep,

    Sorry for a delay ...

    This is a code of wrapper :

    --------------------------------------------------​---------------------------------- Company:-- Engineer:---- Create Date: 09:00:16 26/06/2009-- Design Name:-- Module Name: tcc_decoder_3gpp_v3_1_wrapper - Behavioral-- Project Name:-- Target Devices:-- Tool versions:-- Description:---- Dependencies:---- Revision:-- Revision 0.01 - File Created-- Additional Comments:----------------------------------------------------​--------------------------------library IEEE;use IEEE.STD_LOGIC_1164.ALL;use IEEE.STD_LOGIC_ARITH.ALL;use IEEE.STD_LOGIC_UNSIGNED.ALL;---- Uncomment the following library declaration if instantiating---- any Xilinx primitives in this code.--library UNISIM;--use UNISIM.VComponents.all;entity tcc_decoder_3gpp_v3_1_wrapper is port ( ce : in std_logic; clk : in std_logic; fd_in : in std_logic; block_size : in std_logic_vector ( 12 downto 0 ); d_in : in std_logic_vector ( 14 downto 0 ); iterations : in std_logic_vector ( 3 downto 0 ); rfd : out std_logic; rdy : out std_logic; rffd : out std_logic; d_out : out std_logic_vector ( 0 downto 0 ) );end tcc_decoder_3gpp_v3_1_wrapper;architecture Behavioral of tcc_decoder_3gpp_v3_1_wrapper is -- -- Generate core with "Coregen", add pin "CE" to core for use in System Generator. -- component tcc_decoder_3gpp_v3_1 port ( ce : in std_logic; -- Default pin for system generator, please generate core with "CE" pin. clk : in std_logic; -- Default pin for system generator. fd_in : in std_logic; block_size : in std_logic_vector ( 12 downto 0 ); d_in : in std_logic_vector ( 14 downto 0 ); iterations : in std_logic_vector ( 3 downto 0 ); rfd : out std_logic; rdy : out std_logic; rffd : out std_logic; d_out : out std_logic_vector ( 0 downto 0 ) ); end component; -- Synplicity black box declaration attribute syn_black_box : boolean; attribute syn_black_box of tcc_decoder_3gpp_v3_1: component is true;begin TCC_DECODER : tcc_decoder_3gpp_v3_1

    port map ( ce = ce_int, clk = clk, fd_in = fd_in, block_size = block_size, d_in = d_in, iterations = iterations, rfd = rfd, rdy = rdy, rffd = rffd, d_out = d_out );end Behavioral;

    When you generate a IP Core with Coregen for System Generator do not forget the pin "CE".

    I have attached the file .mdl with IP core imported.

    Kappa
    Message Edited by secureasm on 06-26-2009 12:10 AM









    Attachments:







    tcc_decoder_3gpp_v3_1.rar ‏9 KB

  • RELEVANCY SCORE 3.10

    DB:3.10:Strange Error Message With Casio Devices On Local Peap Auth xk



    Dear all,

    I'm getting the following error message when doing a debug client on the controller:

    EAPOL-key M2 with invalid WPA IE received from mobile 00:21:e8:12:76:cb

    The client off course can not connect to the network sucessfully then....

    Has anyone seen this message or can explain what it means.

    regards

    Rupert

    DB:3.10:Strange Error Message With Casio Devices On Local Peap Auth xk


    Hello Rupert,

    Please mark the Question as Answered, if the provided information by George and Surendra is correct and it helped. By doing that others can take benefit as well.

    Thanks,

    Vinay Sharma

    Community Manager – Wireless

  • RELEVANCY SCORE 3.10

    DB:3.10:Document Refresh Error Message 18


    Hi Everyone,

    We are getting some strange error messages in our Document Refresh job from today morning and the Document Refresh and Search Update jobs are periodically failing or are getting interrupted during thier Run.

    The error message I get is something like below:

    Jun 17, 2010 1:17:09 AM- Error refreshing card "Pregnancy Exposure Form Instructions v3 19Mar2007" (with id 9722, and document URL https://home/portal/server.pt/gateway/PTARGS_0_9722_0_0_18/Pregnancy_Exposure_Instructions_Form_v3_19Mar2007.pdf) Server exception: -2147467259 - Error in function PTDataSource.RefreshCardInMemory (pCard == com.plumtree.server.impl.directory.PTCard@278576, bSummarize == false, bForceRefresh == false, pProvider == com.plumtree.server.impl.directory.providers.PTSoapProvider@270705): -2147467259 - Unable to download the file: File not found (-2147467259)

    DB:3.10:Document Refresh Error Message 18

    You could look for that card in the portal and find out what crawler imported it originally. Did it come from a web crawler or windows file crawler? When you find the crawler, then locate the content source (data source) to determine the user account being used for the crawl (this may not exist with a web crawler-but would exist with a windows file crawler. Remote into the automation server being logged in with the user from the content source. Now see if you can access the problem file in the crawl location from the automation server, whether it be a network share (ie \\servername\sharename\filename) or a web address (ie http://servername/filename). If you are unable to connect to the file this would explain why automation server is complaining about being "Unable to download the file: File not found". So this could very well be a permissions issue for that particular file. Beyond that you may need to troubleshoot even deeper by reproducing with a verbose job log and also a verbose ptspy and a wireshark from automation. Then open a technical support request if you need help analyzing these.

  • RELEVANCY SCORE 3.09

    DB:3.09:Issue In Viewing Properties Of Field For Rtf Template In Ms Word 2007 f1


    Hi

    Trying to view Properties of form field in rtf template in MS word 2007 getting strange messages like

    getting message as Invalid procedure call or argument

    Automation error Un specified error

    it was working fine couple of hours ago with out any issues.

    Kamalakar

    DB:3.09:Issue In Viewing Properties Of Field For Rtf Template In Ms Word 2007 f1

    After reinstalling MS office 2007 issue got resolved.

    Thanks
    Kamalakar

  • RELEVANCY SCORE 3.07

    DB:3.07:What Should I Do When I Can't Import Mp3 Audio Files Into My Flash Library? 9c



    Hi!

    I am currently working on a flash animation title sequence but for some strange reason I am unable to import the mp3 audio into my flash library. I keep getting an error message stating that it can not import.

    Signed,

    Confused animator ZagonGirl

    DB:3.07:What Should I Do When I Can't Import Mp3 Audio Files Into My Flash Library? 9c


    The file is protected with DRM, encoded oddly or whatever. Try to convert it in an external program.

    Mylenium

  • RELEVANCY SCORE 3.07

    DB:3.07:Mapping Error : Strange Problem dm



    Hi all,

    I am getting the mapping error in runtime.

    I have tested in message mapping. It is successful there.

    But I got the strange thing. When I change from design to test page and upload my XML file(from SXMB_MONI), all nodes in my structure are red! Now If I test the message mapping , I am getting the mapping error in SXMB_MONI.

    May someone has a idea what's going wrong...

    Thanks Regards,

    Sekhar.

    DB:3.07:Mapping Error : Strange Problem dm


    Hi,

    Looks like you are missing the ns0: namespace while trying to test the xml in the repository.

    Also make sure that the extra "-" that appears in the xml structure in sxmb_moni are removed before testing.

    Regards,

    Smitha.

  • RELEVANCY SCORE 3.07

    DB:3.07:Mapping Error 3x



    Hi Group,

    I am getting error in SXMB_MONI once after restarting the message in MONI interface message running successfully again next day it will be throwing error, can any body suggest why this strange behcaviour:

    this Error coming only for two flows:

    1.File to IDOC

    2,File to Proxy

    DB:3.07:Mapping Error 3x


    Hi,

    Try the above option for first interface as well (File --IDoc). Can you show the exact error so that will clarity?

    Error in IDOC Adapter Processing ...after this ???

    Regards

    Venkat

  • RELEVANCY SCORE 3.07

    DB:3.07:Why Am I Getting "To Update This Application, Sign In To The Account You Used To Purchase It" When I Try To Download The Imovie Update? xd


    This is strange. I have never recieved this error message on any other Software update. This is a two week old machine. Why is this happening?

    DB:3.07:Why Am I Getting "To Update This Application, Sign In To The Account You Used To Purchase It" When I Try To Download The Imovie Update? xd

    This is discussed in more detail here:https://discussions.apple.com/thread/2794280?tstart=30Alas, for me the solutions in that thread didn't work.(I am not able to update iMovie and iPhoto)I have a new iMac on which I restored a TM backup from my previous iMac.

  • RELEVANCY SCORE 3.05

    DB:3.05:Strange Error Message In Event Viewer 71





    I get every 30 minutes a strange warming/error message in my event viewer.
    The error is caused by a scheduled PHP script what runs every 30 minutes, the strange thing is that the PHP script itself is correct and does not error at all.

    This is the warming/error in the event viewer:

    Code:

    DB:3.05:Strange Error Message In Event Viewer 71




    I get every 30 minutes a strange warming/error message in my event viewer.
    The error is caused by a scheduled PHP script what runs every 30 minutes, the strange thing is that the PHP script itself is correct and does not error at all.

    This is the warming/error in the event viewer:

    Code:

  • RELEVANCY SCORE 3.05

    DB:3.05:Stsadm Backup Error Message mp


    Hi All,
    I am getting strange error message while taking backup from stsadm command. Following is the error message

    Cannot complete this action.
    Please try again.

    For your Information:
    I am using following stsadm command

    stsadm-o backup -url http://intranet -filename \\backupserver\intranet.back -overwrite

    DB:3.05:Stsadm Backup Error Message mp

    Dear Neerubee,

    First of all appreciate your prompt reply.
    As mentioned in your shared link. I want to ask is it safe to execute following command on live SharePoint environment ?
    ALTER DATABASE your_database_name SET SINGLE_USER WITH ROLLBACK IMMEDIATE
    DBCC CheckDB ('your_database_name', REPAIR_ALLOW_DATA_LOSS)
    ALTER DATABASE your_database_name SET MULTI_USER
    I want to confirmthis just to be on safe side. Is there is any critical data loss after executing this command ?

  • RELEVANCY SCORE 3.04

    DB:3.04:Mavericks Calendar Exchange Sync Issue kj


    I'm running OS X Mavericks and I'm having trouble syncing my calendar via Exchange. I keep getting an error message "Calendar can't connect to the account "my email account"". What is strange is that my emails are working fine. I have tried numerous times to re-enter my password but it's not working.Appreciate your help.

    DB:3.04:Mavericks Calendar Exchange Sync Issue kj

    Hi Linc,I am having the same problem. I am using my company's exchange server for mail and calendar. The former works, the latter doesn't on Mac OS X Mavericks and Yosemite. However, on the iPhone the is no problem at all. We had many Exchange problems recently and nothing worked. Before everything was fine for me, after the fix everything works but Calendar. Any item added to my exchange calendar from webmail or my phone does not sync to Mac Calendar. However, if I add an event on my Mac, it is synced properly. Here is one entry of the log, I have many of them:22/10/14 13:23:01.718 CalendarAgent[1169]: WARNING: Skipped CalendarItem for itemID = AAMkAGM2Y2EzMmVkLWZhM2QtNDMxZi05NTQyLWM4Y2MwZjYxMmIzNwFRAAgIzvFWqF2AAEYAAAAA36I 7vflkK02cJwxWlYcUkQcAV5QmYQ6DRk2Em7Xh6Yt0BAAAAiNALAAAVkHD02INf0+1SzC/aNtItgBzDIk JAgAAEA==. Error Code = 13What is interesting also is that I can access shared calendars but not my own.Thanks!

  • RELEVANCY SCORE 3.03

    DB:3.03:Arithmetic Overflow Error Converting Expression To Data Type Datetime 77



    Hi - I am getting this problem when loading data - 395417 records are loaded fine then this message occurs. The strange thing is that this same data has loaded perfectly well before - any ideas?

    (It is coming from a SQL view combining 2 tables with the same data types)

  • RELEVANCY SCORE 3.03

    DB:3.03:Figured It Out m3


    It has been fixed strange error message though.

    DB:3.03:Figured It Out m3

    It has been fixed strange error message though.

  • RELEVANCY SCORE 3.03

    DB:3.03:Receipients Missing In Message Type Acpjmm sp



    HI experts,

    I'm getting a strange error while i try to post a goods receipt or goods issue. the message says

    receipients missing in Message type ACPJMM ( message B1003)

    The Idoc is passed through a ALE layer and the message is assigned with three receipients, either enter the receipients or deactivate the message.

    Antony

    DB:3.03:Receipients Missing In Message Type Acpjmm sp


    Please help me with the procedure for soling my prlem since i am new to SAP MM.....

    Antony

  • RELEVANCY SCORE 3.02

    DB:3.02:Error In Read Statement jm



    Hello All,

    I am getting a strange error at READ table statement.

    Error is

    "

    Couldn't find Error Message: E READ 026 because the system is running

    with the database objects from release 701. The system has not

    completely upgraded to release 720."

    When I click on that error it navigates me to READ statement which is

    "

    READ TABLE GT_ZPP_BOM_INTRFC WITH KEY ZZNOTICENUM = fs_ZPP_BOM_INTRFC-ZZNOTICENUM

    ZZMATCRTSUC = 'FL'. "

    could some one please help.

    DB:3.02:Error In Read Statement jm


    Hi Jitendra Soni,

    See this link http://scn.sap.com/thread/3250284

  • RELEVANCY SCORE 3.02

    DB:3.02:Structural Authorization Fails In Very Strange Scenario am



    Hi,

    In my client place Org unit creation date, position creation date, O_S relationship maintainance date is 01.03.2011.

    Even hiring date is 01.03.2011.

    But whenever user is trying to hire he is getting an error message " No Permission for S 71089076.

    What can be the reason.

  • RELEVANCY SCORE 3.02

    DB:3.02:Why Am I Getting This Strange Error Message: k3


    I can't get any of my downloaded apps from the cloud to open: The following error message pops up:The procedure entry point GetLogicalProcessor Information could not be located in the dynamic link library KERNEL32.dllRunning XP on my laptopI see that the Application Manager loaded the CS6 apps into the same Adobe folder as my CS3 apps.Any ideas?

    DB:3.02:Why Am I Getting This Strange Error Message: k3

    I would recommend inquiring in the product specific forums for recommendations. The users there will have more real world experience to base their recommendations on.

  • RELEVANCY SCORE 3.02

    DB:3.02:Strange Jsp Compile Error 71


    I'm using JDev 9.0.3 on Win2k.

    I am getting a strange error when compiling a JSP:
    Error(10,10): Element taglib not complete, expected elements '[validator, listener, tag]'.

    The taglib element looks like this:
    %@ taglib uri="/webapp/DataTags.tld" prefix="jbo" %

    Any ideas why I would be getting this message?

    DB:3.02:Strange Jsp Compile Error 71

    Did you add this tag entry manually? I think the problem may be with your web.xml. Try generating a new data page from the BC4J JSP section of the gallery and compare your web.xml file to the one generated by the wizard.

  • RELEVANCY SCORE 3.01

    DB:3.01:Getting Another Error Message dz



    Another error message(109). Can anyone help?

  • RELEVANCY SCORE 3.01

    DB:3.01:Strange 554 Message Refused Issue ac


    I am having a real strange issue with Outlook 2007. My emails keep bouncing when I use one certain word in my subject or in the body. The error message is "554 message refused". Any ideas?

    DB:3.01:Strange 554 Message Refused Issue ac

    Well, the problem is solved by changing the GoDaddy's outgoing server to our ISP's outgoing server. But the funny thing is when I called GoDaddy to ask about this problem, they had no clue what it could be. They told me to Google it !!!

  • RELEVANCY SCORE 3.01

    DB:3.01:Getting "Synched With Another Itunes Library" Error Message js


    I am getting an error saying that my ipod is synched with another itunes library. This is strange as I have been using the same IPOD with this computer for more than 4 years. I reinstalled itunes and my library comes up but my IPOD and library are not able to synch up.

    Any suggestions as to how to fix this?

    DB:3.01:Getting "Synched With Another Itunes Library" Error Message js

    I am getting an error saying that my ipod is synched with another itunes library. This is strange as I have been using the same IPOD with this computer for more than 4 years. I reinstalled itunes and my library comes up but my IPOD and library are not able to synch up.

    Any suggestions as to how to fix this?

  • RELEVANCY SCORE 3.01

    DB:3.01:Unknown Error aa


    Help!!!!! I keep getting an error message really strange: Unknown error has caused an unknown in unknown............any suggestions?

    DB:3.01:Unknown Error aa


    The system restore, yes, the hive file copy is an XP only thing.

    If system restore doesn't work, then you can try a scanreg /restore

    TO do a scanreg, boot to your dell dimension resource cd, exit to DOS. Log on the c: drive (C: enter) then change directory to the C:\windows\command folder (CD windows\command enter)

    at the C:\windows\command\ prompt type: SCANREG /RESTORE enter this will display a blue screen with a grey box, there will be dates in the grey box, use the arrow keys to select a day prior to the problem press enter. Takes about a minute, you will either get a prompt that it was successful or failed, press enter to reboot.

  • RELEVANCY SCORE 3.01

    DB:3.01:Error Message mz



    I keep getting the following error message:

    Please wait...

    DB:3.01:Error Message mz


    This message usually appears if you attempt to display a PDF in a browser that uses its own PDF viewer, not the Adobe Reader plugin.

    Either use a browser that uses the Reader plugin, or configure your browser to use the Reader plugin; see http://helpx.adobe.com/acrobat/kb/pdf-browser-plugin-configuration.html

  • RELEVANCY SCORE 3.01

    DB:3.01:I Am Getting This Error Message a1


    I am getting this error message about a usb that is drawing too much power from my Air, the think is that nothing is connected to the Air , neither a USB or anything that can draw power from the computer . I have Attached a screen shot from the Error Message .. It is very strange as (i repeat) i have no USB connected or any other device !

    DB:3.01:I Am Getting This Error Message a1

    If Linc's recommendation to reset the SMC does not resolve the issue then it's most likely a hardware issue with the machine's logic board. Another scenario I've seen sometimes make the error message go away (and stay away) is to plug a non-bus powered USB peripheral into one of the ports and restart the computer.If you've only got bus powered devices/peripherals that'd work too (certainly wouldn't hurt anything). I've seen a few Macs throw that error message out, when nothing is connected, and rectify the issue automatically after the presence of an A/C powered device was connected.Otherwise, if that too does not resolve the issue, the Genius Bar / Authorized Service Provider is a good next move for additional triage.

  • RELEVANCY SCORE 3.01

    DB:3.01:Strange Error After Cloning A Win 2008 R2 Server m9



    Hi!

    Im getting a strange error:

    It shows up when starting the VM...

    Any way around it?

    DB:3.01:Strange Error After Cloning A Win 2008 R2 Server m9


    But we are using a Windows licens server....so I dont have any licens key to use. I guess the Windowsserver itself fetches this after it has booted up?

    Well, If I joined the domain when creating the clone, it worked

  • RELEVANCY SCORE 3.01

    DB:3.01:Bex Error 7s



    Hi Experts,

    We have updated our Bex version from 3.5 to 7.0 and we have started getting strange errors:

    Error specify value for a variable " field name"(which is mandatory)

    This error message is coming before the selection screen ie just after running the query from BEx we are getting the above error

    DB:3.01:Bex Error 7s


    Hi,

    we can't go further with out inputting, if our selection screen contains a mandatory variable.

    Thanks,

    Sathish.

  • RELEVANCY SCORE 3.00

    DB:3.00:Ides Error - Message Type Acpjmm Receipient Missing pj



    HI experts

    I'm getting a strange error while i try to post a goods receipt or goods issue. the message says

    receipients missing in Message type ACPJMM ( message B1003)

    The Idoc is passed through a ALE layer and the message is assigned with three receipients, either enter the receipients or deactivate the message.

    What's wrong in my system? i think this is a BASIS error. Kindly let me know the steps to correct this error.

    chetan

    DB:3.00:Ides Error - Message Type Acpjmm Receipient Missing pj


    I deactiviated the components in Table TRWCA

    But some one please help me how this problem has happened.

    I have not touched the ALE IDOC.

    Also please tell me what will happen if i uncheck all the components in this table. Please

    Regards

    GuruK

  • RELEVANCY SCORE 3.00

    DB:3.00:I Am Getting Error Message: Unexpected Error Opening Catalog. What Should I Do 7c



    Lightroom started acting slightly strange, not displaying certain images in the folder I was working on, for example. I shut it down, but when I tried to start it again, it would not open using my normal catalog, and I had the message, "Unexpected error opening catalog". It does let me open a different catalog, however. What can I do to get my catalog working again?

    DB:3.00:I Am Getting Error Message: Unexpected Error Opening Catalog. What Should I Do 7c


    Lightroom started acting slightly strange, not displaying certain images in the folder I was working on, for example. I shut it down, but when I tried to start it again, it would not open using my normal catalog, and I had the message, "Unexpected error opening catalog". It does let me open a different catalog, however. What can I do to get my catalog working again?

  • RELEVANCY SCORE 3.00

    DB:3.00:Acrobat Pro, There Was An Error While Copying To The Clipboard. za


    I am trying to copy and paste text from a pdf and keep
    getting this error:

    "There was an error copying to the Clipboard. An internal
    error occured."

    The strange part is that if I close all other programs I
    don't get the error message and even when I do get the message is
    still copies the text. Any ideas??? I am totally lost.

    DB:3.00:Acrobat Pro, There Was An Error While Copying To The Clipboard. za

    Hi MelSchultz,

    Thanks for your post. However, this Forum is meant to discuss
    issues related to acrobat.com and not acrobat. To post an issue
    related to acrobat please visit the acrobat forum :

    http://www.adobeforums.com/cgi-bin/webx/.3bbeda8b/

    You may also open a web case with Adobe Support. To do so,
    please visit the following link :

    https://www.adobe.com/cfusion/support/index.cfm?event=portal

  • RELEVANCY SCORE 2.99

    DB:2.99:Error Message 87


    getting error message 499 on sons log in

    DB:2.99:Error Message 87

    getting error message 499 on sons log in

  • RELEVANCY SCORE 2.99

    DB:2.99:When Trying To Scan I Get Strange Noise And A Message Of Error Code 5,202,52 xa


  • RELEVANCY SCORE 2.99

    DB:2.99:I Keep Getting Error 1328. What Should I Do? fp



    Yesterday, i uninstalled reader 10.1.4 because some fonts looked strange on some PDF Files. Unfortunately, when i tried to re-install, i keep getting error 1328.

    i am running windows vista and have un-installed all Adobe programs and tried to re-install countless times. i tried to run cleaner but got an error message about some files being outside of a library. Any suggestions?

    DB:2.99:I Keep Getting Error 1328. What Should I Do? fp


    i couldn't upload the file because i got the same error message that the file hadn't been closed cleanly and was corrupt.

    I would like to try one last time.

    looking at your post 22 Step 4 again. When i run ProcMon and hit the Reset button, it took about 4 minutes. Do i wait until the process finishes before i start the filtering process.

  • RELEVANCY SCORE 2.99

    DB:2.99:Strange Error Message 37


    I just got a new Ipod cause I couldn't get my 15GB one to work. Now, I'm getting the same error message "Attempting to copy to the disk "NAME'S I" failed. An unknown error occurred (-69), on the new one. I've tried everything that Apple has recommended on this site, nothing works!

    DB:2.99:Strange Error Message 37

    I've never heard of this one, but I've heard of a (-36) error. That's a general I/O error, so it is likely that this one is too. What that means in English is that you probably have lots of playlists, etc. on your iPod, which are really directories and subdirectories and sub-sub directories, as far as your computer is concerned. (True for both Macs and PCs) In the end, what happens is the path name directing the computer where to look gets too long. All computers have a built-in maximum path length of X number of characters and if you have too many directories and subdirectories, you reach that maximum and it causes an error. This is much more likely yet, if you use Anapod, as it is easy to create playlists and then playlists within playlists, etc. To fix it, reduce the number of playlists within playlists and shorten the length of really long song names.

    Alternatively, one of these may have been corrupted. Try reformatting your iPod and then loading the playlists back manually one at a time, checking after each one to see if it work and deleting any that cause problems.

    The other possibility is that there is a bug in iTunes to do with the size of the buffers. This actually seems quite likely given the number of people on this message board who seem to be running into buffer-related problems.

    And Smiffy, try manually loading the songs after the one where it stops working and see if you can do it, just in case that one song file is corrupted.

  • RELEVANCY SCORE 2.99

    DB:2.99:Fatal Error In Native Method 8x


    Hi all,

    I have a problem getting a strange error message when i use the CallObjectMethod function. This is what i receive...

    FATAL ERROR in native method: Native code expects wrong return type from Java callback

    DB:2.99:Fatal Error In Native Method 8x

    Does this mean the mind control experiment worked?

  • RELEVANCY SCORE 2.98

    DB:2.98:Strange Error 1c



    Hey,im getting always a strange error, if i load home i get this error

    **Error No Localizations Pool .....(for connecting ...')**

    (at the black screen) after 2-3 times im connected.

    Anyone else got this problem?Should i try to delete Home?

    Nordy




    DB:2.98:Strange Error 1c


    Hmm seems strange, keep this thread up so when Thylaudax comes back he can see it, he should know what the problem is. .




  • RELEVANCY SCORE 2.97

    DB:2.97:Getting A Message : Error: Jrockit Needs At Least A Pentium Pro To Run ks


    With no JVM installed, I installed jrokcit in a K6 2 500 mhz and got the following message :
    ERROR: JRockit needs at least a Pentium Pro to run.
    Could not create the Java virtual machine.

    Isn't it strange?

    DB:2.97:Getting A Message : Error: Jrockit Needs At Least A Pentium Pro To Run ks

    This is because the K6 does not have the instruction set required by
    JRockit.

    Regards,
    /Staffan

    emerson wrote:
    With no JVM installed, I installed jrokcit in a K6 2 500 mhz and got the following message :
    ERROR: JRockit needs at least a Pentium Pro to run.
    Could not create the Java virtual machine.

    Isn't it strange?

  • RELEVANCY SCORE 2.97

    DB:2.97:Strange Screen Saver Message 3z


    I recently started getting a message while changing screen saver selections. It reads "Error: Cant load bundle". I tried fixing permissions, then reinstalling system software, and have looked thru all the usual places, but to no avail. I would appreciate anyones response if you've experienced this same problem. Thanks!!

    DB:2.97:Strange Screen Saver Message 3z

    Hi,

    I have developped a kiosk application by using CGShieldingWindowLevel() function.
    Whenever my application is got launched I am not able to see Screen Saver because Screen saver is showing behind my full screen.How can I make the screen saver to display on the top of Kiosk screen.

    please help me.

    thanks,
    Akbar

  • RELEVANCY SCORE 2.96

    DB:2.96:Strange Windows Error Message fx


    The driver \Driver\WUDFRd failed to load for the device ROOT\LENOVOVHID\0000What is it?

    DB:2.96:Strange Windows Error Message fx

    can you check c:/windows/minidmp folder if there's any file? if so, please, upload the latest one so i can take a look at it.also, you may need to check the thread below: http://social.technet.microsoft.com/Forums/en/w7it​progeneral/thread/4e392195-a7fa-4ef4-aa0f-bb78a21d​...



  • RELEVANCY SCORE 2.96

    DB:2.96:Filesystem Create Error Ns20 m3


    Hey guys,Am getting a strange error when trying to create a filesystem from a storage pool. Create file system test. System error message (Error #5005):"failed to complete command" Create file system test. System was unable to create a file system with the given parameters. Any thoughts?Its a R5 lun / standard template / cant create any filesystems regardless of config.JohnMessage was edited by: johnubs

    DB:2.96:Filesystem Create Error Ns20 m3

    But if d9/10 are meant to be created on the first five drive that contain the OS, then why does the "setup_clariion" script assign these dvols to newly created clariion LUN's NOT on the first five drives.Then this is the essence of what is going wrong, not ?!

  • RELEVANCY SCORE 2.96

    DB:2.96:Why Do I Get An "Unknown Error" When Entering My Apple Id 81


    Why am I getting an "unknown error" message when I am trying to log into itunes with my apple id password. Its a second mac pro and I was logged in and then logged out, now I can not log back in.. strange

    DB:2.96:Why Do I Get An "Unknown Error" When Entering My Apple Id 81

    Why am I getting an "unknown error" message when I am trying to log into itunes with my apple id password. Its a second mac pro and I was logged in and then logged out, now I can not log back in.. strange

  • RELEVANCY SCORE 2.96

    DB:2.96:Re: Java.Lang.Noclassdeffounderror ----- Help pm


    hmm, I'm not getting an error here. I get some strange ouput but no error. What jdk are you running?

    DB:2.96:Re: Java.Lang.Noclassdeffounderror ----- Help pm

    I had this problem too trying to run in a DOS Window.

    You can fix it by typing:

    set CLASSPATH=%CLASSPATH%;.

    Basically setting ClassPath to include the current directory by default.

  • RELEVANCY SCORE 2.96

    DB:2.96:Re: Strange Error 79



    I'm getting a strange error message when I try and install the 2015 version of AutoCAD. The error I speak of is 'Entry point not found: C:\Autodesk\AutoCAD_2015_English_32_64bit_R1_wi_en-us\Setup\LiteHtml.dll. Can someone help me plsease?

    DB:2.96:Re: Strange Error 79


    Yes the Microsoft Visual C++ versions are on your computer. If you load your programs and features control panel you should see a list of them. If you opt to uninstall and re-install them they can be re-installed from the links below. Note: 64 bit OS types need both the x86 and x64 versions installed.

    Microsoft Visual C++ 2005 SP1 Redistributable Package (x86)

    http://www.microsoft.com/en-us/download/details.aspx?id=5638

    Microsoft Visual C++ 2005 SP1 Redistributable Package (x64)

    http://www.microsoft.com/en-us/download/details.aspx?id=18471

    Microsoft Visual C++ 2008 SP1 Redistributable Package (x86)

    http://www.microsoft.com/en-us/download/details.aspx?id=5582

    Microsoft Visual C++ 2008 SP1 Redistributable Package (x64)

    http://www.microsoft.com/en-us/download/details.aspx?id=2092

    Microsoft Visual C++ 2010 SP1 Redistributable Package (x86)

    http://www.microsoft.com/en-us/download/details.aspx?id=8328

    Microsoft Visual C++ 2010 SP1 Redistributable Package (x64)

    http://www.microsoft.com/en-us/download/details.aspx?id=13523

    Microsoft Visual C++ 2012 Redistributable Package (x64)/(x86)

    http://www.microsoft.com/en-us/download/details.aspx?id=30679




    Jeffry Asbury

  • RELEVANCY SCORE 2.96

    DB:2.96:Jco Monitoring Error And Nodes Data Not Reflecting In System Overview ka



    Hi All ,

    I am getting strange issue in portal .

    Jco monitoring error and nodes data not reflecting in system overview

    Error Message: Fatal JCo monitoring error: traces. Nodes started : 0 of 0

    Regards ,

    Abhi

    DB:2.96:Jco Monitoring Error And Nodes Data Not Reflecting In System Overview ka


    Hi Abhi

    You can refer the SAP Notes for this error message

    1378856 - JCo Monitoring (NWA) trouble shooting

    1774167 - JCO Monitoring initially not working

    BR

    SS

  • RELEVANCY SCORE 2.96

    DB:2.96:Getting Server Error Message 93


  • RELEVANCY SCORE 2.96

    DB:2.96:2 Strange Messages - Iphone 3gs From Telus cd


    I am getting the following messages off and on, on the screen. Sometimes when accessing the web or syncing ....

    Your Sim Card sent a Text Message

    and

    ME returned a temporay error.

    Any suggestions. Thanks!

    DB:2.96:2 Strange Messages - Iphone 3gs From Telus cd

    Thanks ... yes it turned out it is a carrier issue.

  • RELEVANCY SCORE 2.96

    DB:2.96:Strange Error Message... 18



    Remove the MeshCollider

  • RELEVANCY SCORE 2.96

    DB:2.96:Getting Error Message C0620004 f1



    I'm getting error message c0620004?

    DB:2.96:Getting Error Message C0620004 f1


    Hi there again

    Go to this article Click here if this does not help your printer may have to be service.

    Truly hope this helps:

    RobertoR

    And Remember↓

  • RELEVANCY SCORE 2.96

    DB:2.96:Receiver Agreement For Integration Process x9



    Dear All

    I am facing a strange problem when I am sending a message via proxy to SAP PI whci is then supposed to forward it to a legacy system.

    I am using a BPM and am getting an error like no receiver agreement found between the sender SAPECC system and receiver integration process

    DB:2.96:Receiver Agreement For Integration Process x9


    Hi,

    a BPM and am getting an error like no receiver agreement found between the sender SAPECC system and receiver integration process

    use the integration directory wizard and create two configurations

    - ECC - PI (integration process)

    - PI (BPM) - to the legacy

    then it will work - this is not an error but lack of configuration

    Regards,

    Michal Krawczyk

  • RELEVANCY SCORE 2.96

    DB:2.96:I Am Getting A Strange Message That My Windows Is Not Genuine!! 3d



    hello

    I am getting a strange message that my windows is not genuine!!

    I bought the laptop with operation system (windows VISTA)

    The key on the laptop is not clear since i bought this laptop since almost 4 years

    what should I do ?

    Thanks in advance

    DB:2.96:I Am Getting A Strange Message That My Windows Is Not Genuine!! 3d


    hello

    I am getting a strange message that my windows is not genuine!!

    I bought the laptop with operation system (windows VISTA)

    The key on the laptop is not clear since i bought this laptop since almost 4 years

    what should I do ?

    Thanks in advance

  • RELEVANCY SCORE 2.96

    DB:2.96:Thread: Strange Console Message 9d


    I have recently been getting a strange console message cannot update nds

    against an entry within subnet container: phs subnet.phs.high.ccps. I have

    this happening on two out of 24 servers in my schools. I did not see this

    until after upgrading to edir 885 from 884. servers are NW65sp8.

    DB:2.96:Thread: Strange Console Message 9d

    OK, let us know how it works after that. Without the dynamic updates

    being done, you should have no errors.

    You might also at some point want to go into the DNS zone and delete

    old workstation objects. (Or leave them alone and ignore them - your

    choice).

    Craig Johnson

    Novell Support Connection SysOp

  • RELEVANCY SCORE 2.96

    DB:2.96:Cannot Download Adobe Reader 9 p8


    I have tried several times to download the Adobe Reader version 9 on to my PC, but I keep getting error message 1714 : The older version of Adobe Reader 9 cannot be removed.

    This is strange as the old Adobe Reader was version 7.

    I am totally confused now. Any ideas?

    DB:2.96:Cannot Download Adobe Reader 9 p8

    Sounds like you need to download and run the Microsoft Installer Cleanup Utility. That normally clears it up.

  • RELEVANCY SCORE 2.96

    DB:2.96:Looking At Log Files Strange Error 17





    Get_mailbox_size_error:_unable_to_get_size_of_subdir_in_mail_user_home_dir(please_report_about_to_development_group).//did_1+0+1/

    I get this above message in my log files. How can I correct this

    Marty

    DB:2.96:Looking At Log Files Strange Error 17




    Get_mailbox_size_error:_unable_to_get_size_of_subdir_in_mail_user_home_dir(please_report_about_to_development_group).//did_1+0+1/

    I get this above message in my log files. How can I correct this

    Marty

  • RELEVANCY SCORE 2.96

    DB:2.96:Acrobat 9 Pro "Drawing Error" px


    Out of the blue have been getting message "a drawing error occurred" when opening SOME pdf files.
    When it first happened thought strange and opened a few other pdf files - some work, and some don't.

    Anyone with a clue as to what is happening.

    operating system WinXP sp2

    DB:2.96:Acrobat 9 Pro "Drawing Error" px

    A combination of files, usually ones received via email, however these come regularly (eg invoices / orders and the like) and no problems previously. Even though these won't open, they place and print fine in ID 5.0.4 - I do not know what program produced them all, but some were created in MSword.

    I also can not view these same files in the pdf previewer when received via email in Outlook 2007.

    Okay, that said, there are other pdf files (both self-made and received via email) that view and open without a problem.

    And just to confuse the issue a little further, there are a couple of received pdf files that I keep on my desktop to reference now and then. They were okay once, but they now also cause the "drawing error" message when I try to open in Acrobat 9 Pro.

    It is more of an inconvenience, but still very annoying.

  • RELEVANCY SCORE 2.96

    DB:2.96:Strange Error On Log Files c3


    Hi guys, I'm getting a weird error on my sharepoint server logs:

  • RELEVANCY SCORE 2.95

    DB:2.95:Strange Error Message When Trying To Run A Program x3


    After a fresh install of the program i can run it fine but after i exit and try to reopen it i get this error message:
    error message

    DB:2.95:Strange Error Message When Trying To Run A Program x3

    I'm sorry to hear that. Look for user forums on the game's website. Perhaps someone there has the answer for you. I'm sorry I was unable to help you.

    MS-MVP - Elephant Boy Computers - Don't Panic!

  • RELEVANCY SCORE 2.95

    DB:2.95:Strange Message... mm



    HI~

    ============================================

    *Dec 15 01:49:48: %C4K_L3HWFORWARDING-3-FWDCAMCONSISTENCYCHECKFAILED: (Suppressed 83 times) FwdCam Consistency Check Failed: index 21

    =============================================

    This error is happening frequently.

    should i change hardware module(=supversior))?

    DB:2.95:Strange Message... mm


    Hello,

    this is what the error message decoder says:

    1. %C4K_L3HWFORWARDING-3-FWDCAMCONSISTENCYCHECKFAILED: [char] FwdCam Consistency Check Failed: index [dec]

    This message indicates that there was a consistency check failure. If this error happens frequently, it could indicate faulty hardware.

    If you have a spare supervisor, you could install it to see if the message disappears...that would mean it actually was a hardware problem.

    Regards,

    GP

  • RELEVANCY SCORE 2.95

    DB:2.95:Dw-U55a Dwd+- Burner On Vaio Vgn-A197xp fa



    Strange problem I got...Bruner works well for a few month, then started getting strange message from Nero " Power calibration error".Had a look on different forums, the messages were :- poor dvd quality- clean lensTried all of those : changed DVD manufacturer (4x), upgraded the firmware, cleaned the lens... nothing helps... any suggestion ?

    DB:2.95:Dw-U55a Dwd+- Burner On Vaio Vgn-A197xp fa


    Strange problem I got...Bruner works well for a few month, then started getting strange message from Nero " Power calibration error".Had a look on different forums, the messages were :- poor dvd quality- clean lensTried all of those : changed DVD manufacturer (4x), upgraded the firmware, cleaned the lens... nothing helps... any suggestion ?

  • RELEVANCY SCORE 2.95

    DB:2.95:Strange Video Format For N8 9x



    I just got the N8 can't add mp4 or mkv files to my mass media, I've tried other formats aswell avi, divx, I've even copied the mp4 movie trailer that you get already on the phone from my pc back to the phone it's still getting an error message.

    I can get windows media/audio file to work, but that's it.

    DB:2.95:Strange Video Format For N8 9x


    Hi diljeet,

    It is normalin myWindows 7 to display an alert when copy/pastingMP4 files and other video files, asking ifI want to convert the video file to Windows Media format, orcopy the file directly. I need to select "No"to copy the files to the phone, where itplays fine when the transfer is finished, despite the warning from Windows.

    Is this the error you have?

  • RELEVANCY SCORE 2.95

    DB:2.95:Strange Behavior "Error Message Displayed Three Times". fc



    Hi All,

    I am facing v.strange behavior while validating the required parameter.

    The parameter is checked in WDBEFOREACTION method.

    When the input field is empty i am raising the report_attribute_error_message".

    The message is getting displayed 3 times instead of once.

    Kindly provide me some solution to correct the issue ASAP.

    Regards,

    Arti.

    DB:2.95:Strange Behavior "Error Message Displayed Three Times". fc


    Hi,

    I was wondering if this the only error message which is getting displayed during that validation. May be you can clear the existing messages using CLEAR_MESSAGES and then repopulate the message, which will avoid the repetitiveness of your messages. That again depends on the number of messages. May be this solution will help you for single message only.

    Regards

    Raja Sekhar

  • RELEVANCY SCORE 2.95

    DB:2.95:Strange Error Message ms



    Hi all,

    I tried to log into our test SDE box this morning and am now getting this error message?? I tried an IIS reset and rebooted the machine but it did no good. Have you seen this before? How do I get ride of it?

    Cheers,

    M


    DB:2.95:Strange Error Message ms


    Great Nick! That worked perfectly :-)

    M

  • RELEVANCY SCORE 2.94

    DB:2.94:6500 Msfc2 Strange Error Message xm



    hi to everyone,

    my MSFC2 sent this strange log message.

    %DATACORRUPTION-SP-1-DATAINCONSISTENCY: copy error

    The error message decoder tool says: "NOT FOUND".

    Had someone of you the same log message??

    The level is "alert".

    Thank You very much!!

    giorgio

    DB:2.94:6500 Msfc2 Strange Error Message xm


    As I mentioned already, this will not be fixed in 12.1E because it's not developed anymore.

    Andras

  • RELEVANCY SCORE 2.94

    DB:2.94:Error In Substep (Rsbk231) mj



    Hi all,

    In a dtp load I'm getting a strange error in BI 7.0. The error message only provides very limited information when right cliking and choosing display messages. The step where it gives the error is in the start of the master data update. In SM50 I can see the process is ON HOLD and SLEEP.It stays like that for a few minutes and then it crashes. Any ideas about what is going on?

    DB:2.94:Error In Substep (Rsbk231) mj


    Okay, replied too soon.. error is not solved so OSS notes did not solve this problem.

  • RELEVANCY SCORE 2.94

    DB:2.94:Java.Lang.Runtimeexception: Java.Lang.Nosuchfieldexception: mc



    Hi,While using JBoss AOP in Apache Tomcat 6.0.16, I am getting a strange error message, from which I can't make out what is the cause of the error.below is my AOP file and the error message. Please let me know if you know the cause or any pointers to the solution
    aop
    aspect class="net.sf.jasperreports.engine.LoggingAspect"/
    bind pointcut="execution(public * net.sf.jasperreports.engine.JasperFillManager-fillReport(..))"
    advice name="auditing" aspect="net.sf.jasperreports.engine.LoggingAspect"/
    /bind
    /aop

    DB:2.94:Java.Lang.Runtimeexception: Java.Lang.Nosuchfieldexception: mc


    Are you performing the compile time weaving with the same version of JBoss AOP you use at runtime?Check if there is no older JBoss AOP jar file in the classpath during execution.

  • RELEVANCY SCORE 2.94

    DB:2.94:Error When Signing Application: "No Confirm Or Error String In Response" cp



    I am getting the above message when attempting to sign my application. The strange thing is it was working fine this morning. Is this trying to say that there is a network error? Or has the key gone corrupt somehow?

    DB:2.94:Error When Signing Application: "No Confirm Or Error String In Response" cp


    Thanks for the notice.




    Jerome Carty - @jcarty | #webworks-dev / #BlackberryDev on irc.freenode.net | My AppsClick "Accept as Solution" if post solved your original issue.. Give like/thumbs up if you feel post is helpful

  • RELEVANCY SCORE 2.94

    DB:2.94:Error While Creating Sales Order 83



    Hi Guys,

    I am getting a strange error while creation the sales order in transaction code VA01.

    Bellow is the Error Message:

    "Material 200882590001 not maintained for this destination.

    Message no. ZT003"

    Please suggest some sollution for this,

    thanks in advance

    Regards

    MBS

  • RELEVANCY SCORE 2.94

    DB:2.94:Sharepoint 2010 Group Admin Not Able To Add User To Group f3


    We have done SharePoint 2010 upgrade in our environment. Post upgrade If any SharePoint group admin is trying to add user to SharePoint custom group he is getting Access denied Error message....its strange behaviour...any idea how to fix it

    DB:2.94:Sharepoint 2010 Group Admin Not Able To Add User To Group f3

    It's because after adding/deleting a user to the group SharePoint is trying to take them to the site's Permissions (_layouts/user.aspx) page which they don't have access too. It really should take them back to the group page (_layouts/people.aspx?MembershipGroupId=###).

  • RELEVANCY SCORE 2.94

    DB:2.94:Error Message ma


    keep getting error message guide failure error code 42-277

    DB:2.94:Error Message ma

    keep getting error message guide failure error code 42-277

  • RELEVANCY SCORE 2.93

    DB:2.93:6513 Error Message c9



    Hi All,

    getting a strange message on a 6513....tried error mesaage decoder no joy.Has anyone seen the messaqge in the past?

    TitanIsrMainHandler C38

    TiIsrMETDec 3

    TiIsrPktPay 1

    TiIsrSpanCo 1

    TiIsrPktCon 40.

    Rgds.

    Harry.

    DB:2.93:6513 Error Message c9


    OK many thanx.....if the blog does come live,appreciate any further info you can provide.

    Rgds.

    Harry.

  • RELEVANCY SCORE 2.93

    DB:2.93:F90: Fatal Error In F90 : Signal Number = 11 3x


    I'm getting this strange message (f90: Fatal error in f90 : Signal number = 11) and failure to compile a Fortran program with Solaris Studio 12.3 under SuSE 11.2. The program compiles and runs without trouble if I use gfortran instead.

  • RELEVANCY SCORE 2.93

    DB:2.93:No Service Implementation Available a9



    Hi All,

    I'am getting this strange error when i'am executing my query.

    Iam also getting the same error when i assign my query to a web template and execute.

    The exact error message is: "Cannot Load query "Technical name of query" data provider DP1 No service implementation available"

    Did anybody face this error anytime

    Regards,

  • RELEVANCY SCORE 2.93

    DB:2.93:Strange Message On Router 7200 xj



    Good morning,

    Could someone help me with the message I'm getting on my Log? I haven't configured that access list on my router 7200