• RELEVANCY SCORE 6.78

    DB:6.78:Bootstrap Process Failer kz




    can someone hlep me wiith this error message: Bootstrap process failer

    DB:6.78:Bootstrap Process Failer kz

    Your question is
    a) more suitable for the Database-General forum
    http://forums.oracle.com/forums/search.jspa?threadID=q=ORA-00704objID=f61dateRange=alluserID=numResults=15
    General Database Discussions
    b) incomplete, there should be more than only that error.
    http://download.oracle.com/docs/cd/B19306_01/server.102/b14219/e0.htm#sthref384
    Always post all (full) error messages including the error code.

  • RELEVANCY SCORE 3.78

    DB:3.78:Apache Wont Start After Bootstrap Repair - Urgent mx







    So after a failer update to 12 I ran bootstrap repair.

    But Apache wont start. - I get errors like -

    Code:

    DB:3.78:Apache Wont Start After Bootstrap Repair - Urgent mx




    I decided to move to cPanel,
    I got sick of struggling my way through.

    The KB article helped list the problems but I had no clue how to fix them.

    The cPanel crew will do a full migration for me.

    Thanks anyway!

    Regards
    Dave

  • RELEVANCY SCORE 2.95

    DB:2.95:Jdeveloper 11g R3 - Error In New Bpel Process zz




    Hi Guys,

    Been hanging out to try the BPEL stuff in Tech Preview 3. I created a new SOA Application, then New BPEL Process.....and got the error below.

    Any ideas?

    Cheers,

    Dave

    Dec 24, 2007 10:24:09 AM oracle.ide.wizard.WizardManager getWizard
    SEVERE: Failed to create wizard oracle.tip.tools.ide.pm.sca.wizard.PMSCAProjectCreationWizard
    oracle.classloader.util.AnnotatedClassNotFoundException:

    Missing class: oracle.tip.tools.ide.pm.sca.wizard.PMSCAProjectCreationWizard

    Dependent class: oracle.ide.wizard.WizardManager
    Loader: main:11.0
    Code-Source: /C:/JDeveloper11gR3/ide/extensions/oracle.ide.jar
    Configuration: system property PCLMain.createExtensionManagerLoader()

    This load was initiated at main:11.0 using the Class.forName() method.

    The missing class is not available from any code-source or loader in the system.
    at oracle.classloader.PolicyClassLoader.handleClassNotFound (PolicyClassLoader.java:2124) [C:/JDeveloper11gR3/j2ee/home/lib/pcl.jar (from system property java.class.path), by sun.misc.Launcher$AppClassLoader@9627532]
    at oracle.classloader.PolicyClassLoader.internalLoadClass (PolicyClassLoader.java:1699) [C:/JDeveloper11gR3/j2ee/home/lib/pcl.jar (from system property java.class.path), by sun.misc.Launcher$AppClassLoader@9627532]
    at oracle.classloader.PolicyClassLoader.access$000 (PolicyClassLoader.java:142) [C:/JDeveloper11gR3/j2ee/home/lib/pcl.jar (from system property java.class.path), by sun.misc.Launcher$AppClassLoader@9627532]
    at oracle.classloader.PolicyClassLoader$LoadClassAction.run (PolicyClassLoader.java:325) [C:/JDeveloper11gR3/j2ee/home/lib/pcl.jar (from system property java.class.path), by sun.misc.Launcher$AppClassLoader@9627532]
    at java.security.AccessController.doPrivileged (Native method) [unknown, by unknown]
    at oracle.classloader.PolicyClassLoader.loadClass (PolicyClassLoader.java:1658) [C:/JDeveloper11gR3/j2ee/home/lib/pcl.jar (from system property java.class.path), by sun.misc.Launcher$AppClassLoader@9627532]
    at oracle.classloader.PolicyClassLoader.loadClass (PolicyClassLoader.java:1640) [C:/JDeveloper11gR3/j2ee/home/lib/pcl.jar (from system property java.class.path), by sun.misc.Launcher$AppClassLoader@9627532]
    at java.lang.ClassLoader.loadClassInternal (ClassLoader.java:319) [jre bootstrap, by jre.bootstrap:1.5.0_11]
    at java.lang.Class.forName0 (Native method) [unknown, by unknown]
    at java.lang.Class.forName (Class.java:164) [jre bootstrap, by jre.bootstrap:1.5.0_11]
    at oracle.ide.wizard.WizardManager.getWizard (WizardManager.java:171) [C:/JDeveloper11gR3/ide/extensions/oracle.ide.jar (from system property PCLMain.createExtensionManagerLoader()), by main:11.0]
    at oracle.ideimpl.appoverview.AppOverviewEditor.handleEvent (AppOverviewEditor.java:2323) [C:/JDeveloper11gR3/jdev/extensions/oracle.ide.appoverview.jar (from system property C:\JDeveloper11gR3\jdev\extensions\oracle.ide.appoverview.jar), by main:11.0]
    at oracle.ide.controller.IdeAction.performAction (IdeAction.java:508) [C:/JDeveloper11gR3/ide/extensions/oracle.ide.jar (from system property PCLMain.createExtensionManagerLoader()), by main:11.0]
    at oracle.ide.controller.IdeAction.actionPerformedImpl (IdeAction.java:784) [C:/JDeveloper11gR3/ide/extensions/oracle.ide.jar (from system property PCLMain.createExtensionManagerLoader()), by main:11.0]
    at oracle.ide.controller.IdeAction.actionPerformed (IdeAction.java:481) [C:/JDeveloper11gR3/ide/extensions/oracle.ide.jar (from system property PCLMain.createExtensionManagerLoader()), by main:11.0]
    at javax.swing.AbstractButton.fireActionPerformed (AbstractButton.java:1849) [jre bootstrap, by jre.bootstrap:1.5.0_11]
    at javax.swing.AbstractButton$Handler.actionPerformed (AbstractButton.java:2169) [jre bootstrap, by jre.bootstrap:1.5.0_11]
    at javax.swing.DefaultButtonModel.fireActionPerformed (DefaultButtonModel.java:420) [jre bootstrap, by jre.bootstrap:1.5.0_11]
    at javax.swing.DefaultButtonModel.setPressed (DefaultButtonModel.java:258) [jre bootstrap, by jre.bootstrap:1.5.0_11]
    at javax.swing.AbstractButton.doClick (AbstractButton.java:302) [jre bootstrap, by jre.bootstrap:1.5.0_11]
    at javax.swing.plaf.basic.BasicMenuItemUI.doClick (BasicMenuItemUI.java:1000) [jre bootstrap, by jre.bootstrap:1.5.0_11]
    at javax.swing.plaf.basic.BasicMenuItemUI$Handler.mouseReleased (BasicMenuItemUI.java:1041) [jre bootstrap, by jre.bootstrap:1.5.0_11]
    at java.awt.Component.processMouseEvent (Component.java:5501) [jre bootstrap, by jre.bootstrap:1.5.0_11]
    at javax.swing.JComponent.processMouseEvent (JComponent.java:3135) [jre bootstrap, by jre.bootstrap:1.5.0_11]
    at java.awt.Component.processEvent (Component.java:5266) [jre bootstrap, by jre.bootstrap:1.5.0_11]
    at java.awt.Container.processEvent (Container.java:1966) [jre bootstrap, by jre.bootstrap:1.5.0_11]
    at java.awt.Component.dispatchEventImpl (Component.java:3968) [jre bootstrap, by jre.bootstrap:1.5.0_11]
    at java.awt.Container.dispatchEventImpl (Container.java:2024) [jre bootstrap, by jre.bootstrap:1.5.0_11]
    at java.awt.Component.dispatchEvent (Component.java:3803) [jre bootstrap, by jre.bootstrap:1.5.0_11]
    at java.awt.LightweightDispatcher.retargetMouseEvent (Container.java:4212) [jre bootstrap, by jre.bootstrap:1.5.0_11]
    at java.awt.LightweightDispatcher.processMouseEvent (Container.java:3892) [jre bootstrap, by jre.bootstrap:1.5.0_11]
    at java.awt.LightweightDispatcher.dispatchEvent (Container.java:3822) [jre bootstrap, by jre.bootstrap:1.5.0_11]
    at java.awt.Container.dispatchEventImpl (Container.java:2010) [jre bootstrap, by jre.bootstrap:1.5.0_11]
    at java.awt.Window.dispatchEventImpl (Window.java:1778) [jre bootstrap, by jre.bootstrap:1.5.0_11]
    at java.awt.Component.dispatchEvent (Component.java:3803) [jre bootstrap, by jre.bootstrap:1.5.0_11]
    at java.awt.EventQueue.dispatchEvent (EventQueue.java:463) [jre bootstrap, by jre.bootstrap:1.5.0_11]
    at java.awt.EventDispatchThread.pumpOneEventForHierarchy (EventDispatchThread.java:242) [jre bootstrap, by jre.bootstrap:1.5.0_11]
    at java.awt.EventDispatchThread.pumpEventsForHierarchy (EventDispatchThread.java:163) [jre bootstrap, by jre.bootstrap:1.5.0_11]
    at java.awt.EventDispatchThread.pumpEvents (EventDispatchThread.java:157) [jre bootstrap, by jre.bootstrap:1.5.0_11]
    at java.awt.EventDispatchThread.pumpEvents (EventDispatchThread.java:149) [jre bootstrap, by jre.bootstrap:1.5.0_11]
    at java.awt.EventDispatchThread.run (EventDispatchThread.java:110) [jre bootstrap, by jre.bootstrap:1.5.0_11]

    DB:2.95:Jdeveloper 11g R3 - Error In New Bpel Process zz

    Hi,

    we have a specific forum for 11 related issues, which is

    JDeveloper and OC4J 11g Technology Preview

    You can however post your question to the BPEL forum too (as this is where the experts of the BPEL integration are)

    BPEL

    Frank

  • RELEVANCY SCORE 2.81

    DB:2.81:Ods Activation Failer fa



    Hi

    Iam loding to ods i got this error,

    activation falier

    DB:2.81:Ods Activation Failer fa


    Hello,

    Which product is this error for?

    This forum is specifically concerning the crystalreports.com and bi.ondemand.com applications.

    Cheers

    Steve

  • RELEVANCY SCORE 2.78

    DB:2.78:Paralal Oracle 10g 10.2 Server 3s


    Friends

    In Oracle there is a possibility i can run parallel server if the primary server is power failer then automaticaly all user swithch to secoundary server.

    rgds

    TeeJay

  • RELEVANCY SCORE 2.76

    DB:2.76:Jcontrol Process Dies With Exit Code 66 3a



    Hi

    After rebooting the Server the JControl process is not getting up.

    I am getting the following error in the developer trace.

    Could anybody help me out with this.

    Worker nodes
    - [00] ID3535900 : D:\usr\sap\NGP\JC00\j2ee\cluster\instance.properties
    - [01] ID3535950 : D:\usr\sap\NGP\JC00\j2ee\cluster\instance.properties
    - [02] sdm : D:\usr\sap\NGP\JC00\SDM\program\config\sdm_jstartup.properties
    **********************************************************************

    [Thr 4540] JControlExecuteBootstrap: execute bootstrap process [bootstrap]
    [Thr 4540] [Node: bootstrap] java home is set by profile parameter
    Java Home: C:\j2sdk1.4.2_12
    [Thr 4540] JStartupICheckFrameworkPackage: can't find framework package D:\usr\sap\NGP\JC00\exe\jvmx.jar

    **********************************************************************
    JStartupIReadSection: read node properties [bootstrap]
    - node name : bootstrap
    - node type : bootstrap
    - node execute : yes
    - java path : C:\j2sdk1.4.2_12
    - java parameters : -Djco.jarm=1
    - java vm version : 1.4.2_12-b03
    - java vm vendor : Java HotSpot(TM) Server VM (Sun Microsystems Inc.)
    - java vm type : server
    - java vm cpu : x86
    - heap size : 256M
    - root path : D:\usr\sap\NGP\JC00\j2ee\cluster
    - class path : .\bootstrap\launcher.jar
    - OS libs path : D:\usr\sap\NGP\JC00\j2ee\os_libs
    - main class : com.sap.engine.offline.OfflineToolStart
    - framework class : com.sap.bc.proj.jstartup.JStartupFramework
    - registr. class : com.sap.bc.proj.jstartup.JStartupNatives
    - framework path : D:\usr\sap\NGP\JC00\exe\jstartup.jar;D:\usr\sap\NGP\JC00\exe\jvmx.jar
    - parameters : com.sap.engine.bootstrap.Bootstrap ./bootstrap ID0035359
    - debuggable : yes
    - debug mode : no
    - debug port : 60000
    - shutdown timeout : 120000
    **********************************************************************

    **********************************************************************
    JControlStartJLaunch: program = D:\usr\sap\NGP\JC00\exe\jlaunch.exe
    - arg[00] = D:\usr\sap\NGP\JC00\exe\jlaunch.exe
    - arg[01] = pf=D:\usr\sap\NGP\SYS\profile\NGP_JC00_INBLRDHRNGEP
    - arg[02] = -DSAPINFO=NGP_00_bootstrap
    - arg[03] = -nodeId=-1
    - arg[04] = -file=D:\usr\sap\NGP\JC00\j2ee\cluster\instance.properties
    - arg[05] = -syncSem=JSTARTUP_WAIT_ON_5960
    - arg[06] = -nodeName=bootstrap
    - arg[07] = -jvmOutFile=D:\usr\sap\NGP\JC00\work\jvm_bootstrap.out
    - arg[08] = -stdOutFile=D:\usr\sap\NGP\JC00\work\std_bootstrap.out
    - arg[09] = -locOutFile=D:\usr\sap\NGP\JC00\work\dev_bootstrap
    - arg[10] = -mode=BOOTSTRAP
    - arg[11] = pf=D:\usr\sap\NGP\SYS\profile\NGP_JC00_INBLRDHRNGEP
    - lib path = PATH=C:\j2sdk1.4.2_12\jre\bin\server;C:\j2sdk1.4.2_12\jre\bin;D:\oracle\NGP\102\bin;C:\Program Files\HP\NCU;C:\WINDOWS\system32;C:\WINDOWS;C:\WINDOWS\System32\Wbem;C:\Program Files\Microsoft SQL Server\80\Tools\BINN;D:\usr\sap\NGP\SYS\exe\uc\NTI386
    - exe path = PATH=C:\j2sdk1.4.2_12\bin;D:\usr\sap\NGP\JC00\j2ee\os_libs;D:\oracle\NGP\102\bin;C:\Program Files\HP\NCU;C:\WINDOWS\system32;C:\WINDOWS;C:\WINDOWS\System32\Wbem;C:\Program Files\Microsoft SQL Server\80\Tools\BINN;D:\usr\sap\NGP\SYS\exe\uc\NTI386
    **********************************************************************

    [Thr 4540] Thu Dec 03 14:55:57 2009
    [Thr 4540] *** ERROR = invalid return code of process [bootstrap] (exitcode = 66) [jstartxx.c 1642]
    [Thr 4540] JControlExecuteBootstrap: error executing bootstrap node [bootstrap] (rc = 66)
    [Thr 4540] JControlCloseProgram: started (exitcode = 66)
    [Thr 4540] JControlCloseProgram: good bye... (exitcode = 66)

    DB:2.76:Jcontrol Process Dies With Exit Code 66 3a


    one of the control file was not working properly. so replaced its backup from the mirrorlog directory. This resolved the issue.

    Thanks,

    sarbjeet

  • RELEVANCY SCORE 2.71

    DB:2.71:Ora-00704: Bootstrap Process Failure And System Datafile Corrupt mz


    We have an Oracle 10g Express database that is getting the following error on startup.

    ORA-00704: bootstrap process failure

    It is also showing that the SYSTEM datafile is corrupt. And unfortunately the backups are gone. Is there any way to recover from this without a backup? Maybe some hidden undocumented parameter???
    We do have some full database exports from a couple weeks ago so it is not a complete loss but would really like a full recover.

  • RELEVANCY SCORE 2.70

    DB:2.70:Trash 7x


    Hello I want to empty my trash but i get a failer code 8003 is there some one to help

    DB:2.70:Trash 7x

    see this article on how to resolve Trash Problems

  • RELEVANCY SCORE 2.70

    DB:2.70:Hydt_Bscu_Wait_For_Completion s9



    I am getting the following message arbitrarily at times when running a parallel job using OpenFoam Application complied by Icc and  compiler and intel mpi. When I have one running job, it is fine, but all the jobs crashe for multiple running jobs.

    lsb_launch(): Failed while waiting for tasks to finish.
    [mpiexec@ys0271] HYDT_bscu_wait_for_completion (./tools/bootstrap/utils/bscu_wait.c:101): one of the processes terminated badly; aborting
    [mpiexec@ys0271] HYDT_bsci_wait_for_completion (./tools/bootstrap/src/bsci_wait.c:18): bootstrap device returned error waiting for completion
    [mpiexec@ys0271] HYD_pmci_wait_for_completion (./pm/pmiserv/pmiserv_pmci.c:521): bootstrap server returned error waiting for completion
    [mpiexec@ys0271] main (./ui/mpich/mpiexec.c:548): process manager error waiting for completion

    DB:2.70:Hydt_Bscu_Wait_For_Completion s9


    Hi,

    Please try running with I_MPI_FABRICS=shm:tcp and let me know if this works.  Also, please attach your /etc/dat.conf file.

    Sincerely,
    James Tullos
    Technical Consulting Engineer
    Intel® Cluster Tools

  • RELEVANCY SCORE 2.68

    DB:2.68:Mail Delivery Failer Command Rejected 550 5.7.1 j1


    Product: Officejet 6500A

    OS: Windows XP

    First time installation

    All indications show thatthe printerconnected to ePrintCenter, but still I get an mail delivery failer Command rejected 550 5.7.1

    I tried everything that appears on the forum.

    Please help

    DB:2.68:Mail Delivery Failer Command Rejected 550 5.7.1 j1


    same by me ... no EPRINT is working

    hpeprint.com #hpeprint.com #5.7.1 smtp;550 5.7.1 Command rejected #SMTP#

  • RELEVANCY SCORE 2.64

    DB:2.64:Intel Mpi Hydra Crash k8



    i am getting the following message arbitrarily at times when running a parallel job using the latest intel fortran compiler and intel mpi.[proxy:0:12@n020] HYDT_dmxu_poll_wait_for_event (./tools/demux/demux_poll.c:70): assert (!(pollfds[i].revents ~POLLIN ~POLLOUT ~POLLHUP)) failed[proxy:0:12@n020] main (./pm/pmiserv/pmip.c:387): demux engine error waiting for event[mpiexec@n032] HYDT_bscu_wait_for_completion (./tools/bootstrap/utils/bscu_wait.c:101): one of the processes terminated badly; aborting[mpiexec@n032] HYDT_bsci_wait_for_completion (./tools/bootstrap/src/bsci_wait.c:18): bootstrap device returned error waiting for completion[mpiexec@n032] HYD_pmci_wait_for_completion (./pm/pmiserv/pmiserv_pmci.c:521): bootstrap server returned error waiting for completion[mpiexec@n032] main (./ui/mpich/mpiexec.c:548): process manager error waiting for completion[proxy:0:12@n020] HYDT_dmxu_poll_wait_for_event (./tools/demux/demux_poll.c:70): assert (!(pollfds[i].revents ~POLLIN ~POLLOUT ~POLLHUP)) failed[proxy:0:12@n020] main (./pm/pmiserv/pmip.c:387): demux engine error waiting for event[mpiexec@n032] HYDT_bscu_wait_for_completion (./tools/bootstrap/utils/bscu_wait.c:101): one of the processes terminated badly; aborting[mpiexec@n032] HYDT_bsci_wait_for_completion (./tools/bootstrap/src/bsci_wait.c:18): bootstrap device returned error waiting for completion[mpiexec@n032] HYD_pmci_wait_for_completion (./pm/pmiserv/pmiserv_pmci.c:521): bootstrap server returned error waiting for completion[mpiexec@n032] main (./ui/mpich/mpiexec.c:548): process manager error waiting for completionI am currently using the following command:mpirun -np N ./a.exeShould i specify anything else in order to ensure this error will not happen again?

    DB:2.64:Intel Mpi Hydra Crash k8


    Hi Dave,

    What version of OFED are you using? What does your /etc/dat.conf file look like?

    Sincerely,
    James Tullos
    Technical Consulting Engineer
    Intel Cluster Tools

  • RELEVANCY SCORE 2.62

    DB:2.62:Failer To Send Mssg On Kindle Fire x8



    i have a kindle fire. i can not dend outgoing email on it. i can send from my laptop, but not from kinkle fire. What are the outgoing mail server setting i need to use?

    DB:2.62:Failer To Send Mssg On Kindle Fire x8


    Please see this message: http://forums.comcast.com/t5/E-Mail-and-Xfinity-Connect-Help/Can-t-send-emails-with-Kindle-Fire/m-p/...

  • RELEVANCY SCORE 2.62

    DB:2.62:Failer To Load The Library D3d9.Dll zs



    Hi!

    I have problems with installing skype into my computer. after download it allways write the same thing: fatal error : failer to load the library d3d9.dll . does anyone know what to do with it??? thank you very much!!!

    DB:2.62:Failer To Load The Library D3d9.Dll zs

    marcelka-x wrote:
    Hi!

    I have problems with installing skype into my computer. after download it allways write the same thing: fatal error : failer to load the library d3d9.dll . does anyone know what to do with it??? thank you very much!!!

    You can also try to update your DirectX installation:

    http://www.microsoft.com/download/en/details.aspx?​id=35

  • RELEVANCY SCORE 2.61

    DB:2.61:Jdeveloper 10.1.3 Oc4j Not Working pm


    I get the following error when trying to run a project. At first I thought it was some issue with my project and libraries etc but then I created a simple project with one jsp and it still does the same. Any one got any idea?

    OC4J startup failed

    oracle.oc4j.loader.util.AnnotatedClassNotFoundException:

    Missing class: oracle.dms.instrument.NounIntf

    Dependent class: java.lang.Class
    Loader: jre bootstrap
    Code-Source: unknown
    Configuration: jre bootstrap

    This load was initiated at oc4j:10.1.3 using the loadClass() method.

    at oracle.oc4j.loader.PolicyClassLoader.handleClassNotFound (PolicyClassLoader.java:1956) [C:/j2ee/home/oc4j.jar (from system property java.class.path), by sun.misc.Launcher$AppClassLoader@12]

    at oracle.oc4j.loader.PolicyClassLoader.internalLoadClass (PolicyClassLoader.java:1641) [C:/j2ee/home/oc4j.jar (from system property java.class.path), by sun.misc.Launcher$AppClassLoader@12]

    at oracle.oc4j.loader.PolicyClassLoader.loadClass (PolicyClassLoader.java:1591) [C:/j2ee/home/oc4j.jar (from system property java.class.path), by sun.misc.Launcher$AppClassLoader@12]

    at oracle.oc4j.loader.PolicyClassLoader.loadClass (PolicyClassLoader.java:1577) [C:/j2ee/home/oc4j.jar (from system property java.class.path), by sun.misc.Launcher$AppClassLoader@12]

    at java.lang.ClassLoader.loadClassInternal (ClassLoader.java:302) [jre bootstrap, by jre bootstrap]

    at java.lang.Class.getDeclaredMethods0 (Native method) [unknown, by unknown]

    at java.lang.Class.privateGetDeclaredMethods (Class.java:1647) [jre bootstrap, by jre bootstrap]

    at java.lang.Class.getMethod0 (Class.java:1893) [jre bootstrap, by jre bootstrap]

    at java.lang.Class.getMethod (Class.java:976) [jre bootstrap, by jre bootstrap]

    at oracle.oc4j.loader.boot.MainClass.invoke (MainClass.java:73) [C:/j2ee/home/oc4j.jar (from system property java.class.path), by sun.misc.Launcher$AppClassLoader@12]

    at oracle.oc4j.loader.boot.BootStrap.main (BootStrap.java:226) [C:/j2ee/home/oc4j.jar (from system property java.class.path), by sun.misc.Launcher$AppClassLoader@12]

    Process exited with exit code 0.

    DB:2.61:Jdeveloper 10.1.3 Oc4j Not Working pm

    I get the following error when trying to run a project. At first I thought it was some issue with my project and libraries etc but then I created a simple project with one jsp and it still does the same. Any one got any idea?

    OC4J startup failed

    oracle.oc4j.loader.util.AnnotatedClassNotFoundException:

    Missing class: oracle.dms.instrument.NounIntf

    Dependent class: java.lang.Class
    Loader: jre bootstrap
    Code-Source: unknown
    Configuration: jre bootstrap

    This load was initiated at oc4j:10.1.3 using the loadClass() method.

    at oracle.oc4j.loader.PolicyClassLoader.handleClassNotFound (PolicyClassLoader.java:1956) [C:/j2ee/home/oc4j.jar (from system property java.class.path), by sun.misc.Launcher$AppClassLoader@12]

    at oracle.oc4j.loader.PolicyClassLoader.internalLoadClass (PolicyClassLoader.java:1641) [C:/j2ee/home/oc4j.jar (from system property java.class.path), by sun.misc.Launcher$AppClassLoader@12]

    at oracle.oc4j.loader.PolicyClassLoader.loadClass (PolicyClassLoader.java:1591) [C:/j2ee/home/oc4j.jar (from system property java.class.path), by sun.misc.Launcher$AppClassLoader@12]

    at oracle.oc4j.loader.PolicyClassLoader.loadClass (PolicyClassLoader.java:1577) [C:/j2ee/home/oc4j.jar (from system property java.class.path), by sun.misc.Launcher$AppClassLoader@12]

    at java.lang.ClassLoader.loadClassInternal (ClassLoader.java:302) [jre bootstrap, by jre bootstrap]

    at java.lang.Class.getDeclaredMethods0 (Native method) [unknown, by unknown]

    at java.lang.Class.privateGetDeclaredMethods (Class.java:1647) [jre bootstrap, by jre bootstrap]

    at java.lang.Class.getMethod0 (Class.java:1893) [jre bootstrap, by jre bootstrap]

    at java.lang.Class.getMethod (Class.java:976) [jre bootstrap, by jre bootstrap]

    at oracle.oc4j.loader.boot.MainClass.invoke (MainClass.java:73) [C:/j2ee/home/oc4j.jar (from system property java.class.path), by sun.misc.Launcher$AppClassLoader@12]

    at oracle.oc4j.loader.boot.BootStrap.main (BootStrap.java:226) [C:/j2ee/home/oc4j.jar (from system property java.class.path), by sun.misc.Launcher$AppClassLoader@12]

    Process exited with exit code 0.

  • RELEVANCY SCORE 2.61

    DB:2.61:Undo File Corruption(Undo Segments) 3d


    Hello Friends
    My database in archivelog mode(Oracle 9i). What if because of media failure my undo segments got corrupted ?
    Can I recover the database upto failer point ?
    Regards
    Sunil Kumar

    DB:2.61:Undo File Corruption(Undo Segments) 3d

    As Maran mentioned already that if you have sufficient good backups, there wont be any issues with the recovery. In addition to this, search over metalink for the use of the event *10015*. This would help to identify the corrupted undo segments.
    HTH
    Aman....

  • RELEVANCY SCORE 2.61

    DB:2.61:Error : No Passive Nodes Were Successfully Patched 11009 mk


    Hi
    I have a cluster with 2 nodes
    Node 1 is hosting two SQL Server 2005 SP3 instances : Instance1 and Instance2
    Node 2 is hosting two SQL Server 2005 SP3 instances : Instance3 and Instance4
    I am trying to upgrade theforth instances from SQL 2005 SP3 to SP4, I have switched all instances on node1 and run the SP4 from node 1,

    the upgrade succeeded only on Instance2 and fail on other instances with this error :
    No passive nodes were successfully patched 11009
    Here is the summary log
    Product Installation Status
    Product : Setup Support Files
    Product Version (Previous): 4035
    Product Version (Final) : 5000
    Status : Success
    Log File : C:\Program Files\Microsoft SQL Server\90\Setup Bootstrap\LOG\Hotfix\Redist9_Hotfix_KB2463332_SqlSupport.msi.log
    Error Number : 0
    Error Description :
    ----------------------------------------------------------------------------------
    Product : Database Services (Instance1)
    Product Version (Previous): 4035
    Product Version (Final) :
    Status : Failure
    Log File :

    Error Number : 11009
    Error Description : No passive nodes were successfully patched
    ----------------------------------------------------------------------------------
    Product : Database Services (Instance2)
    Product Version (Previous): 4035
    Product Version (Final) : 5000
    Status : Reboot Required
    Log File : C:\Program Files\Microsoft SQL Server\90\Setup Bootstrap\LOG\Hotfix\SQL9_Hotfix_KB2463332_sqlrun_sql.msp.log
    Error Number : 3010
    Error Description :
    ----------------------------------------------------------------------------------
    Product : Database Services (Instance3)
    Product Version (Previous): 4035
    Product Version (Final) :
    Status : Failure
    Log File :

    Error Number : 11009
    Error Description : No passive nodes were successfully patched
    ----------------------------------------------------------------------------------
    Product : Database Services (Instance4)
    Product Version (Previous): 4035
    Product Version (Final) :
    Status : Failure
    Log File :

    Error Number : 11009
    Error Description : No passive nodes were successfully patched
    ----------------------------------------------------------------------------------
    I have go through the logs generated and cannot figure out the reason for this failer, do you have any idea what may cause this? and how to fix it?

    OS Version : Windows server 2003
    SQL Version :SQL 2005 SP3
    Thank you
    Mohamed B.

    DB:2.61:Error : No Passive Nodes Were Successfully Patched 11009 mk

    Thanks all for your reply
    I have checked the links indicated here and the logs on passive and active nodes and my issue is not related to registry or DN, but seems related to scheduler
    For instances 1,3 and 4 the setupreceived exit code 1073807364 from scheduled taskand failed
    For instance 2 the setup received exit code 3010 from scheduled task and continue the upgrade with success
    Here is the part of the log:
    Log for failed upgrade : Instance1
    09/16/2012 03:59:02.875 Task Scheduler: Created scheduled task for product instance target
    \\Node02
    09/16/2012 03:59:02.891 Task Scheduler: Started scheduled task for product instance target
    \\Node02
    09/16/2012 03:59:02.891 Task Scheduler: Started scheduled task for product instance target
    \\Node02
    09/16/2012 04:01:44.890 Task Scheduler: Scheduled task for product instance target has completed
    09/16/2012 04:01:44.890 Task Scheduler: Waiting for exit code from scheduled task for product instance target
    \\Node02
    09/16/2012 04:01:49.890 Task Scheduler: Received exit code 1073807364 from scheduled task for product instance target
    \\Node02
    09/16/2012 04:01:49.890 Task Scheduler: Result code for scheduled task for product instance target has been received
    09/16/2012 04:01:49.890 Task Scheduler: Removed scheduled task for product instance target
    \\Node02
    09/16/2012 04:01:50.093 Task Scheduler: Removed remote folder for product instance target
    \\Node02
    09/16/2012 04:01:50.093 Remote process completed for product instance target
    09/16/2012 04:01:50.093 Exit code for passive node: Node02 = 1073807364
    09/16/2012 04:01:53.437 The following exception occurred: No passive nodes were successfully patched Date: 09/16/2012 04:01:53.437 File: \depot\sqlvault\stable\setupmainl1\setup\sqlse\sqlsedll\instance.cpp Line: 3510
    Log for successed upgrade : Instance2
    09/16/2012 04:02:12.202 Task Scheduler: Created scheduled task for product instance target
    \\Node02
    09/16/2012 04:02:12.218 Task Scheduler: Started scheduled task for product instance target
    \\Node02
    09/16/2012 04:02:12.218 Task Scheduler: Started scheduled task for product instance target
    \\Node02
    09/16/2012 04:16:33.228 Task Scheduler: Scheduled task for product instance target has completed
    09/16/2012 04:16:33.228 Task Scheduler: Waiting for exit code from scheduled task for product instance target
    \\Node02
    09/16/2012 04:16:38.228 Task Scheduler: Received exit code 3010 from scheduled task for product instance target
    \\Node02
    09/16/2012 04:16:38.228 Task Scheduler: Result code for scheduled task for product instance target has been received
    09/16/2012 04:16:38.228 Task Scheduler: Removed scheduled task for product instance target
    \\Node02
    09/16/2012 04:16:38.431 Task Scheduler: Removed remote folder for product instance target
    \\Node02
    09/16/2012 04:16:38.431 Remote process completed for product instance target
    09/16/2012 04:16:38.431 Exit code for passive node: Node02 = 3010
    09/16/2012 04:16:38.884 First successful passive node has been completed
    ..
    The log for Instance3 and 4 is the same as Instance1
    Also please notethat I have ran the upgrade against the four instances in the same time and not one by one

    Thank you very much for you help
    Mohamed B.

  • RELEVANCY SCORE 2.61

    DB:2.61:Failer Code 10 With E250 cc



    Hi

    I can not see my e250 (SDMX4-2048-E70) when I connect to computer (Windows XP sytem showing code 10 failer during controller instalation)

    and....

    in e250 settings I don't have USB mode folder ????

    Thanks

    DB:2.61:Failer Code 10 With E250 cc


    1.) You should start a new thread, rather than latching on to an 8 month old one.

    2.) You haven't mentioned anything about a Code 10 error msg. that would make yours a 'similar' issue.

    3.) But as long as you're here . . .

    I'm sorry you had to settle for a new computer with Vista on it. My condolences . . . just kidding, but we hear from a lot of people with Vista compatibility problems. I only run XP so I can't help you much there, but . . .

    When you said, "when I open the program and it prompts me to plug in my player" exactly what program are you opening? If it's Windows Media Player, your player must be in MTP mode to 'sync' up with it. You can change this in SETTINGS USB mode.

    When you say, "My computer recognizes it however, and goes to "autorun", asking me what action to take... but I cannot view and manipulate my music on the player this way." This tells me your player is probably in MSC mode (the other USB option). There is nothing wrong here. That is what is supposed to happen (autorun). MSC allows your computer to see your player as another storage device/drive. It's very simple to drag drop files (songs) to it in this mode. It is the preferred mode for most of the 'old-timers' here.

    If you cannot see or 'manipulate' your music, it means that it was put on in MTP mode. Content put on in one USB mode is not visible in the other. So as in the previous paragraph, you probably need to switch the USB mode to MTP and you'll be OK.

  • RELEVANCY SCORE 2.60

    DB:2.60:Sap Management Console - J2ee Developer Trace File --Help ak



    Hi ,

    After installaing my Server , In SAP Management Console J2EE Server is stopped , it says Synchronising Binary and then stopped

    Here is the Developer Trace , Would anyone help me

    [Thr 3712] Tue Nov 14 11:28:02 2006

    [Thr 3712] *** ERROR = invalid return code of process [bootstrap] (exitcode=66) [jstartxx.c 1433]

    [Thr 3712] JControlExecuteBootstrap: error executing bootstrap node [bootstrap] (rc=66)

    [Thr 3712] JControlCloseProgram: started (exitcode = 66)

    [Thr 3712] JControlCloseProgram: good bye... (exitcode=66)

    DB:2.60:Sap Management Console - J2ee Developer Trace File --Help ak


    Hi ,

    After installaing my Server , In SAP Management Console J2EE Server is stopped , it says Synchronising Binary and then stopped

    Here is the Developer Trace , Would anyone help me

    [Thr 3712] Tue Nov 14 11:28:02 2006

    [Thr 3712] *** ERROR = invalid return code of process [bootstrap] (exitcode=66) [jstartxx.c 1433]

    [Thr 3712] JControlExecuteBootstrap: error executing bootstrap node [bootstrap] (rc=66)

    [Thr 3712] JControlCloseProgram: started (exitcode = 66)

    [Thr 3712] JControlCloseProgram: good bye... (exitcode=66)

  • RELEVANCY SCORE 2.60

    DB:2.60:Mounting Failer- Help Please 9z


    Can some one help me? I did some security updates to my Tiger now it will not mount dmg files. When I download a dmg file it says mounting failer. What can I do to get my Tiger to mount dmg files? Please help me, Thanks

    DB:2.60:Mounting Failer- Help Please 9z

    Can some one help me? I did some security updates to my Tiger now it will not mount dmg files. When I download a dmg file it says mounting failer. What can I do to get my Tiger to mount dmg files? Please help me, Thanks

  • RELEVANCY SCORE 2.60

    DB:2.60:Hp Officejet Pro X476dw Mfp a3



    I keep having a printer failer of 0Xc6fdd0813 come up. What do I need to do?

    DB:2.60:Hp Officejet Pro X476dw Mfp a3


    I keep having a printer failer of 0Xc6fdd0813 come up. What do I need to do?

  • RELEVANCY SCORE 2.60

    DB:2.60:Bootstrap kp


    automatic bootstrap has stopped working ? doh help!

    DB:2.60:Bootstrap kp

    Duplicate of
    http://answers.microsoft.com/en-us/windowslive/forum/liveid-wlsecurity/bootstrap-stooped-working/41bf0f11-3870-4b8f-b3a1-df62c6b8069e (25 January 2012)

  • RELEVANCY SCORE 2.60

    DB:2.60:I Cant Get Sql Serever 2005 Express To Install cx


    I've tried several times and have not been able to get the process finished to instal sql server 2005 express to load on my computer.
    I get to the very end and get a failure. I went to the error log  and got this:
    Microsoft SQL Server 2005 9.00.1399.06 ============================== OS Version      : Microsoft Windows XP Professional Service Pack 2 (Build 2600) Time            : Fri Feb 17 10:48:10 2006  TELFORDT : The current system does not meet recommended hardware requirements for this SQL Server release. For detailed hardware requirements, see the readme file or SQL Server Books Online.Machine         : TELFORDT Product         : Microsoft SQL Server Setup Support Files (English) Product Version : 9.00.1399.06 Install         : Successful Log File        : c:\Program Files\Microsoft SQL Server\90\Setup Bootstrap\LOG\Files\SQLSetup0005_TELFORDT_SQLSupport_1.log -------------------------------------------------------------------------------- Machine         : TELFORDT Product         : Microsoft SQL Server Native Client Product Version : 9.00.1399.06 Install         : Successful Log File        : c:\Program Files\Microsoft SQL Server\90\Setup Bootstrap\LOG\Files\SQLSetup0005_TELFORDT_SQLNCLI_1.log -------------------------------------------------------------------------------- Machine         : TELFORDT Product         : Microsoft SQL Server VSS Writer Product Version : 9.00.1399.06 Install         : Successful Log File        : c:\Program Files\Microsoft SQL Server\90\Setup Bootstrap\LOG\Files\SQLSetup0005_TELFORDT_SqlWriter_1.log -------------------------------------------------------------------------------- Machine         : TELFORDT Product         : MSXML 6.0 Parser Product Version : 6.00.3883.8 Install         : Successful Log File        : c:\Program Files\Microsoft SQL Server\90\Setup Bootstrap\LOG\Files\SQLSetup0005_TELFORDT_MSXML6_1.log -------------------------------------------------------------------------------- Machine         : TELFORDTProduct         : SQL Server Database ServicesError           : The SQL Server service failed to start. For more information, see the SQL Server Books Online topics, How to: View SQL Server 2005 Setup Log Files and Starting SQL Server Manually.--------------------------------------------------------------------------------Machine         : TELFORDT Product         : Microsoft SQL Server 2005 Express Edition Product Version : 9.00.1399.06 Install         : Failed Log File        : c:\Program Files\Microsoft SQL Server\90\Setup Bootstrap\LOG\Files\SQLSetup0005_TELFORDT_SQL.log Last Action     : InstallFinalize Error String    : The SQL Server service failed to start. For more information, see the SQL Server Books Online topics, How to: View SQL Server 2005 Setup Log Files and Starting SQL Server Manually.The error is  (1067) The process terminated unexpectedly. Error Number    : 29503 --------------------------------------------------------------------------------
     SQL Server Setup failed. For more information, review the Setup log file in %ProgramFiles%\Microsoft SQL Server\90\Setup Bootstrap\LOG\Summary.txt.
    Time            : Fri Feb 17 10:57:51 2006
    List of log files: c:\Program Files\Microsoft SQL Server\90\Setup Bootstrap\LOG\Files\SQLSetup0005_TELFORDT_Core(Local).log c:\Program Files\Microsoft SQL Server\90\Setup Bootstrap\LOG\Files\SQLSetup0005_TELFORDT_SQLSupport_1.log c:\Program Files\Microsoft SQL Server\90\Setup Bootstrap\LOG\Files\SQLSetup0005_TELFORDT_SQLNCLI_1.log c:\Program Files\Microsoft SQL Server\90\Setup Bootstrap\LOG\Files\SQLSetup0005_TELFORDT_SqlWriter_1.log c:\Program Files\Microsoft SQL Server\90\Setup Bootstrap\LOG\Files\SQLSetup0005_TELFORDT_MSXML6_1.log c:\Program Files\Microsoft SQL Server\90\Setup Bootstrap\LOG\Files\SQLSetup0005_TELFORDT_SQL.log c:\Program Files\Microsoft SQL Server\90\Setup Bootstrap\LOG\Files\SQLSetup0005_TELFORDT_Datastore.xml c:\Program Files\Microsoft SQL Server\90\Setup Bootstrap\LOG\Files\SQLSetup0005_TELFORDT_.NET Framework 2.0.log c:\Program Files\Microsoft SQL Server\90\Setup Bootstrap\LOG\Files\SQLSetup0005_TELFORDT_Support.log c:\Program Files\Microsoft SQL Server\90\Setup Bootstrap\LOG\Files\SQLSetup0005_TELFORDT_Core.log c:\Program Files\Microsoft SQL Server\90\Setup Bootstrap\LOG\Summary.txt c:\Program Files\Microsoft SQL Server\90\Setup Bootstrap\LOG\Files\SQLSetup0005_TELFORDT_SCC.log c:\Program Files\Microsoft SQL Server\90\Setup Bootstrap\LOG\Files\SQLSetup0005_TELFORDT_WI.log c:\Program Files\Microsoft SQL Server\MSSQL.1\MSSQL\LOG\ERRORLOG
     
    Since I am new to this. . . What does it all mean?

    DB:2.60:I Cant Get Sql Serever 2005 Express To Install cx

    Hi, I am  getting the same erro when installing SQL 2005
    I have tried unimstalling the VS 2008 Express Edition from my machine and all .net framwork, then reinstalling 2008.
    However, SQL is sill giving me the bootstrap errro at the end of install.
     
    Does anyone know what I may still be doing wrong?
     
    Thank you
    Mark
     

  • RELEVANCY SCORE 2.60

    DB:2.60:Jcontrol.Exe Not Starting k1



    Hi all,

    The jcontrol.exe in the Web Application Server is not starting. Following is the error

    [Thr 2068] Fri Nov 18 16:15:53 2005

    [Thr 2068] *** ERROR = invalid return code of process [bootstrap] (exitcode=66) [jstartxx.c 1433]

    [Thr 2068] JControlExecuteBootstrap: error executing bootstrap node [bootstrap] (rc=66)

    [Thr 2068] JControlCloseProgram: started (exitcode = 66)

    [Thr 2068] JControlCloseProgram: good bye... (exitcode=66)

    Pls advise me what to do

    Thanks and regards

    Rohit

    Regards

    Rohit

    DB:2.60:Jcontrol.Exe Not Starting k1


    Folks,

    I have a similar issue with jcontrol which stops as soon as I start the server...

    logs files says unable to synchronize Fontmangerservice_native.zip from db to filesystem....

    check for bootstrap logs(jvm dispatcher) these are very helpful...

    In my case increasing bootstrap memory did the trick....

    Regards,

    Dinakar

  • RELEVANCY SCORE 2.60

    DB:2.60:7610 Error Massage kp


    I have error message "start-up failer contact your retailer" , please if any one knows the reasone of this message please answer me

    DB:2.60:7610 Error Massage kp

    Something is so wrong that the phone cannot start up properly.

    Instead of contacting the retailer that sold it, like the message says, look up your nearest Nokia authorized service/repair center and contact them: http://www.nokia.com/repair

  • RELEVANCY SCORE 2.60

    DB:2.60:Hard Disk Failer p7



    failur ID: GLNGC-00070E-QFPJXG-60F803

    product ID: C9K69UT#ABA

    DB:2.60:Hard Disk Failer p7


    Hi,

    We seem to be missing a character from the first section of the failure code, but if you're getting it at all, you need to replace the hard drive.

  • RELEVANCY SCORE 2.59

    DB:2.59:Failer Id And Product Id cc



    can anyone help with this failer code (revised code on 2nd test) hp envy 17-3270nr notebook pc

    Failer id 9E2ET9-67A70M-XD6X1F-60S803

    Product id A9P84UA#ABA

    DB:2.59:Failer Id And Product Id cc


    It is difficult to say what caused it. It happens due to many different reasons. It could be a mechanical or a electronic failure, power surge,virus, heat,software conflicts,improper shutdowns etc..

    Here are few links that gives a pretty good explanation about the causes of hard drive failures

    Link1

    Link2

  • RELEVANCY SCORE 2.59

    DB:2.59:Warning Message. ? 3k


    --------------------Configuration: MyFirstProject - JDK version 1.7.0 javac - Default--------------------
    warning: [options] bootstrap class path not set in conjunction with -source 1.5
    1 warning

    Process completed.

    DB:2.59:Warning Message. ? 3k

    JCreator being an Oracle product? Try the JCreator forums instead: http://www.jcreator.com/forums/index.php

    CM.

  • RELEVANCY SCORE 2.58

    DB:2.58:Re: Ora-00704: Bootstrap Process Failure Ora-39700: Database Must Be Opened Wit ax


    You'er doing
    1. database move across plateform
    2. an upgrade
    That cannot work so simple as you did.
    Please, read carefully the following thread :
    Database Migration

    You should :
    1. manage a database conversion (if possible regarding the endianess of your both OS)
    2. an upgrade

    Nicolas.

    DB:2.58:Re: Ora-00704: Bootstrap Process Failure Ora-39700: Database Must Be Opened Wit ax

    Without being licensed, and without access to Metalink, you cannot get the patchset 10.2.0.3 to manage the upgrade on RHEL.
    So, you probably should think about an other way, like export/import.

    Nicolas.

  • RELEVANCY SCORE 2.55

    DB:2.55:Failer To Configer Update zm


    My computer update Update for Windows 8 for x64-based Systems (KB2821

    keep failling to configure and 14 similar update do the same. So thay download ok install ok but don't configure what can i do .

    DB:2.55:Failer To Configer Update zm

    To avoid confusion duplication of effort, please post any/all further follow-up in replies to your original thread =http://answers.microsoft.com/en-us/windows/forum/windows_8-windows_update/gets-the-error-failure-configuring-windows-updates/72c8425e-2fb1-4f13-8b78-e062db0104b6(07
    May 2013 ff)

    That being said...

    KB2821895 is an Optional,
    non-security update (yes, even though it's offered as an Important update). Feel free to hide it move on with your life.

    • HOW TO Hide an Update or Restore a Hidden Update [good for Win8, too]

    http://www.sevenforums.com/tutorials/24376-windows-update-hide-restore-hidden-updates.html

    PS: Looks lik ur spiel chukkers broke now two...

  • RELEVANCY SCORE 2.54

    DB:2.54:Bootstrap Process Failure ad


    Hi Everybody,

    Database Version:Oracle Database 10g Enterprise Edition Release 10.2.0.1.0 - Prod

    Os:Windows Xp.

    When I am trying to startup the Database it giving me the following error..
    SQL startup
    ORACLE instance started.

    Total System Global Area 113246208 bytes
    Fixed Size 1247588 bytes
    Variable Size 58721948 bytes
    Database Buffers 50331648 bytes
    Redo Buffers 2945024 bytes
    Database mounted.
    ORA-01092: ORACLE instance terminated. Disconnection forcedWhen i looked into the alert log file it showing me the follwoing error's

    Fri Oct 17 15:47:22 2008
    Errors in file d:\oracle\product\10.2.0\admin\primary\udump\primary_ora_3812.trc:
    ORA-00704: bootstrap process failure
    ORA-00604: error occurred at recursive SQL level 2
    ORA-04031: unable to allocate 16 bytes of shared memory ("shared pool","select o.owner#,o.name,o.nam...","sql area","kggsmInitCompact:offsetVec")

    Fri Oct 17 15:47:22 2008
    Error 704 happened during db open, shutting down database
    USER: terminating instance due to error 704
    ARC2 started with pid=16, OS id=3024
    Fri Oct 17 15:47:22 2008
    Errors in file d:\oracle\product\10.2.0\admin\primary\bdump\primary_lns1_872.trc:
    ORA-00704: bootstrap process failure

    Fri Oct 17 15:47:22 2008
    Errors in file d:\oracle\product\10.2.0\admin\primary\bdump\primary_reco_3120.trc:
    ORA-00704: bootstrap process failure

    Fri Oct 17 15:47:22 2008
    Errors in file d:\oracle\product\10.2.0\admin\primary\bdump\primary_pmon_2652.trc:
    ORA-00704: bootstrap process failure

    Fri Oct 17 15:47:23 2008
    Errors in file d:\oracle\product\10.2.0\admin\primary\bdump\primary_ckpt_928.trc:
    ORA-00704: bootstrap process failure

    Fri Oct 17 15:47:23 2008
    Errors in file d:\oracle\product\10.2.0\admin\primary\bdump\primary_lgwr_3332.trc:
    ORA-00704: bootstrap process failure

    Fri Oct 17 15:47:23 2008
    Errors in file d:\oracle\product\10.2.0\admin\primary\bdump\primary_dbw0_1696.trc:
    ORA-00704: bootstrap process failure

    Fri Oct 17 15:47:23 2008
    Errors in file d:\oracle\product\10.2.0\admin\primary\bdump\primary_mman_1724.trc:
    ORA-00704: bootstrap process failure

    Fri Oct 17 15:47:24 2008
    Errors in file d:\oracle\product\10.2.0\admin\primary\bdump\primary_psp0_2464.trc:
    ORA-00704: bootstrap process failure

    Instance terminated by USER, pid = 3812
    ORA-1092 signalled during: ALTER DATABASE OPEN...even i looked into the trace files mentioned in the alert log but no definite information is provided out there.....

    How to overcome this Bootstrap process failure error.......

    Any Help Appreciated..

    Regards,
    Prosenjit Mukherjee.

    DB:2.54:Bootstrap Process Failure ad

    Recommended action for ORA-00704 is to contact Oracle support.

    Just out of curiosity, whats the machine configuration?

  • RELEVANCY SCORE 2.54

    DB:2.54:Webas J2ee Stopped 73



    Hi,

    I require immediate help my WebAS J2EE 7.0 one of the instance is stopped.(Jcontrol.exe).

    On Looking inot the log files dev_Jcontrol and bootstrap i see the error.

    b** ERROR = invalid return code of process [bootstrap] (exitcode = 66) [jstartxx.c 1642]

    [Thr 6928] JControlExecuteBootstrap: error executing bootstrap node [bootstrap] (rc = 66)

    [Thr 6928] JControlCloseProgram: started (exitcode = 66)

    [Thr 6928] JControlCloseProgram: good bye... (exitcode = 66)/b

    Although my DB is up i am see in the log files DB connect failed.

    Because of some reason i beleive in the bsecurestore/b of config tool the value forb jdbc/pool/CWP/Password/b has been changed so it shows this error of not being able to connect to DB.

    Can any one help on how to get the value of bjdbc/pool/CWP/Password/b revereted back as i try to chnage it it does not help the problem remains the same.

    Thanks

    Saurabh.

    DB:2.54:Webas J2ee Stopped 73


    I have resolved the issue by chnaging unlocking the SAPSIDDB user by connecting to oracle10.0.

    I connected to oracle thru master user/Pwd and unlocked the account in hte GUI and this resolved the problem.

    Thanks

    Saurabh.

  • RELEVANCY SCORE 2.54

    DB:2.54:J2ee Server Stopped Exitcode = 66 7z



    hi,

    [Thr 4556] Wed Feb 16 13:19:23 2011

    [Thr 4556] *** ERROR = invalid return code of process [bootstrap] (exitcode=66) [jstartxx.c 1433]

    [Thr 4556] JControlExecuteBootstrap: error executing bootstrap node [bootstrap] (rc=66)

    [Thr 4556] JControlCloseProgram: started (exitcode = 66)

    [Thr 4556] JControlCloseProgram: good bye... (exitcode=66)

    kindly provide me the solution.

    regards

    ramesh

    DB:2.54:J2ee Server Stopped Exitcode = 66 7z


    Hi Mikhail Palstsianau,

    thx so much issue got resolved..

    regards

    ramesh

  • RELEVANCY SCORE 2.54

    DB:2.54:Trying To Upgrade To 4.0 Error From 3.0 Setup Cannot Proceed Because No Bootstrap Dll Is Present 7s


    Hi all,
     I'm in the process of upgrading a 3.0 system to 4.0. Windows 2003 std sp2 , HP Proliant ML 350.
     I pulled the iso from MS eopen site. File is too large for 700MB cd's, so I installed magic iso to open the file. I go to the i386 make my way to the SetupServer.exe , double-click and I get the error message setup cannot proceed because no bootstrap DLL is present
    here is a copy of the logfiles from the error
    10:09:44|   Info| Running C:\DOCUME~1\ADMINI~2.MEI\LOCALS~1\Temp\1\MagicISO_01C9E38B9E01E677\SetupServer.exe10:09:44|  Error| Setup cannot proceed because no bootstrap DLL is present in . (bootstrapwrapper.h:CBootstrapLibrary::Locate:314).10:12:09|  Error| Setup cannot proceed because no bootstrap DLL is present in ., Error, OK10:12:09|   Info| InputResult: OK10:12:12|   Info| === Setup bootstrap logging ended 6/2/2009 10:12:12 AM ===10:34:09|   Info| === Setup bootstrap logging started 6/2/2009 10:34:09 AM ===10:34:09|   Info| Bootstrap version: 4.0.7333.3.10:34:09|   Info| User: Administrator.10:34:09|   Info| Invoked with command line: C:\DOCUME~1\ADMINI~2.MEI\LOCALS~1\Temp\1\MagicISO_01C9E38F25918C72\SetupServer.exe 10:34:09|   Info| Running C:\DOCUME~1\ADMINI~2.MEI\LOCALS~1\Temp\1\MagicISO_01C9E38F25918C72\SetupServer.exe10:34:09|  Error| Setup cannot proceed because no bootstrap DLL is present in . (bootstrapwrapper.h:CBootstrapLibrary::Locate:314).
    Again the server had no DVD reader only CD. Any suggestions.
    PS...I also tried to burn the image on a DVD just to see if the stars weren't aligned, and I could pull off something slick. No luck needless to say.  
     

  • RELEVANCY SCORE 2.53

    DB:2.53:Failed To Generate A User Instance Of Sql Server a3


    pHello,/ppI have upgrade my SQL Server 2008 Expressnbsp;to SQL Server 2012 Express. Now I can't open a database in Visual Basic 2010. An error Failed to generate an User Instance of SQL Server due to a failer in starting the
    process for the User Instance. The connection will nbsp;be closed./ppI don't know what to do, please help me with this problem./ppBest regards, Ger/p

    DB:2.53:Failed To Generate A User Instance Of Sql Server a3

    Hi every body with the same problem!!
    I found my SOLUTION http://support.microsoft.com/kb/2002980
    It's not the SQL Server but the IIS7 configuration!
    Succes for all and best regards,
    Ger

  • RELEVANCY SCORE 2.52

    DB:2.52:Sap Ep On Maxdb Preview - Invalid Vm Detection 9x



    Hi,

    Im trying to install the SAP NetWeaver Enterprise Portal on MaxDB - Developer Edition - Sneak Preview Package on a Windows XP SP2.

    The installation stops during step 23 Start SAP J2EE Engine where the JControl process refuses to start.

    The log report a invalid vm detection error.

    [Thr 5712] Wed Jan 12 00:50:36 2005

    [Thr 5712] JControlExecuteBootstrap: execute bootstrap process [bootstrap]

    [Thr 5712] [Node: bootstrap] java home is set by profile parameter

    Java Home: C:\usr\java\j2sdk1.4.2_X

    [Thr 5712] Wed Jan 12 00:50:37 2005

    [Thr 5712] *** WARNING = Can't read output file [./JdkDetection_5680.txt] [jstartxxi.c 959]

    [Thr 5712] *** WARNING = Can't read output file [./JdkDetection_5680.txt] [jstartxxi.c 959]

    [Thr 5712] *** ERROR = invalid vm detection, please have a look the files [jstartxxi.c 1040]

    - java command ["C:\usr\java\j2sdk1.4.2_X\bin\java.exe" -cp . JdkDetection_5680 ./JdkDetection_5680.txt 21]

    - output file [./JdkDetection_5680.txt]

    - java file [./JdkDetection_5680.java]

    - class file [JdkDetection_5680]

    - used vm type [-server]

    - used vm type []

    [Thr 5712] *** ERROR = can't get JDK information (rc=-1) [jstartxxi.c 1096]

    [Thr 5712] *** ERROR = node [bootstrap] not found [jstartxx.c 1388]

    [Thr 5712] JControlExecuteBootstrap: error executing bootstrap node [bootstrap] (rc=-18)

    [Thr 5712] JControlCloseProgram: started (exitcode = -18)

    [Thr 5712] JControlCloseProgram: good bye... (exitcode=-18).

    I do not know why the process can not read the file (./JdkDetection_5680.txt). It is created in C:\usr\sap\J2E\JC00\work together with a .java and .class file.

    Im using java version "1.4.2_06" and %JAVA_HOME%\bin has been added to the path.

    Best regards,

    Henrik

    DB:2.52:Sap Ep On Maxdb Preview - Invalid Vm Detection 9x


    I'm having the same problem. CAn someone post the solution?

    Thank you,

    Denis

  • RELEVANCY SCORE 2.52

    DB:2.52:Error Executing Bootstrap Node mj



    Hi,

    Bootstrap issues in J2ee Engine while starting XI 3.0. Tried to restart

    the j2ee engine but bootstrap is going down and other process like jcontrol,dispatcher,server0 and sdm is not coming up. We found the error in dev_jcontrol file "error executing bootstrap mode".

    We have seen that j2ee/cluster - instance.properties.vmprop file is creating after every restart of j2ee engine.

    Hopes your reply at the earliest.

    Thanking You

    Regards

    Gopinath

    DB:2.52:Error Executing Bootstrap Node mj


    Hi,

    Bootstrap issues in J2ee Engine while starting XI 3.0. Tried to restart

    the j2ee engine but bootstrap is going down and other process like jcontrol,dispatcher,server0 and sdm is not coming up. We found the error in dev_jcontrol file "error executing bootstrap mode".

    We have seen that j2ee/cluster - instance.properties.vmprop file is creating after every restart of j2ee engine.

    Hopes your reply at the earliest.

    Thanking You

    Regards

    Gopinath

  • RELEVANCY SCORE 2.51

    DB:2.51:Safari Will Not Reopen After Failer Notice k9


    Did install a 3rd party app for sketchUP

    DB:2.51:Safari Will Not Reopen After Failer Notice k9

    Thanks for your help, But I had to downloaded a new Maverick OSX and while loading it, the install program removed the genieo file. - must have been the problem. I found a reply from you just now on another persons question on how to remove all geneo app files. Will do this now. thanks for your help.

  • RELEVANCY SCORE 2.51

    DB:2.51:Cjs-30059 Java Ee Engine Configuration Error. j1



    hi,

    while installing EP i faced an error in the configuration of sld phase.

    CJS-30059 Java EE Engine configuration error.

    DIAGNOSIS: Error when configuring J2EE Engine.

    See output of logfile java.log: 'IO EXCEPTION: Connection refused: connect::'.

    I gone through the developer trace of jcontrol.exe process. i observed the following error.

    [Thr 1292] Fri Jan 02 10:56:55 2009

    [Thr 1292] *** ERROR = invalid return code of process [bootstrap] (exitcode = 66) [jstartxx.c 1642]

    [Thr 1292] JControlExecuteBootstrap: error executing bootstrap node [bootstrap] (rc = 66)

    [Thr 1292] JControlCloseProgram: started (exitcode = 66)

    [Thr 1292] JControlCloseProgram: good bye... (exitcode = 66)

    DataBase : MSSQL

    OS : windows 2003 .

    Netweaver 04S

    Any one plz help me to resolve this issue.

    DB:2.51:Cjs-30059 Java Ee Engine Configuration Error. j1


    Hi,

    can you confirm that you are able to login to the J2EE main page (http-connect) with the user J2EE_ADMIN ?

    If this should fail - please restart the J2EE engine from transaction SMICM and retry the log in.

    Best regards,

  • RELEVANCY SCORE 2.51

    DB:2.51:Configuring Time Machine To Restore After A Failer pp


    Hi

    how to Configurr Time machine to Restore after a failer ? should i just set the time machine to backup to the external hard disk that have the backup and it will automatically detect it and can use it ? what if there is another backups for another Mac's ?

    DB:2.51:Configuring Time Machine To Restore After A Failer pp

    BusyChris18 wrote:
    How would you restore to a state prior to a bad install/change? I understand how to do a file restore. but what if you installed a program started having problems. then you want to uninstall get all your settings back to the state before the install? in the PC world, you would uninstall the software and then use a "restore point" prior to te install.
    how would you do this with Time Machine?

    You have two choices:

    1. Uninstall the app. If it came with an uninstaller, use that to get all it's related files. If you deleted the uninstaller, download the app again to get the uninstaller and use it. If there is no uninstaller, just delete it and look for it's associated files, usually in your home folder/Library/Application Support. There are some 3rd-party apps that can help with this, such as AppZapper, available from VersionTracker.com or MacUpdate.com.

    In almost all cases, that's the quickest, easiest, most reliable method.

    2. Do a complete system restore, as referenced in the post above, but select a prior backup.

    In nearly all cases, this is vast overkill. There's rarely a reason to do it.

  • RELEVANCY SCORE 2.51

    DB:2.51:Invalid Return Code Of Process [Bootstrap] (Exitcode = 66) [Jstartxx.C 1642 8a



    Hi All

    When i start the server i am getting this error msg

    invalid return code of process [bootstrap] (exitcode = 66) [jstartxx.c 1642])

    Please help me to resolve this issue.

    Thanks

    Rudra

    DB:2.51:Invalid Return Code Of Process [Bootstrap] (Exitcode = 66) [Jstartxx.C 1642 8a


    Hi,

    I also faced the same issue.I checked with SAP note-997510 and as per that I checked the mentioned log files viz:

    dev_bootstrap* - logs from the Startup Framework that shows the

    parameters with which the bootstrap was started

    o log_bootstrap* - logs from the execution of the bootstrap. Shows

    the execution flow from the last session and the possible errors

    o jvm_bootstrap* - logs from the JVM output for the bootstrap

    process. Shows possible JVM problems during the bootstrap

    execution.

    After checking I found that there was no space left for /usr/sap/sid,So I just increased the space and restarted the server.That's all

    My AS Java was up then.

    Regards,

    Vikash

  • RELEVANCY SCORE 2.50

    DB:2.50:Why My Netweaver's Heap Size Is 3000m? I Had Changed 256m,Not Change ap



    dear all:

    the log under the dir "work":

    filename:dev_jcontrol.b01:

    **********************************************************************

    Bootstrap nodes

    - [00] bootstrap : D:\usr\sap\FZB\JC00\j2ee\cluster\instance.properties

    - [01] bootstrap_ID5486600 : D:\usr\sap\FZB\JC00\j2ee\cluster\instance.properties

    - [02] bootstrap_ID5486650 : D:\usr\sap\FZB\JC00\j2ee\cluster\instance.properties

    **********************************************************************

    **********************************************************************

    Worker nodes

    - [00] ID5486600 : D:\usr\sap\FZB\JC00\j2ee\cluster\instance.properties

    - [01] ID5486650 : D:\usr\sap\FZB\JC00\j2ee\cluster\instance.properties

    - [02] sdm : D:\usr\sap\FZB\JC00\SDM\program\config\sdm_jstartup.properties

    **********************************************************************

    [Thr 5180] JControlExecuteBootstrap: execute bootstrap process [bootstrap]

    [Thr 5180] [Node: bootstrap] java home is set by profile parameter

    Java Home: C:\j2sdk1.4.2_18

    [Thr 5180] JStartupICheckFrameworkPackage: can't find framework package D:\usr\sap\FZB\JC00\exe\jvmx.jar

    **********************************************************************

    JStartupIReadSection: read node properties [bootstrap]

    - node name : bootstrap

    - node type : bootstrap

    - node execute : yes

    - java path : C:\j2sdk1.4.2_18

    - java parameters : -Djco.jarm=1

    - java vm version : 1.4.2_18-b06

    - java vm vendor : Java HotSpot(TM) Server VM (Sun Microsystems Inc.)

    - java vm type : server

    - java vm cpu : x86

    - heap size : 3000M

    - root path : D:\usr\sap\FZB\JC00\j2ee\cluster

    - class path : .\bootstrap\launcher.jar

    - OS libs path : D:\usr\sap\FZB\JC00\j2ee\os_libs

    - main class : com.sap.engine.offline.OfflineToolStart

    - framework class : com.sap.bc.proj.jstartup.JStartupFramework

    - registr. class : com.sap.bc.proj.jstartup.JStartupNatives

    - framework path : D:\usr\sap\FZB\JC00\exe\jstartup.jar;D:\usr\sap\FZB\JC00\exe\jvmx.jar

    - parameters : com.sap.engine.bootstrap.Bootstrap ./bootstrap ID0054866

    - debuggable : yes

    - debug mode : no

    - debug port : 60000

    - shutdown timeout : 120000

    **********************************************************************

    **********************************************************************

    JControlStartJLaunch: program = D:\usr\sap\FZB\JC00\exe\jlaunch.exe

    - arg[00] = D:\usr\sap\FZB\JC00\exe\jlaunch.exe

    - arg[01] = pf=D:\usr\sap\FZB\SYS\profile\FZB_JC00_tzgl

    - arg[02] = -DSAPINFO=FZB_00_bootstrap

    - arg[03] = -nodeId=-1

    - arg[04] = -file=D:\usr\sap\FZB\JC00\j2ee\cluster\instance.properties

    - arg[05] = -syncSem=JSTARTUP_WAIT_ON_1660

    - arg[06] = -nodeName=bootstrap

    - arg[07] = -jvmOutFile=D:\usr\sap\FZB\JC00\work\jvm_bootstrap.out

    - arg[08] = -stdOutFile=D:\usr\sap\FZB\JC00\work\std_bootstrap.out

    - arg[09] = -locOutFile=D:\usr\sap\FZB\JC00\work\dev_bootstrap

    - arg[10] = -mode=BOOTSTRAP

    - arg[11] = pf=D:\usr\sap\FZB\SYS\profile\FZB_JC00_tzgl

    - lib path = PATH=C:\j2sdk1.4.2_18\jre\bin\server;C:\j2sdk1.4.2_18\jre\bin;D:\oracle\FZB\102\bin;C:\WINDOWS\system32;C:\WINDOWS;C:\WINDOWS\System32\Wbem;;D:\usr\sap\FZB\SYS\exe\uc\NTI386

    - exe path = PATH=C:\j2sdk1.4.2_18\bin;D:\usr\sap\FZB\JC00\j2ee\os_libs;D:\oracle\FZB\102\bin;C:\WINDOWS\system32;C:\WINDOWS;C:\WINDOWS\System32\Wbem;;D:\usr\sap\FZB\SYS\exe\uc\NTI386

    **********************************************************************

    [Thr 5180] Mon Oct 18 09:10:09 2010

    [Thr 5180] *** ERROR = invalid return code of process [bootstrap] (exitcode = -2) [jstartxx.c 1642]

    [Thr 5180] JControlExecuteBootstrap: error executing bootstrap node [bootstrap] (rc = -2)

    [Thr 5180] JControlCloseProgram: started (exitcode = -2)

    [Thr 5180] JControlCloseProgram: good bye... (exitcode = -2)

    who can help me? thanks a lot!

    DB:2.50:Why My Netweaver's Heap Size Is 3000m? I Had Changed 256m,Not Change ap


    Hello,

    Try SAP Note 710663. Also check the Windows Event Viewer, it should give some useful information.

    Regards,

    Savy.

  • RELEVANCY SCORE 2.50

    DB:2.50:Unable To Start Sap Web Dispatcher kf



    Hi,

    I installed the SAP Web Dispatcher. Created the profile file using the sapwebdisp.exe -bootstrap. Now when I try to run it, it come out this error message.

    *** FATAL: SAP Web Dispatcher process 9092 still alive
    *** FATAL: I better exit now to prevent any damage.

    DB:2.50:Unable To Start Sap Web Dispatcher kf


    Hi,

    after issuing the command: sapwebdisp.exe -bootstrap

    the SAP Web Dispatcher gets configured (profile file created) and is started. The program won't get stopped after the configuration is finished. The SAP Web Dispatcher is still running. You don't need to start it.

    br,

    Tobias

  • RELEVANCY SCORE 2.50

    DB:2.50:Server Not Coming Up. mp


    Hi,My server is not starting up and the developer trace for jcontrol.exe is showing the following :[Thr 3268] Wed Sep 27 10:18:01 2006[Thr 3268] *** ERROR = invalid return code of process [bootstrap] (exitcode = 66) [jstartxx.c 1642][Thr 3268] JControlExecuteBootstrap: error executing bootstrap node [bootstrap] (rc = 66)[Thr 3268] JControlCloseProgram: started (exitcode = 66)[Thr 3268] JControlCloseProgram: good bye... (exitcode = 66)

    DB:2.50:Server Not Coming Up. mp

    Hi Manna, This is caused due to shared memory issues. You can checkout for below work arounds :1. Simply stop all services and then restart again.2. Goto run directory and edit startup.properties file and increase all 256 to 512 or if 512 to 1024 (bootstrap, maxHeapSize etc) this also helps sometimes.Please let me know if you couldnt resolve problem.Best Rgds,Pradeep MN

  • RELEVANCY SCORE 2.50

    DB:2.50:Creating Crc File Failer k3



    My computer stared malfunctioning few days ago. It would restard few times a day, show BSOD, freeze and stuff like that so i decided to do a System recover to out of box state. I have a Toshiba Satellite P750 with WIndows 7 64-bit. Recovery process was doing fine until it got to "Now creating CRC file" and than it failed somewhere at 40%. It said "Recovery failed. Click OK to restart computer". I didn't write down the error code. But after restart, the setup started again and and message "Initializing partition" showed up. Computer restarted imediately and Windows 7 began to boot up. It booted up and is currently installing drivers,packages and other programs with no sign of errors. Should I start the recovery pricess again or should I continue to work normally after the pasckages install?

    DB:2.50:Creating Crc File Failer k3


    It's hard to know for sure. If it was me, I'd probably just use it cautiously for a while. If everything seems okay, I'd stick with it.




    - Peter

  • RELEVANCY SCORE 2.50

    DB:2.50:Twitter Bootstrap cx



    Are you using Twitter Bootstrap to create websites? Please elaborate.

    DB:2.50:Twitter Bootstrap cx


    You can try the DMXzone Bootstrap extension for Dreamweaver. It has a great integration in design view and you can create responsive layouts pretty easy. Oh, yes it's also free of charge, all you need to do is download and install it in DW.

  • RELEVANCY SCORE 2.49

    DB:2.49:Java System Is Down x9



    Dear Experts,

    After restart the server the Java instance not coming up.The OS is linux,Database is Oracle.

    Please find dev_Jcontrol log below,

    **********************************************************************

    [Thr 47645425756288] JStartupICreateProcess: fork process (pid 29048)

    [Thr 47645425756288] Mon Apr 8 17:49:05 2013

    [Thr 47645425756288] *** ERROR = invalid return code of process [bootstrap] (exitcode = 66) [jstartxx_mt. 1642]

    [Thr 47645425756288] JControlExecuteBootstrap: error executing bootstrap node [bootstrap] (rc = 66)

    [Thr 47645425756288] JControlCloseProgram: started (exitcode = 66)

    [Thr 47645425756288] JControlCloseProgram: good bye... (exitcode = 66)

    dev_bootstrap:

    [Thr 1078200640] JHVM_LoadJavaVM: Java VM created OK.

    **********************************************************************

    JHVM_BuildArgumentList: main method arguments of node [bootstrap]

    - arg[ 0]: com.sap.engine.bootstrap.Bootstrap

    - arg[ 1]: ./bootstrap

    - arg[ 2]: ID0373068

    **********************************************************************

    [Thr 1078200640] JHVM_RegisterNatives: registering methods in com.sap.bc.krn.perf.PerfTimes

    [Thr 1109850432] Mon Apr 8 17:49:05 2013

    [Thr 1109850432] JLaunchIExitJava: exit hook is called (rc = 66)

    [Thr 1109850432] **********************************************************************

    *** ERROR = The Java VM terminated with a non-zero exit code.

    *** Please see SAP Note 943602 , section 'J2EE Engine exit codes'

    *** for additional information and trouble shooting.

    **********************************************************************

    [Thr 1109850432] SigISetIgnoreAction : SIG_IGN for signal 17

    [Thr 1109850432] JLaunchCloseProgram: good bye (exitcode = 66)

    Please help me to solve this.

    Regards,

    Pradeep

    DB:2.49:Java System Is Down x9


    Hi Experts,

    Thanks a lot for the help!

    The issue was the Database User IDs got expired.

    We reset the password and restart the server.the Java instance came up!

    Once again thanks!

    Regards,

    Pradeep

  • RELEVANCY SCORE 2.49

    DB:2.49:Jcontrol.Exe J2ee Server Stopped s7



    hi all,

    i am having the problem with j2ee server. whenever i am trying to start the J2EE server then from the following two processes.

    Jcontrol.exe J2EE server

    igswd.exe IGS watchdog

    then following thing happen

    Jcontrol.exe J2EE server stopped

    when i see the developer trace for Jcontrol.exe then it shows that

    " ERROR Invalid return code for process [bootstrap] [exitcode = 66] [jstartxx.c 1452]"

    "JcontrolExecuteBootstrap:Error executing bootstrap node [rc 66]"

    can anybody tell me what is the reson for this?

    and if anybody knows the solution for it then please tell me the solution step by step.

    regards,

    Hardik Patel.

    DB:2.49:Jcontrol.Exe J2ee Server Stopped s7


    check your database is up and running.

    The note may help: https://service.sap.com/sap/support/notes/997510

  • RELEVANCY SCORE 2.49

    DB:2.49:Re: Olapi Bootstrap Failer 38


    I would recommend upgrading your database as you may be missing some packages. Please apply the following patches to your database

    Patch 3095277
    Oracle Database Family: Patchset
    9.2.0.4 PATCH SET FOR ORACLE DATABASE SERVER

    Patch 3084634
    9.2.0.4 ONE-OFF PATCH AND 9.2.0.4.1 SERVER PATCH FOR OLAP

    Please follow the instructions carefully as each patch contains a number of steps that must be run in the correct order.

    Once you have successfully installed that patches copy the new JDBC jar files from ORACLE_HOME/jdbc/lib to JDEV_HOME/jdbc/lib.

    Business Intelligence Beans Product Management Team
    Oracle Corporation

    DB:2.49:Re: Olapi Bootstrap Failer 38

    I would suggest you log a TAR with Oracle Support or try posting on the database and/or OLAP forums as this is not really an area we can manage from within the BI Beans Forum.

    I have been through the same process myself with Redhat AS2.1 and applied all the patches and everything worked fine. If the linking is failing it is probably due to conflicts over library versions and the Installer log file may provide more information on this. Also check the patch requirements for required compiler versions.

    Business Intelligence Beans Product Management Team
    Oracle Corporation

  • RELEVANCY SCORE 2.48

    DB:2.48:Print Cartridge Alignment 9d



    I have HP C5280 ALL-IN-ONE

    Printer Scanner Copier

    FAILER!

    Print Cartridge Alignment failed

    see the product documentation for details??

    DB:2.48:Print Cartridge Alignment 9d


    Hey ryder,

    I'd recommend taking a look at this article for a resolution:

    http://h10025.www1.hp.com/ewfrf/wc/document?docname=c01611456tmp_task=solveCategorycc=usdlc=enla...

    Hope this helps!

  • RELEVANCY SCORE 2.48

    DB:2.48:Email Notification Of Cluster Failer xf


    Is there a way to receive email notification when a cluster node fails in server 2008?

    DB:2.48:Email Notification Of Cluster Failer xf

    You might want to look at this http://support.microsoft.com/kb/260527Or, just set up a trigger in the Windows event log to send an email whenever a certain event is logged.David A. Bermingham,
    Director of Product Management,
    SteelEye Technology

  • RELEVANCY SCORE 2.48

    DB:2.48:Relaunching Bootstrap With Additional Configuration Information dz



    One thing we discussed a week ago during the domain model work around JBossAS was the need to be able to read jvm settings from the domain model, and to be able to restart the jvm with the bootstrap configuration. I just checked in a couple of simple tests for launching a jvm from within a java process using the ProcessCreator. Currently the test is org.jboss.test.bootstrap.jvm.launch.LaunchTestCase in the jboss-bootstrap-api project.

    I want to discuss where the functionality of restarting the bootstrap jvm should live and what the api needs to look like. Some requirements that were discussed as configuration that should be in the domain model includes:

    - jvm parameters such as memory, heap, debug, etc. settings

    - jvm version/location

    - System properties

    - Environment properties

    - endorsed library location

    - native library locations/properties

    - run directory

    I'm thinking that the test belongs in jboss-bootstrap-impl-base, and that we need a new BootstrapFactory api for dealing with launching a jvm in a default state, and then relaunching it with the proper bootstrap configuration before moving on to launching the Server. What are your thoughts?

    DB:2.48:Relaunching Bootstrap With Additional Configuration Information dz


    Right, we are all on the same page that neither embedded nor bootstrap has new profileservice/domain server dependencies. This was about allowing for configurations driven by those layers. At this point this thread is essentially dead until there are requirements driven by the domain server work.

  • RELEVANCY SCORE 2.48

    DB:2.48:Photosmart C7250 Error: 0xc19a0003 Ink System Failer 33



    Potosmart C7250 Error: 0xc19a0003 Ink System Failer, How can I fix it.

    DB:2.48:Photosmart C7250 Error: 0xc19a0003 Ink System Failer 33


    Hi @Ferny49,

    Welcome to the HP Forums!

    I noticed that you are getting the error : 0xc19a0003 Ink System Failure with your HP Photosmart c7250. I am happyto look into this for you!

    Please take a look through this guide, 'Problem with Printhead,' 'Printer Failure,' 'Ink System Failure,' or a '0x...' or a 'C2...' Error M....

    Hope this guide helps, andthank you for posting!

  • RELEVANCY SCORE 2.48

    DB:2.48:Failer In Installing Latest Update For Cs6 Photoshop pf



    Hi Im trying to update my cs6 photoshop for latest update but its not installing and giving me an error "Adobe Photoshop 13.0.6 Installation failed. Error Code: U44M1P7"

    DB:2.48:Failer In Installing Latest Update For Cs6 Photoshop pf


    http://helpx.adobe.com/creative-suite/kb/error-u44m1p7-installing-updates-ccm.html

  • RELEVANCY SCORE 2.48

    DB:2.48:Unable To Update Sql Server Sp3 Kb955706 1a


    I've tried to install this MS Update 3 times - SQL Server SP3 KB955706 - and I keep getting messages that the installation has failed. Please help. I think this has something to do with my ACT software which uses SQL Server. Unfortunately I'm not that computer savvy. The ACT software and SQL Server are operating fine without this SP3 Hotfix but I like to stay updated. Thank you. ----------------- Here's the LOG info: Microsoft SQL Server 2005 9.00.4035.00 ============================== OS Version      : Microsoft Windows XP Home Edition Service Pack 3 (Build 2600) Time            : Tue Mar 31 21:37:59 2009   Machine         : D56VDK21 Product         : Microsoft SQL Server Setup Support Files (English) Product Version : 9.00.4035.00 Install         : Successful Log File        : C:\Program Files\Microsoft SQL Server\90\Setup Bootstrap\LOG\Hotfix\SQL9Express_Hotfix_KB955706_SQLEXPR.EXE\Files\SQLSetup0002_D56VDK21_SQLSupport_1.log -------------------------------------------------------------------------------- Machine         : D56VDK21 Product         : Microsoft SQL Server Native Client Product Version : 9.00.4035.00 Install         : Successful Log File        : C:\Program Files\Microsoft SQL Server\90\Setup Bootstrap\LOG\Hotfix\SQL9Express_Hotfix_KB955706_SQLEXPR.EXE\Files\SQLSetup0002_D56VDK21_SQLNCLI_1.log -------------------------------------------------------------------------------- Machine         : D56VDK21 Product         : Microsoft SQL Server VSS Writer Product Version : 9.00.4035.00 Install         : Successful Log File        : C:\Program Files\Microsoft SQL Server\90\Setup Bootstrap\LOG\Hotfix\SQL9Express_Hotfix_KB955706_SQLEXPR.EXE\Files\SQLSetup0002_D56VDK21_SqlWriter_1.log -------------------------------------------------------------------------------- Machine         : D56VDK21 Product         : MSXML 6 Service Pack 2 (KB954459) Product Version : 6.20.1099.0 Install         : Failed Log File        : C:\Program Files\Microsoft SQL Server\90\Setup Bootstrap\LOG\Hotfix\SQL9Express_Hotfix_KB955706_SQLEXPR.EXE\Files\SQLSetup0002_D56VDK21_MSXML6_1.log Error Number    : 1603 --------------------------------------------------------------------------------  SQL Server Setup failed. For more information, review the Setup log file in %ProgramFiles%\Microsoft SQL Server\90\Setup Bootstrap\LOG\Summary.txt. Time            : Tue Mar 31 21:39:18 2009 List of log files:     C:\Program Files\Microsoft SQL Server\90\Setup Bootstrap\LOG\Hotfix\SQL9Express_Hotfix_KB955706_SQLEXPR.EXE\Files\SQLSetup0002_D56VDK21_Core(Local).log     C:\Program Files\Microsoft SQL Server\90\Setup Bootstrap\LOG\Hotfix\SQL9Express_Hotfix_KB955706_SQLEXPR.EXE\Files\SQLSetup0002_D56VDK21_SQLSupport_1.log     C:\Program Files\Microsoft SQL Server\90\Setup Bootstrap\LOG\Hotfix\SQL9Express_Hotfix_KB955706_SQLEXPR.EXE\Files\SQLSetup0002_D56VDK21_SQLNCLI_1.log     C:\Program Files\Microsoft SQL Server\90\Setup Bootstrap\LOG\Hotfix\SQL9Express_Hotfix_KB955706_SQLEXPR.EXE\Files\SQLSetup0002_D56VDK21_SqlWriter_1.log     C:\Program Files\Microsoft SQL Server\90\Setup Bootstrap\LOG\Hotfix\SQL9Express_Hotfix_KB955706_SQLEXPR.EXE\Files\SQLSetup0002_D56VDK21_MSXML6_1.log     C:\Program Files\Microsoft SQL Server\90\Setup Bootstrap\LOG\Hotfix\SQL9Express_Hotfix_KB955706_SQLEXPR.EXE\Files\SQLSetup0002_D56VDK21_Datastore.xml     C:\Program Files\Microsoft SQL Server\90\Setup Bootstrap\LOG\Hotfix\SQL9Express_Hotfix_KB955706_SQLEXPR.EXE\Files\SQLSetup0002_D56VDK21_.NET Framework 2.0.log     C:\Program Files\Microsoft SQL Server\90\Setup Bootstrap\LOG\Hotfix\SQL9Express_Hotfix_KB955706_SQLEXPR.EXE\Files\SQLSetup0002_D56VDK21_Support.log     C:\Program Files\Microsoft SQL Server\90\Setup Bootstrap\LOG\Hotfix\SQL9Express_Hotfix_KB955706_SQLEXPR.EXE\Files\SQLSetup0002_D56VDK21_Core.log     C:\Program Files\Microsoft SQL Server\90\Setup Bootstrap\LOG\Hotfix\SQL9Express_Hotfix_KB955706_SQLEXPR.EXE\Summary.txt     C:\Program Files\Microsoft SQL Server\90\Setup Bootstrap\LOG\Hotfix\SQL9Express_Hotfix_KB955706_SQLEXPR.EXE\Files\SQLSetup0002_D56VDK21_SCC.log ---------------------------- Time: 03/31/2009 21:39:29.828 KB Number: KB955706 Machine: D56VDK21 OS Version: Microsoft Windows XP Home Edition Service Pack 3 (Build 2600) Package Language: 1033 (ENU) Package Platform: x86 Package SP Level: 3 Package Version: 4035 Command-line parameters specified:      /quiet      /allinstances Cluster Installation: No ********************************************************************************** Prerequisites Check Status SQLSupport: Passed ********************************************************************************** Products Detected                         Language  Level  Patch Level       Platform  Edition Express Database Services (ACT7)          ENU       SP2    2005.090.3042.00  x86       EXPRESS ********************************************************************************** Products Disqualified Reason Product                                   Reason ********************************************************************************** Processes Locking Files Process Name          Feature               Type          User Name                  PID ********************************************************************************** Product Installation Status Product                   : Express Database Services (ACT7) Product Version (Previous): 3042 Product Version (Final)   : Status                    : Failure Log File                  : C:\Program Files\Microsoft SQL Server\90\Setup Bootstrap\LOG\Hotfix\SQL9Express_Hotfix_KB955706_SQLEXPR.EXE SQL Express Features      : SQL_Data_Files,SQL_Engine,SQL_SharedTools Error Number              : 11055 Error Description         : Unable to install Windows Installer MSI file ---------------------------------------------------------------------------------- ********************************************************************************** Summary      Unable to install Windows Installer MSI file      Exit Code Returned: 11055

    DB:2.48:Unable To Update Sql Server Sp3 Kb955706 1a

    Hi There,It would be great if you could also post the file C:\Program Files\Microsoft SQL Server\90\Setup Bootstrap\LOG\Hotfix\SQL9Express_Hotfix_KB955706_SQLEXPR.EXE\Files\SQLSetup0002_D56VDK21_MSXML6_1.log . This would help me to determine what casued the failure.ThanksGursin

  • RELEVANCY SCORE 2.48

    DB:2.48:Jdeveloper 11g R3 - Error In New Bpel Process sd


    Hi Guys,

    Been hanging out to try the BPEL stuff in Tech Preview 3. I created a new SOA Application, then New BPEL Process.....and got the error below.

    Any ideas?

    Cheers,

    Dave

    Dec 24, 2007 10:24:09 AM oracle.ide.wizard.WizardManager getWizard
    SEVERE: Failed to create wizard oracle.tip.tools.ide.pm.sca.wizard.PMSCAProjectCreationWizard
    oracle.classloader.util.AnnotatedClassNotFoundException:

    Missing class: oracle.tip.tools.ide.pm.sca.wizard.PMSCAProjectCreationWizard

    Dependent class: oracle.ide.wizard.WizardManager
    Loader: main:11.0
    Code-Source: /C:/JDeveloper11gR3/ide/extensions/oracle.ide.jar
    Configuration: system property PCLMain.createExtensionManagerLoader()

    This load was initiated at main:11.0 using the Class.forName() method.

    The missing class is not available from any code-source or loader in the system.
    at oracle.classloader.PolicyClassLoader.handleClassNotFound (PolicyClassLoader.java:2124) [C:/JDeveloper11gR3/j2ee/home/lib/pcl.jar (from system property java.class.path), by sun.misc.Launcher$AppClassLoader@9627532]
    at oracle.classloader.PolicyClassLoader.internalLoadClass (PolicyClassLoader.java:1699) [C:/JDeveloper11gR3/j2ee/home/lib/pcl.jar (from system property java.class.path), by sun.misc.Launcher$AppClassLoader@9627532]
    at oracle.classloader.PolicyClassLoader.access$000 (PolicyClassLoader.java:142) [C:/JDeveloper11gR3/j2ee/home/lib/pcl.jar (from system property java.class.path), by sun.misc.Launcher$AppClassLoader@9627532]
    at oracle.classloader.PolicyClassLoader$LoadClassAction.run (PolicyClassLoader.java:325) [C:/JDeveloper11gR3/j2ee/home/lib/pcl.jar (from system property java.class.path), by sun.misc.Launcher$AppClassLoader@9627532]
    at java.security.AccessController.doPrivileged (Native method) [unknown, by unknown]
    at oracle.classloader.PolicyClassLoader.loadClass (PolicyClassLoader.java:1658) [C:/JDeveloper11gR3/j2ee/home/lib/pcl.jar (from system property java.class.path), by sun.misc.Launcher$AppClassLoader@9627532]
    at oracle.classloader.PolicyClassLoader.loadClass (PolicyClassLoader.java:1640) [C:/JDeveloper11gR3/j2ee/home/lib/pcl.jar (from system property java.class.path), by sun.misc.Launcher$AppClassLoader@9627532]
    at java.lang.ClassLoader.loadClassInternal (ClassLoader.java:319) [jre bootstrap, by jre.bootstrap:1.5.0_11]
    at java.lang.Class.forName0 (Native method) [unknown, by unknown]
    at java.lang.Class.forName (Class.java:164) [jre bootstrap, by jre.bootstrap:1.5.0_11]
    at oracle.ide.wizard.WizardManager.getWizard (WizardManager.java:171) [C:/JDeveloper11gR3/ide/extensions/oracle.ide.jar (from system property PCLMain.createExtensionManagerLoader()), by main:11.0]
    at oracle.ideimpl.appoverview.AppOverviewEditor.handleEvent (AppOverviewEditor.java:2323) [C:/JDeveloper11gR3/jdev/extensions/oracle.ide.appoverview.jar (from system property C:\JDeveloper11gR3\jdev\extensions\oracle.ide.appoverview.jar), by main:11.0]
    at oracle.ide.controller.IdeAction.performAction (IdeAction.java:508) [C:/JDeveloper11gR3/ide/extensions/oracle.ide.jar (from system property PCLMain.createExtensionManagerLoader()), by main:11.0]
    at oracle.ide.controller.IdeAction.actionPerformedImpl (IdeAction.java:784) [C:/JDeveloper11gR3/ide/extensions/oracle.ide.jar (from system property PCLMain.createExtensionManagerLoader()), by main:11.0]
    at oracle.ide.controller.IdeAction.actionPerformed (IdeAction.java:481) [C:/JDeveloper11gR3/ide/extensions/oracle.ide.jar (from system property PCLMain.createExtensionManagerLoader()), by main:11.0]
    at javax.swing.AbstractButton.fireActionPerformed (AbstractButton.java:1849) [jre bootstrap, by jre.bootstrap:1.5.0_11]
    at javax.swing.AbstractButton$Handler.actionPerformed (AbstractButton.java:2169) [jre bootstrap, by jre.bootstrap:1.5.0_11]
    at javax.swing.DefaultButtonModel.fireActionPerformed (DefaultButtonModel.java:420) [jre bootstrap, by jre.bootstrap:1.5.0_11]
    at javax.swing.DefaultButtonModel.setPressed (DefaultButtonModel.java:258) [jre bootstrap, by jre.bootstrap:1.5.0_11]
    at javax.swing.AbstractButton.doClick (AbstractButton.java:302) [jre bootstrap, by jre.bootstrap:1.5.0_11]
    at javax.swing.plaf.basic.BasicMenuItemUI.doClick (BasicMenuItemUI.java:1000) [jre bootstrap, by jre.bootstrap:1.5.0_11]
    at javax.swing.plaf.basic.BasicMenuItemUI$Handler.mouseReleased (BasicMenuItemUI.java:1041) [jre bootstrap, by jre.bootstrap:1.5.0_11]
    at java.awt.Component.processMouseEvent (Component.java:5501) [jre bootstrap, by jre.bootstrap:1.5.0_11]
    at javax.swing.JComponent.processMouseEvent (JComponent.java:3135) [jre bootstrap, by jre.bootstrap:1.5.0_11]
    at java.awt.Component.processEvent (Component.java:5266) [jre bootstrap, by jre.bootstrap:1.5.0_11]
    at java.awt.Container.processEvent (Container.java:1966) [jre bootstrap, by jre.bootstrap:1.5.0_11]
    at java.awt.Component.dispatchEventImpl (Component.java:3968) [jre bootstrap, by jre.bootstrap:1.5.0_11]
    at java.awt.Container.dispatchEventImpl (Container.java:2024) [jre bootstrap, by jre.bootstrap:1.5.0_11]
    at java.awt.Component.dispatchEvent (Component.java:3803) [jre bootstrap, by jre.bootstrap:1.5.0_11]
    at java.awt.LightweightDispatcher.retargetMouseEvent (Container.java:4212) [jre bootstrap, by jre.bootstrap:1.5.0_11]
    at java.awt.LightweightDispatcher.processMouseEvent (Container.java:3892) [jre bootstrap, by jre.bootstrap:1.5.0_11]
    at java.awt.LightweightDispatcher.dispatchEvent (Container.java:3822) [jre bootstrap, by jre.bootstrap:1.5.0_11]
    at java.awt.Container.dispatchEventImpl (Container.java:2010) [jre bootstrap, by jre.bootstrap:1.5.0_11]
    at java.awt.Window.dispatchEventImpl (Window.java:1778) [jre bootstrap, by jre.bootstrap:1.5.0_11]
    at java.awt.Component.dispatchEvent (Component.java:3803) [jre bootstrap, by jre.bootstrap:1.5.0_11]
    at java.awt.EventQueue.dispatchEvent (EventQueue.java:463) [jre bootstrap, by jre.bootstrap:1.5.0_11]
    at java.awt.EventDispatchThread.pumpOneEventForHierarchy (EventDispatchThread.java:242) [jre bootstrap, by jre.bootstrap:1.5.0_11]
    at java.awt.EventDispatchThread.pumpEventsForHierarchy (EventDispatchThread.java:163) [jre bootstrap, by jre.bootstrap:1.5.0_11]
    at java.awt.EventDispatchThread.pumpEvents (EventDispatchThread.java:157) [jre bootstrap, by jre.bootstrap:1.5.0_11]
    at java.awt.EventDispatchThread.pumpEvents (EventDispatchThread.java:149) [jre bootstrap, by jre.bootstrap:1.5.0_11]
    at java.awt.EventDispatchThread.run (EventDispatchThread.java:110) [jre bootstrap, by jre.bootstrap:1.5.0_11]

    DB:2.48:Jdeveloper 11g R3 - Error In New Bpel Process sd

    Hi Guys,

    Been hanging out to try the BPEL stuff in Tech Preview 3. I created a new SOA Application, then New BPEL Process.....and got the error below.

    Any ideas?

    Cheers,

    Dave

    Dec 24, 2007 10:24:09 AM oracle.ide.wizard.WizardManager getWizard
    SEVERE: Failed to create wizard oracle.tip.tools.ide.pm.sca.wizard.PMSCAProjectCreationWizard
    oracle.classloader.util.AnnotatedClassNotFoundException:

    Missing class: oracle.tip.tools.ide.pm.sca.wizard.PMSCAProjectCreationWizard

    Dependent class: oracle.ide.wizard.WizardManager
    Loader: main:11.0
    Code-Source: /C:/JDeveloper11gR3/ide/extensions/oracle.ide.jar
    Configuration: system property PCLMain.createExtensionManagerLoader()

    This load was initiated at main:11.0 using the Class.forName() method.

    The missing class is not available from any code-source or loader in the system.
    at oracle.classloader.PolicyClassLoader.handleClassNotFound (PolicyClassLoader.java:2124) [C:/JDeveloper11gR3/j2ee/home/lib/pcl.jar (from system property java.class.path), by sun.misc.Launcher$AppClassLoader@9627532]
    at oracle.classloader.PolicyClassLoader.internalLoadClass (PolicyClassLoader.java:1699) [C:/JDeveloper11gR3/j2ee/home/lib/pcl.jar (from system property java.class.path), by sun.misc.Launcher$AppClassLoader@9627532]
    at oracle.classloader.PolicyClassLoader.access$000 (PolicyClassLoader.java:142) [C:/JDeveloper11gR3/j2ee/home/lib/pcl.jar (from system property java.class.path), by sun.misc.Launcher$AppClassLoader@9627532]
    at oracle.classloader.PolicyClassLoader$LoadClassAction.run (PolicyClassLoader.java:325) [C:/JDeveloper11gR3/j2ee/home/lib/pcl.jar (from system property java.class.path), by sun.misc.Launcher$AppClassLoader@9627532]
    at java.security.AccessController.doPrivileged (Native method) [unknown, by unknown]
    at oracle.classloader.PolicyClassLoader.loadClass (PolicyClassLoader.java:1658) [C:/JDeveloper11gR3/j2ee/home/lib/pcl.jar (from system property java.class.path), by sun.misc.Launcher$AppClassLoader@9627532]
    at oracle.classloader.PolicyClassLoader.loadClass (PolicyClassLoader.java:1640) [C:/JDeveloper11gR3/j2ee/home/lib/pcl.jar (from system property java.class.path), by sun.misc.Launcher$AppClassLoader@9627532]
    at java.lang.ClassLoader.loadClassInternal (ClassLoader.java:319) [jre bootstrap, by jre.bootstrap:1.5.0_11]
    at java.lang.Class.forName0 (Native method) [unknown, by unknown]
    at java.lang.Class.forName (Class.java:164) [jre bootstrap, by jre.bootstrap:1.5.0_11]
    at oracle.ide.wizard.WizardManager.getWizard (WizardManager.java:171) [C:/JDeveloper11gR3/ide/extensions/oracle.ide.jar (from system property PCLMain.createExtensionManagerLoader()), by main:11.0]
    at oracle.ideimpl.appoverview.AppOverviewEditor.handleEvent (AppOverviewEditor.java:2323) [C:/JDeveloper11gR3/jdev/extensions/oracle.ide.appoverview.jar (from system property C:\JDeveloper11gR3\jdev\extensions\oracle.ide.appoverview.jar), by main:11.0]
    at oracle.ide.controller.IdeAction.performAction (IdeAction.java:508) [C:/JDeveloper11gR3/ide/extensions/oracle.ide.jar (from system property PCLMain.createExtensionManagerLoader()), by main:11.0]
    at oracle.ide.controller.IdeAction.actionPerformedImpl (IdeAction.java:784) [C:/JDeveloper11gR3/ide/extensions/oracle.ide.jar (from system property PCLMain.createExtensionManagerLoader()), by main:11.0]
    at oracle.ide.controller.IdeAction.actionPerformed (IdeAction.java:481) [C:/JDeveloper11gR3/ide/extensions/oracle.ide.jar (from system property PCLMain.createExtensionManagerLoader()), by main:11.0]
    at javax.swing.AbstractButton.fireActionPerformed (AbstractButton.java:1849) [jre bootstrap, by jre.bootstrap:1.5.0_11]
    at javax.swing.AbstractButton$Handler.actionPerformed (AbstractButton.java:2169) [jre bootstrap, by jre.bootstrap:1.5.0_11]
    at javax.swing.DefaultButtonModel.fireActionPerformed (DefaultButtonModel.java:420) [jre bootstrap, by jre.bootstrap:1.5.0_11]
    at javax.swing.DefaultButtonModel.setPressed (DefaultButtonModel.java:258) [jre bootstrap, by jre.bootstrap:1.5.0_11]
    at javax.swing.AbstractButton.doClick (AbstractButton.java:302) [jre bootstrap, by jre.bootstrap:1.5.0_11]
    at javax.swing.plaf.basic.BasicMenuItemUI.doClick (BasicMenuItemUI.java:1000) [jre bootstrap, by jre.bootstrap:1.5.0_11]
    at javax.swing.plaf.basic.BasicMenuItemUI$Handler.mouseReleased (BasicMenuItemUI.java:1041) [jre bootstrap, by jre.bootstrap:1.5.0_11]
    at java.awt.Component.processMouseEvent (Component.java:5501) [jre bootstrap, by jre.bootstrap:1.5.0_11]
    at javax.swing.JComponent.processMouseEvent (JComponent.java:3135) [jre bootstrap, by jre.bootstrap:1.5.0_11]
    at java.awt.Component.processEvent (Component.java:5266) [jre bootstrap, by jre.bootstrap:1.5.0_11]
    at java.awt.Container.processEvent (Container.java:1966) [jre bootstrap, by jre.bootstrap:1.5.0_11]
    at java.awt.Component.dispatchEventImpl (Component.java:3968) [jre bootstrap, by jre.bootstrap:1.5.0_11]
    at java.awt.Container.dispatchEventImpl (Container.java:2024) [jre bootstrap, by jre.bootstrap:1.5.0_11]
    at java.awt.Component.dispatchEvent (Component.java:3803) [jre bootstrap, by jre.bootstrap:1.5.0_11]
    at java.awt.LightweightDispatcher.retargetMouseEvent (Container.java:4212) [jre bootstrap, by jre.bootstrap:1.5.0_11]
    at java.awt.LightweightDispatcher.processMouseEvent (Container.java:3892) [jre bootstrap, by jre.bootstrap:1.5.0_11]
    at java.awt.LightweightDispatcher.dispatchEvent (Container.java:3822) [jre bootstrap, by jre.bootstrap:1.5.0_11]
    at java.awt.Container.dispatchEventImpl (Container.java:2010) [jre bootstrap, by jre.bootstrap:1.5.0_11]
    at java.awt.Window.dispatchEventImpl (Window.java:1778) [jre bootstrap, by jre.bootstrap:1.5.0_11]
    at java.awt.Component.dispatchEvent (Component.java:3803) [jre bootstrap, by jre.bootstrap:1.5.0_11]
    at java.awt.EventQueue.dispatchEvent (EventQueue.java:463) [jre bootstrap, by jre.bootstrap:1.5.0_11]
    at java.awt.EventDispatchThread.pumpOneEventForHierarchy (EventDispatchThread.java:242) [jre bootstrap, by jre.bootstrap:1.5.0_11]
    at java.awt.EventDispatchThread.pumpEventsForHierarchy (EventDispatchThread.java:163) [jre bootstrap, by jre.bootstrap:1.5.0_11]
    at java.awt.EventDispatchThread.pumpEvents (EventDispatchThread.java:157) [jre bootstrap, by jre.bootstrap:1.5.0_11]
    at java.awt.EventDispatchThread.pumpEvents (EventDispatchThread.java:149) [jre bootstrap, by jre.bootstrap:1.5.0_11]
    at java.awt.EventDispatchThread.run (EventDispatchThread.java:110) [jre bootstrap, by jre.bootstrap:1.5.0_11]

  • RELEVANCY SCORE 2.48

    DB:2.48:Hard Drive Failer Windows Cant Fix 71


    since need to install new hard drive will I be able to put win.7 back on machine

    DB:2.48:Hard Drive Failer Windows Cant Fix 71

    Hi,
    ·Are you changing the hard drive only or trying to install the windows 7 on a new machine?

    If you are only change the drive of the machine then, there is no problem installing as well as activating the windows 7 copy. But you should activate the copy via phone support.

    If you are trying to install second copy of windows 7 on a different machine when already the first one is active then you can install Windows 7 but will not be able to activate it.

    In simple words, you can have one active Windows 7 copy with the product key on one machine at a time. To install windows 7 and activate on another machine you should get a new product key.

    Note:You can use the same disk to install windows 7 on different computers, but when you activate Windows 7, only one product key is valid for one installation.

    For further assistance check the article mentioned below.
    Install, Upgrade and activate
    http://windows.microsoft.com/en-us/windows7/help/install-upgrade-activate
    Activating Windows 7: frequently asked questions
    http://windows.microsoft.com/en-US/windows7/Activating-Windows-7-frequently-asked-questions

    Thank you and Regards.
    Thahaseena M
    Microsoft Answers Support Engineer.
    Visit our Microsoft Answers Feedback Forum and let us know what you think.

  • RELEVANCY SCORE 2.48

    DB:2.48:Pmi_Proxy: Command Not Found a9



    Hello I am very new to this, I installed the MPI fortran and it was working properly but all of a sudden, i am now getting the following errors. can anyone please help

    thank you

    : mpirun -np 30 ./a.out

    /product/Fortran_MPI/intel64/bin/pmi_proxy: Command not found.

    Ctrl-C caught... cleaning up processes

    [press Ctrl-C again to force abort]

    [mpiexec@l1aebshpc1.bank-banque-canada.ca] HYDT_bscu_wait_for_completion (./tools/bootstrap/utils/bscu_wait.c:101): one of the processes terminated badly; aborting

    [mpiexec@l1aebshpc1.bank-banque-canada.ca] HYDT_bsci_wait_for_completion (./tools/bootstrap/src/bsci_wait.c:18): bootstrap device returned error waiting for completion

    [mpiexec@l1aebshpc1.bank-banque-canada.ca] HYD_pmci_wait_for_completion (./pm/pmiserv/pmiserv_pmci.c:521): bootstrap server returned error waiting for completion

    [mpiexec@l1aebshpc1.bank-banque-canada.ca] main (./ui/mpich/mpiexec.c:548): process manager error waiting for completion

    DB:2.48:Pmi_Proxy: Command Not Found a9


    Hi Gergana,

    thank you for your help. Unfortunately, adding to the PATH shell variable the location of mpirun did not help. And anyway, it was already in

    the PATH, since mpirun was installed in /usr/local/bin.

    It seems as open mpi compiled with Intel compiler is still looking for the file pmi_proxy.

    As I mentioned before, it was also looking for mpivars.sh but then I added the following

    mpivars.sh to /opt/intel/composer_xe_2013.0.079/mpirt/bin/intel64/:

    #!/bin/bash

    if [ -z "`echo $PATH | grep /usr/local/bin`" ]; then

    export PATH=/usr/local/bin:$PATH

    fi

    if [ -z "`echo $LD_LIBRARY_PATH | grep /usr/local/lib`" ]; then

    if [ -n "$LD_LIBRARY_PATH" ]; then

    export LD_LIBRARY_PATH=/usr/local/lib:$LD_LIBRARY_PATH

    else

    export LD_LIBRARY_PATH=/usr/local/lib

    fi

    fi

    I am also attaching the file config.log that was generated before compiling open mpi.

  • RELEVANCY SCORE 2.48

    DB:2.48:Error When Updating Adobe Indesign Cc 7s



    Updated failer

    Errors encountered during installation (U44M1P7).

    All other CC apps update successfully.

    DB:2.48:Error When Updating Adobe Indesign Cc 7s


    Hi CCD Designer,

    Please refer the knowledge base article: http://helpx.adobe.com/creative-suite/kb/troubleshoot-install-logs-cs5-cs5.html and attach the log file to review.

    Regards,

    Romit Sinha

  • RELEVANCY SCORE 2.47

    DB:2.47:Outlook 365 Startup Failer zk


    Cannot start Microsoft Outlook.
    Cannot open the Outlook window. The set of folders cannot be opened.
    The operation failed.

    DB:2.47:Outlook 365 Startup Failer zk

    http://helpdeskgeek.com/office-tips/fix-cannot-start-microsoft-office-outlook-error/Anil Kumar (MCITP)

  • RELEVANCY SCORE 2.47

    DB:2.47:Having Problem Installing Windows Xp Service Pack 2 x3


    I own a xps gen 2, service tag 4Q84Z71. After I reboot to install it, it shuts off during the install process. It shuts off about five minutes after I choose which language support.
    I ran the diagnastics and It came up with start dst short test failer. Also on the the read test a couple of blocks were unreadable. The verify test had a couple of blocks it couldn't read either. But other than that everything passed includding the seek test and S.M.A.R.T.
    Is my hard drive still usable or do I have to buy a new one? Is there a way to fix my hard drive because I really don't have the money to buy a new one? And is that the reason I can't install windows?

    DB:2.47:Having Problem Installing Windows Xp Service Pack 2 x3

    Can you please give me the link to the Dell XPS specialized support.

  • RELEVANCY SCORE 2.47

    DB:2.47:Failer: -1073548 784 z1


    Failer-1073548784) Fehler beim Ausführen der Abfrage 'BACKUP LOG [master] TO  DISK = N'D:\\Backup\\master\\master_backup_200809121142.trn' WITH NOFORMAT, NOINIT,  NAME = N'master_backup_20080912114259', SKIP, REWIND, NOUNLOAD,  STATS = 10': Why can I not backup transaktionlog from master Database?
    Is this a bug?
    Thank you.
    Pir Shafii
     
     
     

    DB:2.47:Failer: -1073548 784 z1

    Failer-1073548784) Fehler beim Ausführen der Abfrage 'BACKUP LOG [master] TO  DISK = N'D:\\Backup\\master\\master_backup_200809121142.trn' WITH NOFORMAT, NOINIT,  NAME = N'master_backup_20080912114259', SKIP, REWIND, NOUNLOAD,  STATS = 10': Why can I not backup transaktionlog from master Database?
    Is this a bug?
    Thank you.
    Pir Shafii
     
     
     

  • RELEVANCY SCORE 2.47

    DB:2.47:Jcontrol Problem 71



    Dear all,

    has anybody an idea why my jcontrol says good bye??

    hav a nice portalday...Wolfgang

    -

    Thr 924] Tue Dec 13 11:26:11 2005

    [Thr 924] *** ERROR = invalid return code of process [bootstrap] (exitcode=66) [jstartxx.c 1452]

    [Thr 924] JControlExecuteBootstrap: error executing bootstrap node [bootstrap] (rc=66)

    [Thr 924] JControlCloseProgram: started (exitcode = 66)

    [Thr 924] JControlCloseProgram: good bye... (exitcode=66)

    _________________________

    DB:2.47:Jcontrol Problem 71


    Thank you Phani, very helpful and solved.

    Wolfgang

  • RELEVANCY SCORE 2.47

    DB:2.47:My Errors Are. 3c


    Failer to generate user instance is the error.

    DB:2.47:My Errors Are. 3c

    Can you read through this article and see if it applies for your machine?
     
    http://blog.krisvandermast.com/FailedToGenerateAUserInstanceOfSQLServerDueToAFailureInStartingTheProcessForTheUserInstanceTheConnectionWillBeClosed.aspx
     
    Thanks,Sam Lester (MSFT)

  • RELEVANCY SCORE 2.46

    DB:2.46:Sql Server Express 2005 Fails To Install xj


    I am trying to install MS SQL Server Express but the installation always fails. I have copied the summary log below and can provide more details if you require. Web Developer and C# Express install OK.
    I have been trying to install this for around 2 weeks now with no luck ... I even had the PC formatted and rebuilt but the install still fails. If it installed and worked before, i cannot understand why it doesn't work now. The summary log is provided below:
    Microsoft SQL Server 2005 9.00.1399.06 ============================== OS Version      : Microsoft Windows XP Professional Service Pack 2 (Build 2600) Time            : Thu Jun 22 10:42:08 2006  GLKD2396800 : The current system does not meet recommended hardware requirements for this SQL Server release. For detailed hardware requirements, see the readme file or SQL Server Books Online.Machine         : GLKD2396800 Product         : Microsoft SQL Server Setup Support Files (English) Product Version : 9.00.1399.06 Install         : Successful Log File        : C:\Program Files\Microsoft SQL Server\90\Setup Bootstrap\LOG\Files\SQLSetup0001_GLKD2396800_SQLSupport_1.log -------------------------------------------------------------------------------- Machine         : GLKD2396800 Product         : Microsoft SQL Server Native Client Product Version : 9.00.1399.06 Install         : Successful Log File        : C:\Program Files\Microsoft SQL Server\90\Setup Bootstrap\LOG\Files\SQLSetup0001_GLKD2396800_SQLNCLI_1.log -------------------------------------------------------------------------------- Machine         : GLKD2396800 Product         : Microsoft SQL Server VSS Writer Product Version : 9.00.1399.06 Install         : Successful Log File        : C:\Program Files\Microsoft SQL Server\90\Setup Bootstrap\LOG\Files\SQLSetup0001_GLKD2396800_SqlWriter_1.log -------------------------------------------------------------------------------- Machine         : GLKD2396800 Product         : MSXML 6.0 Parser Product Version : 6.00.3883.8 Install         : Successful Log File        : C:\Program Files\Microsoft SQL Server\90\Setup Bootstrap\LOG\Files\SQLSetup0001_GLKD2396800_MSXML6_1.log -------------------------------------------------------------------------------- Machine         : GLKD2396800 Product         : Microsoft SQL Server Setup Support Files (English) Product Version : 9.00.1399.06 Install         : Successful Log File        : C:\Program Files\Microsoft SQL Server\90\Setup Bootstrap\LOG\Files\SQLSetup0001_GLKD2396800_SQLSupport_2.log -------------------------------------------------------------------------------- Machine         : GLKD2396800 Product         : Microsoft SQL Server Native Client Product Version : 9.00.1399.06 Install         : Successful Log File        : C:\Program Files\Microsoft SQL Server\90\Setup Bootstrap\LOG\Files\SQLSetup0001_GLKD2396800_SQLNCLI_2.log -------------------------------------------------------------------------------- Machine         : GLKD2396800 Product         : MSXML 6.0 Parser Product Version : 6.00.3883.8 Install         : Successful Log File        : C:\Program Files\Microsoft SQL Server\90\Setup Bootstrap\LOG\Files\SQLSetup0001_GLKD2396800_MSXML6_2.log -------------------------------------------------------------------------------- Machine         : GLKD2396800Product         : SQL Server Database ServicesError           : The SQL Server service failed to start. For more information, see the SQL Server Books Online topics, How to: View SQL Server 2005 Setup Log Files and Starting SQL Server Manually.--------------------------------------------------------------------------------Machine         : GLKD2396800Product         : SQL Server Database ServicesError           : The SQL Server service failed to start. For more information, see the SQL Server Books Online topics, How to: View SQL Server 2005 Setup Log Files and Starting SQL Server Manually.--------------------------------------------------------------------------------Machine         : GLKD2396800 Product         : Microsoft SQL Server 2005 Express Edition Product Version : 9.00.1399.06 Install         : Failed Log File        : C:\Program Files\Microsoft SQL Server\90\Setup Bootstrap\LOG\Files\SQLSetup0001_GLKD2396800_SQL.log Last Action     : InstallFinalize Error String    : The SQL Server service failed to start. For more information, see the SQL Server Books Online topics, How to: View SQL Server 2005 Setup Log Files and Starting SQL Server Manually.The error is  (1067) The process terminated unexpectedly. Error Number    : 29503 -------------------------------------------------------------------------------- Machine         : GLKD2396800 Product         : Microsoft SQL Server 2005 Tools Express Edition Product Version : 9.00.1399.06 Install         : Successful Log File        : C:\Program Files\Microsoft SQL Server\90\Setup Bootstrap\LOG\Files\SQLSetup0001_GLKD2396800_Tools.log --------------------------------------------------------------------------------
     SQL Server Setup failed. For more information, review the Setup log file in %ProgramFiles%\Microsoft SQL Server\90\Setup Bootstrap\LOG\Summary.txt.
    Time            : Thu Jun 22 10:46:19 2006
    List of log files: C:\Program Files\Microsoft SQL Server\90\Setup Bootstrap\LOG\Files\SQLSetup0001_GLKD2396800_Core(Local).log C:\Program Files\Microsoft SQL Server\90\Setup Bootstrap\LOG\Files\SQLSetup0001_GLKD2396800_SQLSupport_1.log C:\Program Files\Microsoft SQL Server\90\Setup Bootstrap\LOG\Files\SQLSetup0001_GLKD2396800_SQLNCLI_1.log C:\Program Files\Microsoft SQL Server\90\Setup Bootstrap\LOG\Files\SQLSetup0001_GLKD2396800_SqlWriter_1.log C:\Program Files\Microsoft SQL Server\90\Setup Bootstrap\LOG\Files\SQLSetup0001_GLKD2396800_MSXML6_1.log C:\Program Files\Microsoft SQL Server\90\Setup Bootstrap\LOG\Files\SQLSetup0001_GLKD2396800_SQLSupport_2.log C:\Program Files\Microsoft SQL Server\90\Setup Bootstrap\LOG\Files\SQLSetup0001_GLKD2396800_SQLNCLI_2.log C:\Program Files\Microsoft SQL Server\90\Setup Bootstrap\LOG\Files\SQLSetup0001_GLKD2396800_MSXML6_2.log C:\Program Files\Microsoft SQL Server\90\Setup Bootstrap\LOG\Files\SQLSetup0001_GLKD2396800_SQL.log C:\Program Files\Microsoft SQL Server\90\Setup Bootstrap\LOG\Files\SQLSetup0001_GLKD2396800_Tools.log C:\Program Files\Microsoft SQL Server\90\Setup Bootstrap\LOG\Files\SQLSetup0001_GLKD2396800_Datastore.xml C:\Program Files\Microsoft SQL Server\90\Setup Bootstrap\LOG\Files\SQLSetup0001_GLKD2396800_.NET Framework 2.0.log C:\Program Files\Microsoft SQL Server\90\Setup Bootstrap\LOG\Files\SQLSetup0001_GLKD2396800_SNAC.log C:\Program Files\Microsoft SQL Server\90\Setup Bootstrap\LOG\Files\SQLSetup0001_GLKD2396800_Core.log C:\Program Files\Microsoft SQL Server\90\Setup Bootstrap\LOG\Summary.txt C:\Program Files\Microsoft SQL Server\90\Setup Bootstrap\LOG\Files\SQLSetup0001_GLKD2396800_Support.log C:\Program Files\Microsoft SQL Server\90\Setup Bootstrap\LOG\Files\SQLSetup0001_GLKD2396800_SCC.log c:\Program Files\Microsoft SQL Server\MSSQL.1\MSSQL\LOG\ERRORLOG

    DB:2.46:Sql Server Express 2005 Fails To Install xj

    I have just had a very similar expreience on XP SP2:

    http://support.microsoft.com/kb/920114/

    If they know, for gods sake, why not fix it!!!

    Basically if you are installing on XP SP2, the Network Service doesn't have access rights on a super-secret hidden folder that you've never even heard of. Add the rights to the folder and blam, install works fine.

    This is SO not our problem, why do we have to deal with this stuff!!?

    Worth a look

    Ben

    Thanks a LOT BEN. You made my day. I was struggling for 2 weeks on this.
    I was struggling to find NetworkService folder.
    But after reading your message super-secret hidden folder,
    I went to Tools = Folder Options = View and deselected Hide Protected Operating Systems Files (Recommended)
    And finally the C:\Documents and Settings\NetworkService folder was revealed.Later I couldn't find C:\Documents and Settings\NetworkService\Application Data\Microsoft\Protect folder. But I simply addedNetwork Service in the security tab of C:\Documents and Settings\NetworkService folder and gave full permissions and it did the magic !

  • RELEVANCY SCORE 2.45

    DB:2.45:Portal Page Failure dz



    Dear Gurus,

    The portal page would not open.

    On checking the jcontrol log i find the following

    [Thr 1] JStartupICreateProcess: fork process (pid 6511)

    [Thr 1] Sun Aug 15 13:03:48 2010

    [Thr 1] *** ERROR = invalid return code of process [bootstrap] (exitcode = 66) [jstartxx_mt. 1642]

    [Thr 1] JControlExecuteBootstrap: error executing bootstrap node [bootstrap] (rc = 66)

    [Thr 1] JControlCloseProgram: started (exitcode = 66)

    [Thr 1] Sun Aug 15 13:03:49 2010

    [Thr 1] JControlCloseProgram: good bye... (exitcode = 66)

    Any help?

    BR,

    Tolu

    DB:2.45:Portal Page Failure dz


    The SAP installation had to be restarted.

    Thanx guys

  • RELEVANCY SCORE 2.45

    DB:2.45:After Server Move, Cannot Start Was Sneak Preview Instances p7



    Hi,

    So I moved our Windows 2003 server to a different subnet. The IP address changed, but the host name did not. After the move my 3 WAS sneak preview instances (SP9 install, upgraded to SP11) do not start. The error I get looks like this:

    [Thr 5672] Wed May 11 18:26:30 2005

    [Thr 5672] *** ERROR = invalid return code of process [bootstrap] (exitcode=66) [jstartxx.c 1452]

    [Thr 5672] JControlExecuteBootstrap: error executing bootstrap node [bootstrap] (rc=66)

    [Thr 5672] JControlCloseProgram: started (exitcode = 66)

    [Thr 5672] JControlCloseProgram: good bye... (exitcode=66)

    Any ideas?

    Thanks,

    Jake

    DB:2.45:After Server Move, Cannot Start Was Sneak Preview Instances p7


    Hi,

    thanks for the pointer.

    The problem was that there was an entry in the hosts file (C:\WINDOWS\system32\drivers\etc\hosts) which pointed to the old IP address. Once I changed that entry to the new IP address, I was able to ping and get back the correct IP from the command prompt on that host. Now the SAP instances are starting up correctly...

    Thanks for the help.

    Jake

  • RELEVANCY SCORE 2.45

    DB:2.45:Ps Elements 9 Installer Failing To Initialize On Mac Os mx



    I had a hard drive failer and am in the process of reinstalling everything. I put my PSE 9 disk in and choose install. A window pops up saying "Installer failed to initialize. Please download Adobe Support Advisor to detect the problem." I downloaded the support advisor and it says nothing is wrong. I tried to install the trial version and got the same message. WTH!!!

    Since PSE 10 is now out, I can't find anyplace to download even a trial version of 9 so I can at least put in my serial number and Adobe's website has NOTHING for PSE9. I don't want to pay another $80 when I have a disk for 9 already. Before my HD crash, PSE9 worked perfectly fine.

    I'm not a happy camper. I don't know what to do at this point.

    DB:2.45:Ps Elements 9 Installer Failing To Initialize On Mac Os mx


    Got it loaded. It was a permissions issue. For some reason my log-in as an admin wouldn't allow me to install the application. I saw on another thread that someone had the same issue and they created another login as an admin and loaded it that way. When I called Apple for another issue I was having I told them about this and what the possible solution was and they talked me through creating a new user as an admin. Once that was set up I put the disk back in and it loaded perfectly fine. WHEW!!! I'm a happy camper again. I haven't decided if I'm going to delete that user or not. Just in case I run into another issue down with road with any other applications.

    Thank you to the Adobe forum for the information I needed to get this resolved.

  • RELEVANCY SCORE 2.45

    DB:2.45:Filter While Moving Users From Ad To Oid kz


    Right now I'm using bootstap and mapping files to move users from AD to OID. I want to only transfer active users and not groups. Can we put in some filtering criterias to do that during the bootstrap process?

    DB:2.45:Filter While Moving Users From Ad To Oid kz

    Right now I'm using bootstap and mapping files to move users from AD to OID. I want to only transfer active users and not groups. Can we put in some filtering criterias to do that during the bootstrap process?

  • RELEVANCY SCORE 2.45

    DB:2.45:Alc-Ttn-104-002: Could Not Connect To Bootstrap Servlet, The Requested Url Was Not Found On The Serv 9j



    We are in the process of installing ES2. After the installation gets over the configuration starts correctly, but gets the error 'ALC-TTN-104-002: Could not connect to bootstrap servlet, the requested URL was not found on the server' during the database initialization. Does anyone have a clue as to what causes this and solutions?

    Thanks,

    Joby Joy

    DB:2.45:Alc-Ttn-104-002: Could Not Connect To Bootstrap Servlet, The Requested Url Was Not Found On The Serv 9j

    My suspicion is that ES2 installation process is not very robust. Even when it says it has successfully installed, it may not have done so. The log doesn't give any error, but still the application short cuts are not yet in. We have done the installation now 4 times. Doing now again on a clean system as this one had an ES1 earlier. Will keep you posted if we find a solution. But I am more or less convinced that the installation is not doing a comprehensive error trapping or proper logging.

  • RELEVANCY SCORE 2.44

    DB:2.44:Connection Failed, The Bootstrap Could Not Be Loaded.On Windows Mobile Visual Studio 2005 km


    Microsoft Visual Studio 2005 Version 8.0.50727.42  (RTM.050727-4200) Microsoft .NET Framework Version 2.0.50727 Installed Edition: Professional Microsoft Visual C++ 2005   When I click Attach to process... and selecting Transport: Smart Device Qualifier: Windows Mobile 6 Professional Device I get To Windows Mobile 6 Professional Device Connection failed, The bootstrap could not be loaded. I'm trying to connect to a 6.5 WinMo device with ActiveSync v4.5 Could someone share how to rid off this problem ? Any help is appreciated.

    DB:2.44:Connection Failed, The Bootstrap Could Not Be Loaded.On Windows Mobile Visual Studio 2005 km


    Hey all,

    I am trying to deploy an application on WEC7 device using Active sync 4.5 (USB). But I am getting this error, Bootstrap could not be loaded.

    I deleted 1.0 folder at following location.

    C:\Users\user name\AppData\Local\Microsoft\CoreCon\1.0

    And tried deploying again, still the same issue exists...

    Any idea????

    Regard,

    Seetharam

  • RELEVANCY SCORE 2.44

    DB:2.44:Failer Id Code s8



    i have a failer id code of qc2l63-5976ls-xd002k-60qro

    DB:2.44:Failer Id Code s8


    Hi,

    Is this HDD failed code ? This indicates a sad story: the HDD has failed and one option: replace it.

    Regards.

  • RELEVANCY SCORE 2.44

    DB:2.44:Large Scale Mpi Error: Hydt_Bscu_Wait_For_Completion j3



    I am running a job on a 4,000-node cluster with Infiniband. For small scale like 8 to 64 node, command mpirun works well; and for medium sclale like 256 to 512 node, mpiexec.hydra has to be used; but when it goes up to 1024 node, I got errors, see attached. My job script is like this:

    module load intel-compilers/12.1.0

    module load intelmpi/4.0.3.008

    #mpirun -np 64 -perhost 1 -hostfile $PBS_NODEFILE ./paraEllip3d input.txt

    mpiexec.hydra -np 1000 -perhost 1 -hostfile $PBS_NODEFILE ./paraEllip3d input.txt

    The errors from 1024 nodes are:

    [proxy:0:24@r7i6n3] HYDT_bscu_wait_for_completion (./tools/bootstrap/utils/bscu_wait.c:101): one of the processes terminated badly; aborting

    [proxy:0:24@r7i6n3] HYDT_bsci_wait_for_completion (./tools/bootstrap/src/bsci_wait.c:18): bootstrap device returned error waiting for completion

    [proxy:0:24@r7i6n3] HYD_pmci_wait_for_childs_completion (./pm/pmiserv/pmip_utils.c:959): bootstrap server returned error waiting for completion

    [proxy:0:24@r7i6n3] main (./pm/pmiserv/pmip.c:378): error waiting for event children completion

    [proxy:0:15@r3i6n0] HYDT_bscu_wait_for_completion (./tools/bootstrap/utils/bscu_wait.c:101): one of the processes terminated badly; aborting

    [proxy:0:15@r3i6n0] HYDT_bsci_wait_for_completion (./tools/bootstrap/src/bsci_wait.c:18): bootstrap device returned error waiting for completion

    [proxy:0:15@r3i6n0] HYD_pmci_wait_for_childs_completion (./pm/pmiserv/pmip_utils.c:959): bootstrap server returned error waiting for completion

    [proxy:0:15@r3i6n0] main (./pm/pmiserv/pmip.c:378): error waiting for event children completion

    [mpiexec@r3i3n10] connection to proxy terminated unexpectedly

    [proxy:0:27@r7i6n11] HYDT_bscu_wait_for_completion (./tools/bootstrap/utils/bscu_wait.c:101): one of the processes terminated badly; aborting

    [proxy:0:27@r7i6n11] HYDT_bsci_wait_for_completion (./tools/bootstrap/src/bsci_wait.c:18): bootstrap device returned error waiting for completion

    [proxy:0:27@r7i6n11] HYD_pmci_wait_for_childs_completion (./pm/pmiserv/pmip_utils.c:959): bootstrap server returned error waiting for completion

    [proxy:0:27@r7i6n11] main (./pm/pmiserv/pmip.c:378): error waiting for event children completion

    [mpiexec@r3i3n10] connection to proxy terminated unexpectedly

    [proxy:0:26@r7i6n10] HYDT_bscu_wait_for_completion (./tools/bootstrap/utils/bscu_wait.c:101): one of the processes terminated badly; aborting

    [proxy:0:26@r7i6n10] HYDT_bsci_wait_for_completion (./tools/bootstrap/src/bsci_wait.c:18): bootstrap device returned error waiting for completion

    [proxy:0:26@r7i6n10] HYD_pmci_wait_for_childs_completion (./pm/pmiserv/pmip_utils.c:959): bootstrap server returned error waiting for completion

    [proxy:0:26@r7i6n10] main (./pm/pmiserv/pmip.c:378): error waiting for event children completion

    [proxy:0:2@r3i4n0] HYDT_bscu_wait_for_completion (./tools/bootstrap/utils/bscu_wait.c:101): one of the processes terminated badly; aborting

    [proxy:0:2@r3i4n0] HYDT_bsci_wait_for_completion (./tools/bootstrap/src/bsci_wait.c:18): bootstrap device returned error waiting for completion

    [proxy:0:2@r3i4n0] HYD_pmci_wait_for_childs_completion (./pm/pmiserv/pmip_utils.c:959): bootstrap server returned error waiting for completion

    [proxy:0:2@r3i4n0] main (./pm/pmiserv/pmip.c:378): error waiting for event children completion

    [proxy:0:17@r4i1n5] HYDT_bscu_wait_for_completion (./tools/bootstrap/utils/bscu_wait.c:101): one of the processes terminated badly; aborting

    [proxy:0:17@r4i1n5] HYDT_bsci_wait_for_completion (./tools/bootstrap/src/bsci_wait.c:18): bootstrap device returned error waiting for completion

    [proxy:0:17@r4i1n5] HYD_pmci_wait_for_childs_completion (./pm/pmiserv/pmip_utils.c:959): bootstrap server returned error waiting for completion

    [proxy:0:17@r4i1n5] main (./pm/pmiserv/pmip.c:378): error waiting for event children completion

    [proxy:0:23@r7i6n1] HYDT_bscu_wait_for_completion (./tools/bootstrap/utils/bscu_wait.c:101): one of the processes terminated badly; aborting

    [proxy:0:23@r7i6n1] HYDT_bsci_wait_for_completion (./tools/bootstrap/src/bsci_wait.c:18): bootstrap device returned error waiting for completion

    [proxy:0:23@r7i6n1] HYD_pmci_wait_for_childs_completion (./pm/pmiserv/pmip_utils.c:959): bootstrap server returned error waiting for completion

    [proxy:0:23@r7i6n1] main (./pm/pmiserv/pmip.c:378): error waiting for event children completion

    [proxy:0:9@r3i4n17] HYDT_bscu_wait_for_completion (./tools/bootstrap/utils/bscu_wait.c:101): one of the processes terminated badly; aborting

    [proxy:0:9@r3i4n17] HYDT_bsci_wait_for_completion (./tools/bootstrap/src/bsci_wait.c:18): bootstrap device returned error waiting for completion

    [proxy:0:9@r3i4n17] HYD_pmci_wait_for_childs_completion (./pm/pmiserv/pmip_utils.c:959): bootstrap server returned error waiting for completion

    [proxy:0:9@r3i4n17] main (./pm/pmiserv/pmip.c:378): error waiting for event children completion

    [proxy:0:8@r3i4n16] HYDT_bscu_wait_for_completion (./tools/bootstrap/utils/bscu_wait.c:101): one of the processes terminated badly; aborting

    [proxy:0:8@r3i4n16] HYDT_bsci_wait_for_completion (./tools/bootstrap/src/bsci_wait.c:18): bootstrap device returned error waiting for completion

    [proxy:0:8@r3i4n16] HYD_pmci_wait_for_childs_completion (./pm/pmiserv/pmip_utils.c:959): bootstrap server returned error waiting for completion

    [proxy:0:8@r3i4n16] main (./pm/pmiserv/pmip.c:378): error waiting for event children completion

    [proxy:0:20@r7i0n12] HYDT_bscu_wait_for_completion (./tools/bootstrap/utils/bscu_wait.c:101): one of the processes terminated badly; aborting

    [proxy:0:20@r7i0n12] HYDT_bsci_wait_for_completion (./tools/bootstrap/src/bsci_wait.c:18): bootstrap device returned error waiting for completion

    [proxy:0:20@r7i0n12] HYD_pmci_wait_for_childs_completion (./pm/pmiserv/pmip_utils.c:959): bootstrap server returned error waiting for completion

    [proxy:0:20@r7i0n12] main (./pm/pmiserv/pmip.c:378): error waiting for event children completion

    [mpiexec@r3i3n10] connection to proxy terminated unexpectedly

    [proxy:0:30@r7i7n6] HYDT_bscu_wait_for_completion (./tools/bootstrap/utils/bscu_wait.c:101): one of the processes terminated badly; aborting

    [proxy:0:30@r7i7n6] HYDT_bsci_wait_for_completion (./tools/bootstrap/src/bsci_wait.c:18): bootstrap device returned error waiting for completion

    [proxy:0:30@r7i7n6] HYD_pmci_wait_for_childs_completion (./pm/pmiserv/pmip_utils.c:959): bootstrap server returned error waiting for completion

    [proxy:0:30@r7i7n6] main (./pm/pmiserv/pmip.c:378): error waiting for event children completion

    [mpiexec@r3i3n10] connection to proxy terminated unexpectedly

    [mpiexec@r3i3n10] connection to proxy terminated unexpectedly

    [proxy:0:10@r3i5n0] HYDT_bscu_wait_for_completion (./tools/bootstrap/utils/bscu_wait.c:101): one of the processes terminated badly; aborting

    [proxy:0:10@r3i5n0] HYDT_bsci_wait_for_completion (./tools/bootstrap/src/bsci_wait.c:18): bootstrap device returned error waiting for completion

    [proxy:0:10@r3i5n0] HYD_pmci_wait_for_childs_completion (./pm/pmiserv/pmip_utils.c:959): bootstrap server returned error waiting for completion

    [proxy:0:10@r3i5n0] main (./pm/pmiserv/pmip.c:378): error waiting for event children completion

    [mpiexec@r3i3n10] connection to proxy terminated unexpectedly

    [mpiexec@r3i3n10] connection to proxy terminated unexpectedly

    [mpiexec@r3i3n10] connection to proxy terminated unexpectedly

    [mpiexec@r3i3n10] connection to proxy terminated unexpectedly

    [mpiexec@r3i3n10] connection to proxy terminated unexpectedly

    [mpiexec@r3i3n10] connection to proxy terminated unexpectedly

    [mpiexec@r3i3n10] connection to proxy terminated unexpectedly

    [proxy:0:0@r3i3n10] HYDT_bscu_wait_for_completion (./tools/bootstrap/utils/bscu_wait.c:101): one of the processes terminated badly; aborting

    [proxy:0:0@r3i3n10] HYDT_bsci_wait_for_completion (./tools/bootstrap/src/bsci_wait.c:18): bootstrap device returned error waiting for completion

    [proxy:0:0@r3i3n10] HYD_pmci_wait_for_childs_completion (./pm/pmiserv/pmip_utils.c:959): bootstrap server returned error waiting for completion

    [proxy:0:0@r3i3n10] main (./pm/pmiserv/pmip.c:378): error waiting for event children completion

    Ctrl-C caught... cleaning up processes

    [press Ctrl-C again to force abort]

    [mpiexec@r3i3n10] HYDT_bscu_wait_for_completion (./tools/bootstrap/utils/bscu_wait.c:101): one of the processes terminated badly; aborting

    [mpiexec@r3i3n10] HYDT_bsci_wait_for_completion (./tools/bootstrap/src/bsci_wait.c:18): bootstrap device returned error waiting for completion

    [mpiexec@r3i3n10] HYD_pmci_wait_for_completion (./pm/pmiserv/pmiserv_pmci.c:521): bootstrap server returned error waiting for completion

    [mpiexec@r3i3n10] main (./ui/mpich/mpiexec.c:548): process manager error waiting for completion

    Start Epilogue v2.5 Fri Mar  7 09:36:40 EST 2014

    Statistics  cpupercent=0,cput=00:00:11,mem=130828kb,ncpus=16000,vmem=3842836kb,walltime=04:14:17

    End Epilogue v2.5 Fri Mar  7 09:36:51 EST 2014

    Can you please help?

    Thanks,

    Beichuan Yan

     

    DB:2.44:Large Scale Mpi Error: Hydt_Bscu_Wait_For_Completion j3


    Hi Beichuan,

    I would recommend trying with

    I_MPI_DAPL_UD=1
    I_MPI_DAPL_UD_PROVIDER=ofa-v2-mlx4_0-1u

    Sincerely,

    James Tullos

    Technical Consulting Engineer

    Intel® Cluster Tools

  • RELEVANCY SCORE 2.43

    DB:2.43:System Restore Failior dx


    does my system restore failer have anything to do with the anti virus software

    DB:2.43:System Restore Failior dx

    As well as the above ifo, if using Norton, disable it before using System Restore as it interferes with it.

    Mick Murphy.

  • RELEVANCY SCORE 2.43

    DB:2.43:Ora-01578: Oracle Data Block Corrupted ms


    Hi!

    I get error, after database open

    Errors in file /usr/lib/oracle/xe/app/oracle/admin/XE/udump/xe_ora_8225.trc:
    ORA-00704: bootstrap process failure
    ORA-00704: bootstrap process failure
    ORA-00604: error occurred at recursive SQL level 1
    ORA-01578: ORACLE data block corrupted (file # 1, block # 29)

    ORA-01110: data file 1: '/usr/lib/oracle/xe/oradata/XE/system.dbf'

    Error 704 happened during db open, shutting down database
    USER: terminating instance due to error 704
    Instance terminated by USER, pid = 8225
    ORA-1092 signalled during: ALTER DATABASE OPEN...

    What can i do?
    Thanks!

    DB:2.43:Ora-01578: Oracle Data Block Corrupted ms

    please check below article for XE:

    http://www.markcallen.com/oracle/oracle-backup-and-recovery-scenarios

    Regards
    Rajesh

  • RELEVANCY SCORE 2.43

    DB:2.43:Problem In Starting The J2ee Server aj


    Hi All,I am getting the following error message when I start the Server. [Thr 3820] *** ERROR = invalid return code of process [bootstrap] (exitcode = 66) [jstartxx.c 1642][Thr 3820] JControlExecuteBootstrap: error executing bootstrap node [bootstrap] (rc = 66)[Thr 3820] JControlCloseProgram: started (exitcode = 66)[Thr 3820] JControlCloseProgram: good bye... (exitcode = 66)Expecting any clue to resolve this issue.Reg/Venkat

    DB:2.43:Problem In Starting The J2ee Server aj

    Hi Nagaraj,Thanks a lot for your quick response. Long time issue was resolved by your valuable answer.Reg,Venkat

  • RELEVANCY SCORE 2.43

    DB:2.43:Bpel Process Libraries 99


    Do the libraries that are added to BPEL-INF/lib directory appear to be on the classpath for the java code that runs inside a BPEL process ? Is there a way to avoid this -- we are having some problems as these libraries are being somehow loaded along with other bootstrap jars.

    Thanks,
    Ravikiran

    DB:2.43:Bpel Process Libraries 99

    I believe that you still need to add the libraries to your classpath through Project Properties - Libraries even if they are in BPEL-INF/lib.

  • RELEVANCY SCORE 2.42

    DB:2.42:Free Css Bootstrap ps


    Hi,
    I am trying to find some free templates/css which I can use in Sharepoint Application Pages or WebParts created during development process. Is there any free css templates/layouts for use in SharePoint projects
    (commercial free)?
    Thanx for any help.

    DB:2.42:Free Css Bootstrap ps

    There's a brilliant project on CodePlex led by Eric Overfield that focuses quite intensely on Responsive Design for SharePoint (2010 - 2013 - SPO) which includes Bootstrap 3.
    it might appear a tad overkill to begin with but pulling the source code apart should be a great start.
    http://responsivesharepoint.codeplex.com/Steven Andrews
    SharePoint Business Analyst: LiveNation Entertainment
    Blog: baron72.wordpress.com
    Twitter: Follow @backpackerd00d
    My Wiki Articles:
    CodePlex Corner Series
    Please remember to mark your question as answered if this solves (or helps) your problem.

  • RELEVANCY SCORE 2.42

    DB:2.42:Synctoy 2.0 Not Running Via Scheduler On Windowx Xp Service Pack 3.0 mp


     
    i'am getting a failer that the account is wrong 0x80070005
    what can i do

    DB:2.42:Synctoy 2.0 Not Running Via Scheduler On Windowx Xp Service Pack 3.0 mp

    Hi,
    This issue seems an OS issue. I saw people talk about “0x80070005: Access is denied” issue of task scheduler on XP SP3. The new service pack provides stricter security settings, which may cause such access denied issue.
    There are some solutions to work around similar task scheduler issues. For now, I have not got an environment to verify which of them can help you. But I think you can have a try.
    Thanks.This posting is provided AS IS with no warranties, and confers no rights.

  • RELEVANCY SCORE 2.41

    DB:2.41:[Thr 6016] Jstartupicheckframeworkpackage: Can't Find Framework Package ap


    Hello all,

    While we are trying to start a window system, jcontrol is not starting and throwing the below error.

    [Thr 6016] Fri Jun 07 04:00:09 2013
    [Thr 6016] *** ERROR = invalid return code of process [bootstrap_ID4075900] (exitcode = 66) [jstartxx.c 1647]
    [Thr 6016] JControlExecuteBootstrap: error executing bootstrap node [bootstrap_ID4075900] (rc = 66)
    [Thr 6016] [Node: server0 bootstrap] java home is set by profile parameter
    [Thr 6016] Java Home: C:\j2sdk1.4.2_17-x64
    [Thr 6016] JStartupICheckFrameworkPackage: can't find framework package D:\usr\sap\SID\JC00\exe\jvmx.jar

    **********************************************************************
    JStartupIReadSection: read node properties [bootstrap_ID4075950]
    - node name : server0 bootstrap
    - node type : bootstrap
    - node execute : yes
    - jlaunch parameters :
    - java path : C:\j2sdk1.4.2_17-x64
    - java parameters : -Djco.jarm=1 -Djco.jarm=1 -Dstartup.defaultTimeout=38000000
    - java vm version : 1.4.2_17-b06
    - java vm vendor : Java HotSpot(TM) 64-Bit Server VM (Sun Microsystems Inc.)
    - java vm type : server
    - java vm cpu : amd64
    - heap size : 1024M
    - root path : D:\usr\sap\SID\JC00\j2ee\cluster
    - class path : .\bootstrap\launcher.jar
    - OS libs path : D:\usr\sap\SID\JC00\j2ee\os_libs
    - main class : com.sap.engine.offline.OfflineToolStart
    - framework class : com.sap.bc.proj.jstartup.JStartupFramework
    - registr. class : com.sap.bc.proj.jstartup.JStartupNatives
    - framework path : D:\usr\sap\SID\JC00\exe\jstartup.jar;D:\usr\sap\SID\JC00\exe\jvmx.jar
    - parameters : com.sap.engine.bootstrap.Bootstrap ./bootstrap ID004075950
    - debuggable : yes
    - debug mode : no
    - debug port : 60000
    - shutdown timeout : 120 sec.

    Kindly suggest solution related to this issue.

    Thanks in advance,
    Navina.V

    DB:2.41:[Thr 6016] Jstartupicheckframeworkpackage: Can't Find Framework Package ap

    Hello all,

    While we are trying to start a window system, jcontrol is not starting and throwing the below error.

    [Thr 6016] Fri Jun 07 04:00:09 2013
    [Thr 6016] *** ERROR = invalid return code of process [bootstrap_ID4075900] (exitcode = 66) [jstartxx.c 1647]
    [Thr 6016] JControlExecuteBootstrap: error executing bootstrap node [bootstrap_ID4075900] (rc = 66)
    [Thr 6016] [Node: server0 bootstrap] java home is set by profile parameter
    [Thr 6016] Java Home: C:\j2sdk1.4.2_17-x64
    [Thr 6016] JStartupICheckFrameworkPackage: can't find framework package D:\usr\sap\SID\JC00\exe\jvmx.jar

    **********************************************************************
    JStartupIReadSection: read node properties [bootstrap_ID4075950]
    - node name : server0 bootstrap
    - node type : bootstrap
    - node execute : yes
    - jlaunch parameters :
    - java path : C:\j2sdk1.4.2_17-x64
    - java parameters : -Djco.jarm=1 -Djco.jarm=1 -Dstartup.defaultTimeout=38000000
    - java vm version : 1.4.2_17-b06
    - java vm vendor : Java HotSpot(TM) 64-Bit Server VM (Sun Microsystems Inc.)
    - java vm type : server
    - java vm cpu : amd64
    - heap size : 1024M
    - root path : D:\usr\sap\SID\JC00\j2ee\cluster
    - class path : .\bootstrap\launcher.jar
    - OS libs path : D:\usr\sap\SID\JC00\j2ee\os_libs
    - main class : com.sap.engine.offline.OfflineToolStart
    - framework class : com.sap.bc.proj.jstartup.JStartupFramework
    - registr. class : com.sap.bc.proj.jstartup.JStartupNatives
    - framework path : D:\usr\sap\SID\JC00\exe\jstartup.jar;D:\usr\sap\SID\JC00\exe\jvmx.jar
    - parameters : com.sap.engine.bootstrap.Bootstrap ./bootstrap ID004075950
    - debuggable : yes
    - debug mode : no
    - debug port : 60000
    - shutdown timeout : 120 sec.

    Kindly suggest solution related to this issue.

    Thanks in advance,
    Navina.V

  • RELEVANCY SCORE 2.41

    DB:2.41:Assertion Failer Filecommonnpn_Gate.Cpp jf


    webカタログを開いたら 下記のアラートが出ました。
     Microsofte Visual C++ Runtime Library

    assertion failer
    Program: ...
    File: common¥npn_gate.cpp
    Line267

    Expression: pPluginShim
    Fore information your program can cause an assertion failure, see the Visual c++ documentation on asserts

    Press Retry to debug the application - JIT must be enabled

    これはどうしたら良いのでしょうか?

    DB:2.41:Assertion Failer Filecommonnpn_Gate.Cpp jf

    プロフィール及び携帯からのアクセスができません。 さん、こんにちは。
    参考にされた情報を提供いただきありがとうございます。

    同じような問題に遭われた方も問題の確認点としてご参考にできるよう、 [
    回答としてマーク] をいたしました。

    ご連絡ありがとうございました。

  • RELEVANCY SCORE 2.41

    DB:2.41:System Restore Failior pa


    does my system restore failer have anything to do with the anti virus software

    DB:2.41:System Restore Failior pa

    Hi jake 7248,

    It's possible. The nature of antivirus software makes it intertwine tightly with your OS. If you suspect your antivirus software is preventing you from doing a system restore, you can manually run it in Safe Mode, before your antivirus software has loaded.

    To start System Restore using the Command prompt, follow these steps:

    Restart your computer, and then press and hold F8 during the initial startup to start your computer in safe mode with a Command prompt.
    Use the arrow keys to select the Safe mode with a Command prompt option.
    If you are prompted to select an operating system, use the arrow keys to select the appropriate operating system for your computer, and then press ENTER.
    Log on as an administrator or with an account that has administrator credentials.
    At the command prompt, type %systemroot%\system32\restore\rstrui.exe, and then press ENTER.
    Follow the instructions that appear on the screen to restore your computer to a functional state.

    Please post back and let us know if this fixes your problem.

    Dave D
    Microsoft Answers Support Engineer
    Visit our
    Microsoft Answers Feedback Forum and let us know what you think.

  • RELEVANCY SCORE 2.41

    DB:2.41:J2ee Is Crashing Abap Stable cm



    I have installed WAS 7.00 SR1 and ABAP istance is stable however my J2EE instance keeps crashing (it actually does not start). I upgraded succesfully to SP 8 and the latest kernel and still cannot get J2EE stable.

    I have added the error messages:

    Thr 1] SigISetDefaultAction : default handling for signal 20

    [Thr 1] JControlExecuteBootstrap: execute bootstrap process [bootstrap]

    [Thr 258] JControlDPMessageFunc: Thread 258 started as handler thread for R/3 di

    spatcher messages.

    [Thr 1] [Node: bootstrap] java home is set by profile parameter

    Java Home: /usr/java14_64

    [Thr 1] JStartupICheckFrameworkPackage: can't find framework package /usr/sap/D

    D1/SYS/exe/run/jvmx.jar

    [Thr 1] JStartupICreateProcess: fork process (pid 999646)

    [Thr 1] Mon Aug 7 15:20:28 2006

    [Thr 1] *** ERROR = invalid return code of process [bootstrap] (exitcode = 66)

    [jstartxx_mt. 1642]

    [Thr 1] JControlExecuteBootstrap: error executing bootstrap node [bootstrap] (r

    c = 66)

    [Thr 1] JControlCloseProgram: started (exitcode = 66)

    [Thr 1] JControlCloseProgram: good bye... (exitcode = 66)

    Thanks

    Mikie

    DB:2.41:J2ee Is Crashing Abap Stable cm


    We had the same issue. We found out that the following files were still had owned by root:sapinst after the installation. Changed the ownership to bin:bin and recycled the system. We have AIX 5.3 OS.

    At /usr/java14_64/jre/lib/security/ the following files:

    US_export_policy.jar

    local_policy.jar

    555 authorization. rx rx rx

    Neval Ozturk

  • RELEVANCY SCORE 2.41

    DB:2.41:Jdev Debug Stop At Breakpoint At Classloader.Java Or Bootstrap Notfound kc


    Dear All

    Anyone kindly guide me why when I start debug jdev toolbox tutorial file, jdev always stop at Exception of ClassLoader.java. and never reach my working files. .

    Debugger connected to local process.
    Exception breakpoint occurred at line 891 of ClassLoader.java.
    java.lang.ClassNotFoundException: oracle/oc4j/loader/boot/BootStrap
    Exception breakpoint occurred at line 200 of URLClassLoader.java.
    ...

    when I try step over it say unable to find source file for package oracle.oc4j.loader.boot, filename BootStrap.java
    PS: I can run smoothly if in normal mode. my jdev is 10.1.3.3

    thank so much
    Bank

    Edited by: Jarjarbank on Nov 6, 2012 1:28 AM

    DB:2.41:Jdev Debug Stop At Breakpoint At Classloader.Java Or Bootstrap Notfound kc

    Dear All

    Anyone kindly guide me why when I start debug jdev toolbox tutorial file, jdev always stop at Exception of ClassLoader.java. and never reach my working files. .

    Debugger connected to local process.
    Exception breakpoint occurred at line 891 of ClassLoader.java.
    java.lang.ClassNotFoundException: oracle/oc4j/loader/boot/BootStrap
    Exception breakpoint occurred at line 200 of URLClassLoader.java.
    ...

    when I try step over it say unable to find source file for package oracle.oc4j.loader.boot, filename BootStrap.java
    PS: I can run smoothly if in normal mode. my jdev is 10.1.3.3

    thank so much
    Bank

    Edited by: Jarjarbank on Nov 6, 2012 1:28 AM

  • RELEVANCY SCORE 2.41

    DB:2.41:Sucurity Failer Kb2814124 Kb890830 xs


    SECURITY UPDATE FAILED RESULT CAME UP AS FOLLOWING MICROSOFT SILVERLIGHT KB2814124 AND WINDOWS MALICIOUS SOFTWARE REMOVAL TOOL MARCH 2013 KB890830 FAILED

  • RELEVANCY SCORE 2.41

    DB:2.41:Pb With Cisco 2500 3z



    Hello,

    My Cisco 2511 is repately in reboot process and the following message appear in console:

    Copyright (c) 1986-1997 by cisco Systems

    System Bootstrap, Version 11.0(10c)XB1, PLATFORM SPECIFIC RELEASE SOFTWARE (fc1)

    and i can't do anything also for access to RMON

    Please can u urgentely help me

    DB:2.41:Pb With Cisco 2500 3z


    Hi All,

    Can you just try ctrl + break key or just a break key continuously it may go into rommon mode.

    If at all it does not go into rommon then get it replaced or RMA from TAC.

    Also you will not be able to take out the flash as it is not a modular router so you will not be able to open it and take the flash out.

    HTH

    Ankur

  • RELEVANCY SCORE 2.41

    DB:2.41:My Computer Is Showing A Sync Failer It Will Not Download My Recently Added Playlist What Is Going On? cx


    My Computer is showing a sync failer is it wont let me download my recently added playlist what is going on?

    DB:2.41:My Computer Is Showing A Sync Failer It Will Not Download My Recently Added Playlist What Is Going On? cx

    My Computer is showing a sync failer is it wont let me download my recently added playlist what is going on?

  • RELEVANCY SCORE 2.41

    DB:2.41:Mit Outlook Failer Ved Opstart. sm


    Mit outlook 2013, kan ikke starte op, kun i Safe Mode, og hvordan kan jeg opstarte det i normal tilstand. En fix it måske?

    DB:2.41:Mit Outlook Failer Ved Opstart. sm

    Hej

    Lige umiddelbart burde det skyldes et add-in hvis du kan få lov til at starte det i Safe Mode.

    Prøv at gå ind i File Options Add-ins
    Go også slå allesammen fra og se om du herefter kan få lov til at starte op normalt, hvis du kan, så er du nødt til at prøve at aktivere et par stykker ad gangen og se hvilken af dem det er der forårsager problemet.

    Jeg håber det hjælper!

  • RELEVANCY SCORE 2.41

    DB:2.41:Error In Installation Of Sql Server 2005 x8


    I have uninstalled SQL server 2000 am installing SQL Server 2005, I'm getting follwing error.=== Verbose logging started: 3/27/2008  10:24:26  Build type: SHIP UNICODE 3.01.4000.4039  Calling process: C:\Program Files\Microsoft SQL Server\90\Setup Bootstrap\setup.exe ===MSI (c) (88:78) [10:24:26:828]: Resetting cached policy valuesMSI (c) (88:78) [10:24:26:828]: Machine policy value 'Debug' is 0MSI (c) (88:78) [10:24:26:828]: ******* RunEngine:           ******* Product: F:\Servers\Setup\SqlRun_SQL.msi           ******* Action:            ******* CommandLine: **********MSI (c) (88:78) [10:24:26:828]: Client-side and UI is none or basic: Running entire install on the server.MSI (c) (88:78) [10:24:26:828]: Grabbed execution mutex.MSI (c) (88:78) [10:24:26:828]: Cloaking enabled.MSI (c) (88:78) [10:24:26:828]: Attempting to enable all disabled priveleges before calling Install on ServerMSI (c) (88:78) [10:24:26:828]: Incrementing counter to disable shutdown. Counter after increment: 0MSI (s) (7C:94) [10:24:26:843]: Grabbed execution mutex.MSI (s) (7C:54) [10:24:26:843]: Resetting cached policy valuesMSI (s) (7C:54) [10:24:26:843]: Machine policy value 'Debug' is 0MSI (s) (7C:54) [10:24:26:843]: ******* RunEngine:           ******* Product: F:\Servers\Setup\SqlRun_SQL.msi           ******* Action:            ******* CommandLine: **********MSI (s) (7C:54) [10:24:26:843]: Note: 1: 2203 2: F:\Servers\Setup\SqlRun_SQL.msi 3: -2147287010 MSI (s) (7C:54) [10:24:26:843]: MainEngineThread is returning 1620MSI (c) (88:78) [10:24:26:843]: Decrementing counter to disable shutdown. If counter = 0, shutdown will be denied.  Counter after decrement: -1MSI (c) (88:78) [10:24:26:843]: MainEngineThread is returning 1620=== Verbose logging stopped: 3/27/2008  10:24:26 ===SUMMARY.txt (C:\Program Files\Microsoft SQL Server\90\Setup Bootstrap\LOG) has follwing contents...Microsoft SQL Server 2005 9.00.1399.06 ============================== OS Version      : Microsoft Windows XP Professional Service Pack 2 (Build 2600) Time            : Thu Mar 27 09:57:45 2008  Machine         : ADITYA Product         : Microsoft SQL Server Setup Support Files (English) Product Version : 9.00.1399.06 Install         : Successful Log File        : C:\Program Files\Microsoft SQL Server\90\Setup Bootstrap\LOG\Files\SQLSetup0002_ADITYA_SQLSupport_1.log -------------------------------------------------------------------------------- Machine         : ADITYA Product         : Microsoft Office 2003 Web Components Product Version : 11.0.6558.0 Install         : Successful Log File        : C:\Program Files\Microsoft SQL Server\90\Setup Bootstrap\LOG\Files\SQLSetup0002_ADITYA_OWC11_1.log -------------------------------------------------------------------------------- Machine         : ADITYA Product         : Microsoft SQL Server 2005 Backward compatibility Product Version : 8.05.1054 Install         : Successful Log File        : C:\Program Files\Microsoft SQL Server\90\Setup Bootstrap\LOG\Files\SQLSetup0002_ADITYA_BackwardsCompat_1.log -------------------------------------------------------------------------------- Machine         : ADITYA Product         : MSXML 6.0 Parser Product Version : 6.00.3883.8 Install         : Successful Log File        : C:\Program Files\Microsoft SQL Server\90\Setup Bootstrap\LOG\Files\SQLSetup0002_ADITYA_MSXML6_1.log -------------------------------------------------------------------------------- Machine         : ADITYA Product         : Microsoft SQL Server Setup Support Files (English) Product Version : 9.00.1399.06 Install         : Successful Log File        : C:\Program Files\Microsoft SQL Server\90\Setup Bootstrap\LOG\Files\SQLSetup0002_ADITYA_SQLSupport_2.log -------------------------------------------------------------------------------- Machine         : ADITYA Product         : Microsoft SQL Server Native Client Product Version : 9.00.1399.06 Install         : Successful Log File        : C:\Program Files\Microsoft SQL Server\90\Setup Bootstrap\LOG\Files\SQLSetup0002_ADITYA_SQLNCLI_1.log -------------------------------------------------------------------------------- Machine         : ADITYA Product         : Microsoft Office 2003 Web Components Product Version : 11.0.6558.0 Install         : Successful Log File        : C:\Program Files\Microsoft SQL Server\90\Setup Bootstrap\LOG\Files\SQLSetup0002_ADITYA_OWC11_2.log -------------------------------------------------------------------------------- Machine         : ADITYA Product         : Microsoft SQL Server 2005 Backward compatibility Product Version : 8.05.1054 Install         : Successful Log File        : C:\Program Files\Microsoft SQL Server\90\Setup Bootstrap\LOG\Files\SQLSetup0002_ADITYA_BackwardsCompat_2.log -------------------------------------------------------------------------------- Machine         : ADITYA Product         : MSXML 6.0 Parser Product Version : 6.00.3883.8 Install         : Successful Log File        : C:\Program Files\Microsoft SQL Server\90\Setup Bootstrap\LOG\Files\SQLSetup0002_ADITYA_MSXML6_2.log -------------------------------------------------------------------------------- Machine         : ADITYA Product         : Microsoft SQL Server Setup Support Files (English) Product Version : 9.00.1399.06 Install         : Successful Log File        : C:\Program Files\Microsoft SQL Server\90\Setup Bootstrap\LOG\Files\SQLSetup0002_ADITYA_SQLSupport_3.log -------------------------------------------------------------------------------- Machine         : ADITYA Product         : Microsoft SQL Server Native Client Product Version : 9.00.1399.06 Install         : Successful Log File        : C:\Program Files\Microsoft SQL Server\90\Setup Bootstrap\LOG\Files\SQLSetup0002_ADITYA_SQLNCLI_2.log -------------------------------------------------------------------------------- Machine         : ADITYA Product         : Microsoft Office 2003 Web Components Product Version : 11.0.6558.0 Install         : Successful Log File        : C:\Program Files\Microsoft SQL Server\90\Setup Bootstrap\LOG\Files\SQLSetup0002_ADITYA_OWC11_3.log -------------------------------------------------------------------------------- Machine         : ADITYA Product         : Microsoft SQL Server 2005 Backward compatibility Product Version : 8.05.1054 Install         : Successful Log File        : C:\Program Files\Microsoft SQL Server\90\Setup Bootstrap\LOG\Files\SQLSetup0002_ADITYA_BackwardsCompat_3.log -------------------------------------------------------------------------------- Machine         : ADITYA Product         : MSXML 6.0 Parser Product Version : 6.00.3883.8 Install         : Successful Log File        : C:\Program Files\Microsoft SQL Server\90\Setup Bootstrap\LOG\Files\SQLSetup0002_ADITYA_MSXML6_3.log -------------------------------------------------------------------------------- Machine         : ADITYA Product         : Microsoft SQL Server Setup Support Files (English) Product Version : 9.00.1399.06 Install         : Successful Log File        : C:\Program Files\Microsoft SQL Server\90\Setup Bootstrap\LOG\Files\SQLSetup0002_ADITYA_SQLSupport_4.log -------------------------------------------------------------------------------- Machine         : ADITYA Product         : Microsoft Office 2003 Web Components Product Version : 11.0.6558.0 Install         : Successful Log File        : C:\Program Files\Microsoft SQL Server\90\Setup Bootstrap\LOG\Files\SQLSetup0002_ADITYA_OWC11_4.log -------------------------------------------------------------------------------- Machine         : ADITYA Product         : Microsoft SQL Server 2005 Backward compatibility Product Version : 8.05.1054 Install         : Successful Log File        : C:\Program Files\Microsoft SQL Server\90\Setup Bootstrap\LOG\Files\SQLSetup0002_ADITYA_BackwardsCompat_4.log -------------------------------------------------------------------------------- Machine         : ADITYA Product         : Microsoft SQL Server Setup Support Files (English) Product Version : 9.00.1399.06 Install         : Successful Log File        : C:\Program Files\Microsoft SQL Server\90\Setup Bootstrap\LOG\Files\SQLSetup0002_ADITYA_SQLSupport_5.log -------------------------------------------------------------------------------- Machine         : ADITYA Product         : Microsoft SQL Server Native Client Product Version : 9.00.1399.06 Install         : Successful Log File        : C:\Program Files\Microsoft SQL Server\90\Setup Bootstrap\LOG\Files\SQLSetup0002_ADITYA_SQLNCLI_3.log -------------------------------------------------------------------------------- Machine         : ADITYA Product         : Microsoft Office 2003 Web Components Product Version : 11.0.6558.0 Install         : Successful Log File        : C:\Program Files\Microsoft SQL Server\90\Setup Bootstrap\LOG\Files\SQLSetup0002_ADITYA_OWC11_5.log -------------------------------------------------------------------------------- Machine         : ADITYA Product         : Microsoft SQL Server VSS Writer Product Version : 9.00.1399.06 Install         : Successful Log File        : C:\Program Files\Microsoft SQL Server\90\Setup Bootstrap\LOG\Files\SQLSetup0002_ADITYA_SqlWriter_1.log -------------------------------------------------------------------------------- Machine         : ADITYA Product         : Microsoft SQL Server 2005 Backward compatibility Product Version : 8.05.1054 Install         : Successful Log File        : C:\Program Files\Microsoft SQL Server\90\Setup Bootstrap\LOG\Files\SQLSetup0002_ADITYA_BackwardsCompat_5.log -------------------------------------------------------------------------------- Machine         : ADITYA Product         : MSXML 6.0 Parser Product Version : 6.00.3883.8 Install         : Successful Log File        : C:\Program Files\Microsoft SQL Server\90\Setup Bootstrap\LOG\Files\SQLSetup0002_ADITYA_MSXML6_4.log -------------------------------------------------------------------------------- Machine         : ADITYA Product         : Microsoft SQL Server Setup Support Files (English) Product Version : 9.00.1399.06 Install         : Successful Log File        : C:\Program Files\Microsoft SQL Server\90\Setup Bootstrap\LOG\Files\SQLSetup0002_ADITYA_SQLSupport_6.log -------------------------------------------------------------------------------- Machine         : ADITYA Product         : Microsoft SQL Server Native Client Product Version : 9.00.1399.06 Install         : Successful Log File        : C:\Program Files\Microsoft SQL Server\90\Setup Bootstrap\LOG\Files\SQLSetup0002_ADITYA_SQLNCLI_4.log -------------------------------------------------------------------------------- Machine         : ADITYA Product         : Microsoft Visual Studio 2005 Premier Partner Edition - ENU Product Version : 8.0.50727.42 Install         : Successful Log File        : C:\Program Files\Microsoft SQL Server\90\Setup Bootstrap\LOG\Files\SQLSetup0002_ADITYA_PPESku_1.log -------------------------------------------------------------------------------- Machine         : ADITYA Product         : Microsoft Office 2003 Web Components Product Version : 11.0.6558.0 Install         : Successful Log File        : C:\Program Files\Microsoft SQL Server\90\Setup Bootstrap\LOG\Files\SQLSetup0002_ADITYA_OWC11_6.log -------------------------------------------------------------------------------- Machine         : ADITYA Product         : Microsoft SQL Server 2005 Books Online (English) Product Version : 9.00.1399.06 Install         : Successful Log File        : C:\Program Files\Microsoft SQL Server\90\Setup Bootstrap\LOG\Files\SQLSetup0002_ADITYA_BOL_1.log -------------------------------------------------------------------------------- Machine         : ADITYA Product         : Microsoft SQL Server 2005 Backward compatibility Product Version : 8.05.1054 Install         : Successful Log File        : C:\Program Files\Microsoft SQL Server\90\Setup Bootstrap\LOG\Files\SQLSetup0002_ADITYA_BackwardsCompat_6.log -------------------------------------------------------------------------------- Machine         : ADITYA Product         : MSXML 6.0 Parser Product Version : 6.00.3883.8 Install         : Successful Log File        : C:\Program Files\Microsoft SQL Server\90\Setup Bootstrap\LOG\Files\SQLSetup0002_ADITYA_MSXML6_5.log -------------------------------------------------------------------------------- Machine         : ADITYA Product         : Microsoft SQL Server 2005 Integration Services Product Version : 9.00.1399.06 Install         : Successful Log File        : C:\Program Files\Microsoft SQL Server\90\Setup Bootstrap\LOG\Files\SQLSetup0002_ADITYA_DTS.log -------------------------------------------------------------------------------- Machine         : ADITYA Product         : SQLXML4 Product Version : 9.00.1399.06 Install         : Successful Log File        : C:\Program Files\Microsoft SQL Server\90\Setup Bootstrap\LOG\Files\SQLSetup0002_ADITYA_SQLXML4_1.log -------------------------------------------------------------------------------- Machine         : ADITYA Product         : SQLXML4 Product Version : 9.00.1399.06 Install         : Successful Log File        : C:\Program Files\Microsoft SQL Server\90\Setup Bootstrap\LOG\Files\SQLSetup0002_ADITYA_SQLXML4_2.log -------------------------------------------------------------------------------- Machine         : ADITYA Product         : Microsoft SQL Server 2005 Analysis Services Product Version : 9.00.1399.06 Install         : Successful Log File        : C:\Program Files\Microsoft SQL Server\90\Setup Bootstrap\LOG\Files\SQLSetup0002_ADITYA_AS.log -------------------------------------------------------------------------------- Machine         : ADITYA Product         : Microsoft SQL Server 2005 Notification Services Product Version : 9.00.1399.06 Install         : Failed Log File        : C:\Program Files\Microsoft SQL Server\90\Setup Bootstrap\LOG\Files\SQLSetup0002_ADITYA_NS.log Error Number    : 1602 --------------------------------------------------------------------------------  SQL Server Setup failed. For more information, review the Setup log file in %ProgramFiles%\Microsoft SQL Server\90\Setup Bootstrap\LOG\Summary.txt. Time            : Thu Mar 27 10:28:36 2008List of log files:    C:\Program Files\Microsoft SQL Server\90\Setup Bootstrap\LOG\Files\SQLSetup0002_ADITYA_Core(Local).log    C:\Program Files\Microsoft SQL Server\90\Setup Bootstrap\LOG\Files\SQLSetup0002_ADITYA_SQLSupport_1.log    C:\Program Files\Microsoft SQL Server\90\Setup Bootstrap\LOG\Files\SQLSetup0002_ADITYA_OWC11_1.log    C:\Program Files\Microsoft SQL Server\90\Setup Bootstrap\LOG\Files\SQLSetup0002_ADITYA_BackwardsCompat_1.log    C:\Program Files\Microsoft SQL Server\90\Setup Bootstrap\LOG\Files\SQLSetup0002_ADITYA_MSXML6_1.log    C:\Program Files\Microsoft SQL Server\90\Setup Bootstrap\LOG\Files\SQLSetup0002_ADITYA_SQLSupport_2.log    C:\Program Files\Microsoft SQL Server\90\Setup Bootstrap\LOG\Files\SQLSetup0002_ADITYA_SQLNCLI_1.log    C:\Program Files\Microsoft SQL Server\90\Setup Bootstrap\LOG\Files\SQLSetup0002_ADITYA_OWC11_2.log    C:\Program Files\Microsoft SQL Server\90\Setup Bootstrap\LOG\Files\SQLSetup0002_ADITYA_BackwardsCompat_2.log    C:\Program Files\Microsoft SQL Server\90\Setup Bootstrap\LOG\Files\SQLSetup0002_ADITYA_MSXML6_2.log    C:\Program Files\Microsoft SQL Server\90\Setup Bootstrap\LOG\Files\SQLSetup0002_ADITYA_SQLSupport_3.log    C:\Program Files\Microsoft SQL Server\90\Setup Bootstrap\LOG\Files\SQLSetup0002_ADITYA_SQLNCLI_2.log    C:\Program Files\Microsoft SQL Server\90\Setup Bootstrap\LOG\Files\SQLSetup0002_ADITYA_OWC11_3.log    C:\Program Files\Microsoft SQL Server\90\Setup Bootstrap\LOG\Files\SQLSetup0002_ADITYA_BackwardsCompat_3.log    C:\Program Files\Microsoft SQL Server\90\Setup Bootstrap\LOG\Files\SQLSetup0002_ADITYA_MSXML6_3.log    C:\Program Files\Microsoft SQL Server\90\Setup Bootstrap\LOG\Files\SQLSetup0002_ADITYA_SQLSupport_4.log    C:\Program Files\Microsoft SQL Server\90\Setup Bootstrap\LOG\Files\SQLSetup0002_ADITYA_OWC11_4.log    C:\Program Files\Microsoft SQL Server\90\Setup Bootstrap\LOG\Files\SQLSetup0002_ADITYA_BackwardsCompat_4.log    C:\Program Files\Microsoft SQL Server\90\Setup Bootstrap\LOG\Files\SQLSetup0002_ADITYA_SQLSupport_5.log    C:\Program Files\Microsoft SQL Server\90\Setup Bootstrap\LOG\Files\SQLSetup0002_ADITYA_SQLNCLI_3.log    C:\Program Files\Microsoft SQL Server\90\Setup Bootstrap\LOG\Files\SQLSetup0002_ADITYA_OWC11_5.log    C:\Program Files\Microsoft SQL Server\90\Setup Bootstrap\LOG\Files\SQLSetup0002_ADITYA_SqlWriter_1.log    C:\Program Files\Microsoft SQL Server\90\Setup Bootstrap\LOG\Files\SQLSetup0002_ADITYA_BackwardsCompat_5.log    C:\Program Files\Microsoft SQL Server\90\Setup Bootstrap\LOG\Files\SQLSetup0002_ADITYA_MSXML6_4.log    C:\Program Files\Microsoft SQL Server\90\Setup Bootstrap\LOG\Files\SQLSetup0002_ADITYA_SQLSupport_6.log    C:\Program Files\Microsoft SQL Server\90\Setup Bootstrap\LOG\Files\SQLSetup0002_ADITYA_SQLNCLI_4.log    C:\Program Files\Microsoft SQL Server\90\Setup Bootstrap\LOG\Files\SQLSetup0002_ADITYA_PPESku_1.log    C:\Program Files\Microsoft SQL Server\90\Setup Bootstrap\LOG\Files\SQLSetup0002_ADITYA_OWC11_6.log    C:\Program Files\Microsoft SQL Server\90\Setup Bootstrap\LOG\Files\SQLSetup0002_ADITYA_BOL_1.log    C:\Program Files\Microsoft SQL Server\90\Setup Bootstrap\LOG\Files\SQLSetup0002_ADITYA_BackwardsCompat_6.log    C:\Program Files\Microsoft SQL Server\90\Setup Bootstrap\LOG\Files\SQLSetup0002_ADITYA_MSXML6_5.log    C:\Program Files\Microsoft SQL Server\90\Setup Bootstrap\LOG\Files\SQLSetup0002_ADITYA_DTS.log    C:\Program Files\Microsoft SQL Server\90\Setup Bootstrap\LOG\Files\SQLSetup0002_ADITYA_SQLXML4_1.log    C:\Program Files\Microsoft SQL Server\90\Setup Bootstrap\LOG\Files\SQLSetup0002_ADITYA_SQL.log    C:\Program Files\Microsoft SQL Server\90\Setup Bootstrap\LOG\Files\SQLSetup0002_ADITYA_SQLXML4_2.log    C:\Program Files\Microsoft SQL Server\90\Setup Bootstrap\LOG\Files\SQLSetup0002_ADITYA_AS.log    C:\Program Files\Microsoft SQL Server\90\Setup Bootstrap\LOG\Files\SQLSetup0002_ADITYA_NS.log    C:\Program Files\Microsoft SQL Server\90\Setup Bootstrap\LOG\Files\SQLSetup0002_ADITYA_Datastore.xml    C:\Program Files\Microsoft SQL Server\90\Setup Bootstrap\LOG\Files\SQLSetup0002_ADITYA_.NET Framework 2.0.log    C:\Program Files\Microsoft SQL Server\90\Setup Bootstrap\LOG\Files\SQLSetup0002_ADITYA_Core.log    C:\Program Files\Microsoft SQL Server\90\Setup Bootstrap\LOG\Summary.txt    C:\Program Files\Microsoft SQL Server\90\Setup Bootstrap\LOG\Files\SQLSetup0002_ADITYA_.NET Framework 2.0 LangPack.log    C:\Program Files\Microsoft SQL Server\90\Setup Bootstrap\LOG\Files\SQLSetup0002_ADITYA_.NET Framework Upgrade Advisor.log    C:\Program Files\Microsoft SQL Server\90\Setup Bootstrap\LOG\Files\SQLSetup0002_ADITYA_.NET Framework Upgrade Advisor LangPack.log    C:\Program Files\Microsoft SQL Server\90\Setup Bootstrap\LOG\Files\SQLSetup0002_ADITYA_.NET Framework Windows Installer.log    C:\Program Files\Microsoft SQL Server\90\Setup Bootstrap\LOG\Files\SQLSetup0002_ADITYA_.NET Framework Windows Installer LangPack.log    C:\Program Files\Microsoft SQL Server\90\Setup Bootstrap\LOG\Files\SQLSetup0002_ADITYA_Support.log    C:\Program Files\Microsoft SQL Server\90\Setup Bootstrap\LOG\Files\SQLSetup0002_ADITYA_SCC.log    C:\Program Files\Microsoft SQL Server\90\Setup Bootstrap\LOG\Files\SQLSetup0002_ADITYA_WI.logYour help is appreciated.aditya

    DB:2.41:Error In Installation Of Sql Server 2005 x8

    Check if this could help
    http://geekswithblogs.net/waterbaby/archive/2006/08/03/87048.aspx
     
    Madhu
     

  • RELEVANCY SCORE 2.41

    DB:2.41:Application Server Fails To Start - Exit Code 503 kx



    Hi, the CE installed on my laptop was correctly installed and started the first time.

    Now jstart in Central Instance fails.

    F ********************************************************************************
    F Process Instance_bootstrap started with pid 5868
    F ********************************************************************************
    F [Thr 3744] *** LOG = Process bootstrap started (pid 5868).
    F
    F [Thr 3744] Thu Feb 26 09:57:38 2009
    F [Thr 3744] *** LOG = Process bootstrap stopping (pid 5868).
    F
    F [Thr 5876] Thu Feb 26 09:57:39 2009
    F [Thr 5876] *** LOG = Signal 13 SIGCHLD.
    F
    F [Thr 3744] Thu Feb 26 09:57:39 2009
    F [Thr 3744] *** LOG = Process bootstrap stopped (pid 5868).
    F [Thr 3744] *** WARNING = Node bootstrap failed: result 1, exit code 503. [sfxxnode.hpp 1005]

  • RELEVANCY SCORE 2.41

    DB:2.41:Bootstrap Cannot Determine Status Of The Backup Process j7


    Hi, This is my enviroment: Server "tireaw2k10" OS "Windows 2003 Enterprise Edition" NetWorker 7.2.1 The Autochanger is a SL500 with two LTO3. The backup fails randomly with diferents clients and groups since a long time ago with the folowing message: bootstrap Cannot determine status of the backup process. Use mminfo to determine job status. Someone knows about this?Thanks, best regards.Amaia

    DB:2.41:Bootstrap Cannot Determine Status Of The Backup Process j7

    NetWorker numbers can be seen as X.Y.Z. X is the major release, Y is minor release and Z is patch level. Those patch levels sometimes include new features, but usually main purpose for them is to address identified issues. Those issues are listed in bug fix list which is available from docs section. Major release can be sometimes also X.5.Z, but since 7.3 version EMC broke that rule for some reason.Sometimes, before next patch release is ready and due to major problem or major number of issues, jumbo patch is release. Usually those will have significant number of fixes, but not as fothcoming patch release. For example, 7.3.1 has jumbo patch and after that (I think 2 or 3 weeks) 7.3.2 was released. Now, 7.3.2 will get its own jukbo patch. Difference between these versions can be seen via build number (usually pointing to number of code changes).

  • RELEVANCY SCORE 2.41

    DB:2.41:Installing 2 Windows 7 Operating System In C:\ Partition. ax


    Having a C:\ partition of 200 GB. Need to install 2 windows 7 operating system in the single partition, while booting the bootstrap loader should display the Windows 7flavorsfor the boot process. Any suggestions.

    DB:2.41:Installing 2 Windows 7 Operating System In C:\ Partition. ax

    As far as I knowwindowsinstallation won't allow you to install two versions on the same partition - so not only is the scenario you describe unsupported, it's impossible.

  • RELEVANCY SCORE 2.41

    DB:2.41:Signal Strength Is Getting Lower When Taking A Call px


    When taking a call signal strength is getting lower and the call is getting disconnected or it says call failer

    DB:2.41:Signal Strength Is Getting Lower When Taking A Call px

    When taking a call signal strength is getting lower and the call is getting disconnected or it says call failer

  • RELEVANCY SCORE 2.41

    DB:2.41:Bootstrap 3d


    What is a bootstrap in reference to Oracle 9i?

    DB:2.41:Bootstrap 3d

    What is a bootstrap in reference to Oracle 9i?

  • RELEVANCY SCORE 2.41

    DB:2.41:Power Failer On The My Usb ?? k7



    hi there

    when i put my usbmouse in my lattitude 100Li get this failer:

    power failer on hubport

    realy strange cause normaly my mouse works perfectly

    hope you guy's can help me out

    greetz milo

    DB:2.41:Power Failer On The My Usb ?? k7


    hi there

    when i put my usbmouse in my lattitude 100Li get this failer:

    power failer on hubport

    realy strange cause normaly my mouse works perfectly

    hope you guy's can help me out

    greetz milo

  • RELEVANCY SCORE 2.41

    DB:2.41:Problems With J2ee kk



    Hi,

    I am running J2EE 640 sp11 on microsoft windows 2003.

    The system will not start and the only error I can find is the following:-

    E:\usr\sap\DRM\DVEBMGS00\workdev_jcontrol

    [Thr 2684] JControlExecuteBootstrap: execute bootstrap process [bootstrap_ID7232300]

    [Thr 2684] INFO: Invalid property value [JLaunchParameters/]

    [Thr 2684] *** ERROR = VM Home not specified [jstartxxi.c 518]

    [Thr 2684] *** ERROR = node [bootstrap_ID7232300] not found [jstartxx.c 1407]

    [Thr 2684] JControlExecuteBootstrap: error executing bootstrap node [bootstrap_ID7232300] (rc=-18)

    [Thr 2684] JControlExecuteBootstrap: execute bootstrap process [bootstrap_ID7232350]

    [Thr 2684] INFO: Invalid property value [JLaunchParameters/]

    [Thr 2684] *** ERROR = VM Home not specified [jstartxxi.c 518]

    [Thr 2684] *** ERROR = node [bootstrap_ID7232350] not found [jstartxx.c 1407]

    [Thr 2684] JControlExecuteBootstrap: error executing bootstrap node [bootstrap_ID7232350] (rc=-18)

    [Thr 2684] JControlCloseProgram: started (exitcode = -18)

    [Thr 2684] JControlCloseProgram: good bye... (exitcode=-18)

    I have found similar error's posted on SDN, but none are exactly the same.

    Please Help,

    Regards

    Andy

    DB:2.41:Problems With J2ee kk


    Hi Vyara,

    Thank you for the information. This has now solved my problem.

    Once again Thanks.

    Andy.

  • RELEVANCY SCORE 2.41

    DB:2.41:(Problem-Gps Failer Call Service Provider And Fla... fp


    Hi I need some help my 6265 nokia keeps showing GPS failer and the camera light wont go off... Can enyone out there help !! I love this phone I had 2 of them each lasted 2 years and there discontinude. would realy appreaciate it.

    Message Edited by mrdrew on 10-Dec-2008 03:52 AM

    DB:2.41:(Problem-Gps Failer Call Service Provider And Fla... fp

    Hi I need some help my 6265 nokia keeps showing GPS failer and the camera light wont go off... Can enyone out there help !! I love this phone I had 2 of them each lasted 2 years and there discontinude. would realy appreaciate it.

    Message Edited by mrdrew on 10-Dec-2008 03:52 AM

  • RELEVANCY SCORE 2.41

    DB:2.41:Upgrade Edition Crash My Sql Server x9


    Hello,
    I use SQL Server to host my SharePoint database.
    I have decided to upgrade the evaluation version of SQL SERVER 2008 R2 to standard from SPLA version. The process running fine but at the endSharePointwas not able to communicate with my SQL Server. My SharePoint site works fine but the
    search was broken. In event viewer i have many erros like Cannot opened database by the requested login...The login failer for user mysuser.
    All SQL permissions seems OK, i rollback to a previous snapshot and now it's works but i run the evaluation version. What can i do ??

    MCITP : Enterprise Messaging Administrator 2010
    Engineer Hosted Exchange solutions

  • RELEVANCY SCORE 2.41

    DB:2.41:Jcontrol Process Does Not Start 9x



    jcontrol.exe fails to start. the error is:

    [Thr 3724] Sun Aug 13 08:37:18 2006

    [Thr 3724] *** ERROR = invalid return code of process [bootstrap] (exitcode=66) [jstartxx.c 1433]

    [Thr 3724] JControlExecuteBootstrap: error executing bootstrap node [bootstrap] (rc=66)

    [Thr 3724] JControlCloseProgram: started (exitcode = 66)

    [Thr 3724] JControlCloseProgram: good bye... (exitcode=66)

    I have the Microsoft loopback adapter installed. Any idea what the problem is.

    DB:2.41:Jcontrol Process Does Not Start 9x


    Hi,

    jcontrol failed to start,can be due to many factors.

    1.kernel mismatch can completely stop jcontrol.check if proper kernel is updated.

    2.memory issues also will stop jcontrol.check for heapsize settings in configtool.

    restart the machine and try once.

    reward points if helpful

  • RELEVANCY SCORE 2.41

    DB:2.41:Re: Funwithpi... Help!!! 1s


    Nice assignment! When I was young my assignments made me process
    dull records and 'move corresponding stuff after appending 1 lines'.
    Or I had to shift values left and right in a simulated 'very simple
    computing device' or I had to bootstrap silly OSes from paper tape
    after keying in humongous sequences of hexadecimal bootstrap
    code. Or I had to solve differential equations using analog devices.
    You are lucky.

    kind regards,

    Jos

    DB:2.41:Re: Funwithpi... Help!!! 1s

    You had equations? When I was in school, all we had
    were a few pebbles.At least pebbles are edible. We'd wish we had a few pebbles.
    DEs are highly poisonous you know ;-)

    kind regards,

    Jos

  • RELEVANCY SCORE 2.41

    DB:2.41:Windows Update Failer 2 Windows Updates Contuinely Fail To Install. 78


    TWO WINDOWS UPDATES CONTUINELYFAILTO INSTALL. THOW DOWNLOADED

    DB:2.41:Windows Update Failer 2 Windows Updates Contuinely Fail To Install. 78

    Hi,
    1 Which updates are they?
    2 How and from where did you download those updates?
    3 Do you receive any error message? If yes then post back the same.
    Refer the following article which might help you in troubleshooting this issue.
    You cannot install some updates or programs
    http://support.microsoft.com/kb/822798
    Unable to install Windows updates
    http://support.microsoft.com/kb/555461
    How to troubleshoot common Windows Update, Microsoft Update, and Windows Server Update Services installation issues
    http://support.microsoft.com/kb/906602
    You cannot install updates from Windows Update, Microsoft Update, or by using Automatic Update after a repair install of Windows XP or after you install Windows XP SP3 immediately after a clean install of Windows XP SP2
    http://support.microsoft.com/kb/943144

  • RELEVANCY SCORE 2.41

    DB:2.41:Security Opdates Failer as


    Har efterhånden 13 vigtige opdateringer, der failer - selv om de tilsyneladende står og installerer en efter en. Jeg har forsøgt at installere de ældste enkeltvis først - og jeg har fulgt anvisningerne i fejlkode 80070643, der er den hyppigste, herunder
    en reparation af .NET framework. Hvad gør man så?

    DB:2.41:Security Opdates Failer as

    Du kan få gratis hjælp til Windows Update ved at ringe til Microsoft Teknisk Support på 82 33 31 00 og så trykker du 2 og 2 i menuen.