• RELEVANCY SCORE 3.81

    DB:3.81:[Help]Problem With Bmd Simulation k9





    I meet a problem when I simulate the DMA free_ware.

    Here is the excerpt of the Modelsim log showing the errors at elaboration time :

    do simulate_mti.do

    # ** Warning: (vlib-34) Library already exists at "work".# Reading D:\modeltech_6.4d\win32/../modelsim.ini# "work" maps to directory work. (Default mapping)# Model Technology ModelSim SE vlog 6.4d Compiler 2009.03 Mar 16 2009# -- Compiling module boardx04# -- Compiling module sys_clk_gen# -- Compiling module sys_clk_gen_ds# -- Compiling module BMD# -- Compiling module BMD_64_RX_ENGINE# -- Compiling module BMD_64_TX_ENGINE# -- Compiling module BMD_EP_MEM_ACCESS# -- Compiling module BMD_EP_MEM# -- Compiling module BMD_EP# -- Compiling module BMD_INTR_CTRL# -- Compiling module BMD_TO_CTRL# -- Compiling module xilinx_pci_exp_4_lane_ep# -- Compiling module endpoint_blk_plus_v1_5# -- Compiling module glbl# -- Compiling module pci_exp_64b_app# -- Compiling module xilinx_pci_exp_4_lane_downstream_port# -- Compiling module xilinx_pci_exp_4_lane_dsport# -- Compiling module dsport_cfg# -- Compiling module pci_exp_usrapp_rx# -- Compiling module pci_exp_usrapp_tx# -- Compiling module pci_exp_usrapp_com# -- Compiling module pci_exp_usrapp_cfg# -- Compiling module pci_exp_4_lane_64b_dsport# -- Scanning library directory 'D:\Xilinx\10.1\ISE/verilog/src/simprims'# -- Scanning library directory 'D:\Xilinx\10.1\ISE/verilog/src/unisims'# -- Compiling module IBUFDS# -- Compiling module IBUF# -- Compiling module VCC# -- Compiling module GND# -- Compiling module INV# -- Compiling module LUT5# -- Compiling module LUT3# -- Compiling module LUT4# -- Compiling module FDR# -- Compiling module LUT2# -- Compiling module LUT6# -- Compiling module FDC# -- Compiling module FDCE# -- Compiling module FDP# -- Compiling module BUFG# -- Compiling module PLL_ADV# -- Compiling module PCIE_INTERNAL_1_1# -- Compiling module RAMB36_EXP# -- Compiling module RAMB36SDP_EXP# -- Compiling module FDRE# -- Compiling module GTP_DUAL# -- Compiling module LDP_1# -- Compiling module FD# -- Compiling module FDE# -- Compiling module SRLC16E# -- Compiling module MUXF7# -- Compiling module FDRS# -- Compiling module LUT1# -- Compiling module FDRSE# -- Compiling module FDS# -- Compiling module FDSE# -- Compiling module MUXCY# -- Compiling module XORCY# -- Compiling module RAM32X1D# -- Compiling module GT11CLK_MGT# -- Compiling module OBUF# -- Compiling module LUT4_L# -- Compiling module LUT1_L# -- Compiling module LUT2_L# -- Compiling module LUT3_L# -- Compiling module MUXF5# -- Compiling module FDPE# -- Compiling module BUF# -- Compiling module DCM_ADV# -- Compiling module dcm_adv_clock_divide_by_2# -- Compiling module dcm_adv_maximum_period_check# -- Compiling module dcm_adv_clock_lost# -- Compiling module BUFGMUX_VIRTEX4# -- Compiling module MUXCY_L# -- Compiling module SRLC16# -- Compiling module SRL16# -- Compiling module GT11# -- Compiling module RAM16X1D# -- Compiling module SRL16E# -- Compiling module RAMB16_S18_S18# -- Compiling module MULT_AND# -- Compiling module MUXF6# -- Compiling module ARAMB36_INTERNAL# -- Compiling module BUFGCTRL# -- Scanning library directory 'D:\Xilinx\10.1\ISE/smartmodel/nt/wrappers/mtiverilog'# -- Compiling module PCIE_INTERNAL_1_1_SWIFT# -- Compiling module GTP_DUAL_FAST# -- Compiling module GTP_DUAL_SWIFT# -- Compiling module GT11_SWIFT# -- Compiling module PCIE_INTERNAL_1_1_SWIFT_BIT# -- Compiling module GTP_DUAL_FAST_BIT# -- Compiling module GTP_DUAL_SWIFT_BIT# -- Compiling module GT11_SWIFT_BIT# # Top level modules:# boardx04# glbl# vsim +notimingchecks +TESTNAME=sample_smoke_test0 -L work work.boardx04 glbl # ** Note: (vsim-3813) Design is being optimized due to module recompilation...# ** Note: (vsim-3865) Due to PLI being present, full design access is being specified.# Loading D:\Xilinx\10.1\ISE\smartmodel\nt\installed_nt/lib/pcnt.lib/swiftpli_mti.dll# Loading work.boardx04(fast)# Loading work.xilinx_pci_exp_4_lane_ep(fast)# Loading work.IBUFDS(fast)# Loading work.IBUF(fast)# Loading work.pci_exp_64b_app(fast)# Loading work.BMD(fast)# Loading work.BMD_EP(fast)# Loading work.BMD_EP_MEM_ACCESS(fast)# Loading work.BMD_EP_MEM(fast)# Loading work.BMD_64_RX_ENGINE(fast)# Loading work.BMD_64_TX_ENGINE(fast)# Loading work.BMD_INTR_CTRL(fast)# Loading work.BMD_TO_CTRL(fast)# Loading work.endpoint_blk_plus_v1_5(fast)# Loading work.VCC(fast)# Loading work.GND(fast)# Loading work.INV(fast)# Loading work.LUT5(fast)# Loading work.LUT3(fast)# Loading work.LUT4(fast)# Loading work.FDR(fast)# Loading work.LUT2(fast)# Loading work.LUT6(fast)# Loading work.LUT2(fast__1)# Loading work.LUT2(fast__2)# Loading work.LUT2(fast__3)# Loading work.LUT2(fast__4)# Loading work.FDC(fast)# Loading work.FDCE(fast)# Loading work.FDP(fast)# Loading work.BUFG(fast)# Loading work.PLL_ADV(fast)# Loading work.PCIE_INTERNAL_1_1(fast)# Loading work.PCIE_INTERNAL_1_1_SWIFT(fast)# Loading work.PCIE_INTERNAL_1_1_SWIFT_BIT(fast)# Loading work.RAMB36_EXP(fast)# Loading work.ARAMB36_INTERNAL(fast)# Loading work.RAMB36SDP_EXP(fast)# Loading work.ARAMB36_INTERNAL(fast__1)# Loading work.FDRE(fast)# Loading work.GTP_DUAL(fast)# Loading work.GTP_DUAL_FAST(fast)# Loading work.GTP_DUAL_FAST_BIT(fast)# Loading work.GTP_DUAL(fast__1)# Loading work.LDP_1(fast)# Loading work.FD(fast)# Loading work.FD(fast__1)# Loading work.FDE(fast)# Loading work.SRLC16E(fast)# Loading work.MUXF7(fast)# Loading work.RAMB36SDP_EXP(fast__1)# Loading work.ARAMB36_INTERNAL(fast__2)# Loading work.LUT2(fast__5)# Loading work.LUT2(fast__6)# Loading work.FDRS(fast)# Loading work.LUT1(fast)# Loading work.FDRSE(fast)# Loading work.FDS(fast)# Loading work.LUT2(fast__7)# Loading work.FDSE(fast)# Loading work.FDRSE(fast__1)# Loading work.FDE(fast__1)# Loading work.MUXCY(fast)# Loading work.XORCY(fast)# Loading work.FDSE(fast__1)# Loading work.RAM32X1D(fast)# Loading work.xilinx_pci_exp_4_lane_downstream_port(fast)# Loading work.xilinx_pci_exp_4_lane_dsport(fast)# Loading work.GT11CLK_MGT(fast)# Loading work.OBUF(fast)# Loading work.pci_exp_4_lane_64b_dsport(fast)# Loading work.LUT1(fast__1)# Loading work.LUT2(fast__8)# Loading work.LUT4_L(fast)# Loading work.LUT1_L(fast)# Loading work.LUT2_L(fast)# Loading work.LUT2_L(fast__1)# Loading work.LUT2_L(fast__2)# Loading work.LUT3_L(fast)# Loading work.LUT2(fast__9)# Loading work.MUXF5(fast)# Loading work.LUT2_L(fast__3)# Loading work.LUT2_L(fast__4)# Loading work.LUT2_L(fast__5)# Loading work.FDPE(fast)# Loading work.BUF(fast)# Loading work.DCM_ADV(fast)# Loading work.dcm_adv_clock_divide_by_2(fast)# Loading work.dcm_adv_maximum_period_check(fast)# Loading work.dcm_adv_maximum_period_check(fast__1)# Loading work.dcm_adv_clock_lost(fast)# Loading work.BUFGMUX_VIRTEX4(fast)# Loading work.BUFGCTRL(fast)# Loading work.MUXCY_L(fast)# Loading work.LUT2_L(fast__6)# Loading work.SRLC16(fast)# Loading work.SRL16(fast)# Loading work.LUT1_L(fast__1)# Loading work.GT11(fast)# Loading work.GT11_SWIFT(fast)# Loading work.GT11_SWIFT_BIT(fast)# Loading work.GT11(fast__1)# Loading work.GT11(fast__2)# Loading work.LUT2_L(fast__7)# Loading work.RAM16X1D(fast)# Loading work.LUT2_L(fast__8)# Loading work.LUT2_L(fast__9)# Loading work.SRL16E(fast)# Loading work.RAMB16_S18_S18(fast)# Loading work.MULT_AND(fast)# Loading work.MUXF6(fast)# Loading work.dsport_cfg(fast)# Loading work.pci_exp_usrapp_rx(fast)# Loading work.pci_exp_usrapp_tx(fast)# Loading work.pci_exp_usrapp_cfg(fast)# Loading work.pci_exp_usrapp_com(fast)# Loading work.sys_clk_gen_ds(fast)# Loading work.sys_clk_gen(fast)# Loading work.sys_clk_gen_ds(fast__1)# Loading work.sys_clk_gen(fast__1)# Loading work.glbl(fast)# ** Warning: (vsim-PLI-3003) ../board.v(123): [TOFD] - System task or function '$fsdbDumpfile' is not defined.# Region: /boardx04# ** Warning: (vsim-PLI-3003) ../board.v(124): [TOFD] - System task or function '$fsdbDumpvars' is not defined.# Region: /boardx04# ** Warning: (vsim-3015) D:/Xilinx/10.1/ISE/verilog/src/unisims/GTP_DUAL.v(3488): [PCDPC] - Port size (9 or 9) does not match connection size (12) for port 'SIM_PLL_PERDIV2'.# Region: /boardx04/xilinx_pci_exp_4_lane_ep/ep/\BU2/U0/pcie_ep0/pcie_blk/SIO/.pcie_gt_wrapper_i/GTD[2].GT_i /genblk1/gtp_dual_fast_1# ** Warning: (vsim-3015) D:/Xilinx/10.1/ISE/verilog/src/unisims/GTP_DUAL.v(3488): [PCDPC] - Port size (9 or 9) does not match connection size (12) for port 'SIM_PLL_PERDIV2'.# Region: /boardx04/xilinx_pci_exp_4_lane_ep/ep/\BU2/U0/pcie_ep0/pcie_blk/SIO/.pcie_gt_wrapper_i/GTD[0].GT_i /genblk1/gtp_dual_fast_1# ** Warning: (vsim-3015) ../dsport/xilinx_pci_exp_dsport.v(551): [PCDPC] - Port size (5 or 5) does not match connection size (3) for port 'trn_tbuf_av'.# Region: /boardx04/xilinx_pci_exp_4_lane_downstream_port/xilinx_pci_exp_4_lane_dsport/pci_exp_4_lane_64b_dsport# Runtime, LMTV v12.4# Copyright (c) 1984-2009 Synopsys Inc. ALL RIGHTS RESERVED# You can use the Browser tool to configure the SmartModel# Library and access information about SmartModels:# $LMC_HOME/bin/sl_browser# # SmartModel product documentation is available here:# $LMC_HOME/doc/smartmodel/manuals/intro.pdf# http://www.synopsys.com/products/lm/doc/smartmodel.html# # (LMTV) (3006)Error: Model named 'PCIE_INTERNAL_1_1_SWIFT' was not installed at $LMC_HOME/models/PCIE_INTERNAL_1_1_SWIFT for this platform - # $lm_model failed to find model. Verify that instance path is correct.# (LMTV) (3006)Error: Model named 'GTP_DUAL_FAST' was not installed at $LMC_HOME/models/GTP_DUAL_FAST for this platform - # $lm_model failed to find model. Verify that instance path is correct.# (LMTV) (3006)Error: Model named 'GTP_DUAL_FAST' was not installed at $LMC_HOME/models/GTP_DUAL_FAST for this platform - # $lm_model failed to find model. Verify that instance path is correct.# Model gt11_swift: Model Vendor: xilinx'.# Running test {sample_smoke_test0}......# [ 0] : System Reset Asserted...# [ 4995000] : System Reset De-asserted...# [ 8522100] : Transaction Reset Is De-asserted...# Break key hit

    I have changed the file modelsim.ini and comipled the library with the following command:

    compxlib -s mti_se -arch all -lib all -l verilog -w

    but'PCIE_INTERNAL_1_1_SWIFT' and 'GTP_DUAL_FAST' arenot appear in the model list, andsome models are lost too. WHY?

    How to correct the errors? Please help!
    Message Edited by hithust on 06-08-2009 08:51 PMMessage Edited by hithust on 06-09-2009 12:34 AMMessage Edited by hithust on 06-09-2009 01:39 AM

    DB:3.81:[Help]Problem With Bmd Simulation k9


    I don't believe that Modelsim supports SmartModels in 6.4.

    When you use secureip, make sure to add the reference to the library in your vsim command:

    vsim +notimingchecks +TESTNAME=sample_smoke_test0 -L secureip -L work work.boardx04 glbl

  • RELEVANCY SCORE 3.59

    DB:3.59:Having Trouble Compiling kj




    Im having trouble compiling my fist java program. I downloaded the sdk and when I try to compile it in MSDOS Prompt i open the directory my file is saved in and type:

    javac HelloWorld.java

    Then it says:

    Bad command or file name

    I need help learning how to compile the programs.

    Email me at tazrockon@rock.com

    DB:3.59:Having Trouble Compiling kj

    the link for my new trouble is

    http://forum.java.sun.com/thread.jsp?forum=54thread=297773

  • RELEVANCY SCORE 3.39

    DB:3.39:Can't View Purchased Tv Programs On Apple Tv 89


    I used to be able to view TV programs purchased on Itunes on apple TV however I have had a problem with them just "loading and loading" and nothing happening - I can see them through the computer icon but not through the purchased where I have always viewed them! Help

    DB:3.39:Can't View Purchased Tv Programs On Apple Tv 89

    Yes started everything but still no go - I did an update on the tv for apple tv so not sure if that has something to do with it?

  • RELEVANCY SCORE 3.27

    DB:3.27:Programs Not Loading, Just Getting White Box jk



    I used sky go for a few weeks with no problems, but recently when I have tried to watch programs, instead of the box usually displaying the programs I have just seen a white box and nothing will load. I tried unregistering the device, but now need to start watching to reregister it, and cannot do so while the programs won't load.

    I am using a mac, and have silverlight installed. Can anyone help?

    DB:3.27:Programs Not Loading, Just Getting White Box jk


    It could be a Silverlight issue so you could try unistallintg it, rebooting your mac and installing silverlight again via the sky go website as you should prompt you to install it again. Be aware though that doing this will remove your mac as a registered device and you might have to wait a month before you can watch something again if doing this fixes this problem.




    __________________________________________________________________________________________.

    If someone has helped you then please click on the LIKES button in their post.
    I do not work for Sky.

  • RELEVANCY SCORE 3.13

    DB:3.13:Compiling To Executables x9


    Am using metrowerks codeWarrior IDE to compile my Java programs. But on compilation I cant seem to find the executable file anywhere. How do I go about it?

    DB:3.13:Compiling To Executables x9

    heard native? u can compile it to jar, then using third party sw, u can compile it to platform dependeetn form such as in exe form! try this

    search "jepack" at www.download.com
    ***shareware

  • RELEVANCY SCORE 3.04

    DB:3.04:Error In Compiling Java Source Code In A Package 3f


    hi all...
    am having a problem in compiling a java source code:
    i have a class named 'Test' in the package 'packone'....
    i have another class named 'getTest' in the same package....
    in the class getTest i am taking a reference to Test class...
    on compiling i am getting the following error....
    cannot resolve symbol
    symbol : class Test
    The source code for the two classes are :

    package packone;
    public class Test{
    }

    and

    package packone;
    public class getTest{
    public void me(){
    Test t = new Test();
    }
    }

    i have included the directory path in the classpath....
    still its not compiling .....
    please help
    thanks....

    DB:3.04:Error In Compiling Java Source Code In A Package 3f

    Assume the current directory structure:
    C:\
    C:\packone...and that your classes are named Test GetTest.

    My guess is that you're compiling within the directory C:\packone using the command "javac GetTest.java", which is wrong; You must use a path corresponding to the package-name.

    Move your command-line cursor to C:\ and type "javac packone\GetTest.java" and you'll be fine...

    Regards,

    /Haring;kan

  • RELEVANCY SCORE 3.02

    DB:3.02:Need To Batch Compile 6i Forms In 9i jp


    I have a batch program that will compile libraries, menus forms but I need to have it also report programs that would not compile and I need to have the output in 1 file. We have over 500 forms so I do not want to be opening every .err file that gets created. This is on windows 2000 so the following is what I have in a batch file called compile.bat:
    @echo off
    if "%1" == "" goto ERROR
    REM WINDOWS COMPILE LIBRARIES
    cls
    echo compiling Libraries.....
    for /R %%F in (*.pll) do call ifcmp90 userid=%1 batch=yes module=%%F module_type=library window_state=minimize
    echo Finished compiling Libraries!

    REM WINDOWS COMPILE MENUS
    echo compiling Menus.....
    for /R %%F in (*.mmb) do call ifcmp90 userid=%1 batch=yes module=%%F module_type=menu window_state=minimize
    echo Finished compiling Menus!

    REM WINDOWS COMPILE FORMS
    echo compiling Forms.....
    for /R %%F in (*.fmb) do call ifcmp90 userid=%1 batch=yes module=%%F module_type=form window_state=minimize
    echo Finished compiling Forms!

    goto EXIT

    :ERROR
    echo Userid/password MUST be supplied!

    pause
    :EXIT
    Can someone help me please? I've been going crazy! Thanks in advance.

    DB:3.02:Need To Batch Compile 6i Forms In 9i jp

    I have a batch program that will compile libraries, menus forms but I need to have it also report programs that would not compile and I need to have the output in 1 file. We have over 500 forms so I do not want to be opening every .err file that gets created. This is on windows 2000 so the following is what I have in a batch file called compile.bat:
    @echo off
    if "%1" == "" goto ERROR
    REM WINDOWS COMPILE LIBRARIES
    cls
    echo compiling Libraries.....
    for /R %%F in (*.pll) do call ifcmp90 userid=%1 batch=yes module=%%F module_type=library window_state=minimize
    echo Finished compiling Libraries!

    REM WINDOWS COMPILE MENUS
    echo compiling Menus.....
    for /R %%F in (*.mmb) do call ifcmp90 userid=%1 batch=yes module=%%F module_type=menu window_state=minimize
    echo Finished compiling Menus!

    REM WINDOWS COMPILE FORMS
    echo compiling Forms.....
    for /R %%F in (*.fmb) do call ifcmp90 userid=%1 batch=yes module=%%F module_type=form window_state=minimize
    echo Finished compiling Forms!

    goto EXIT

    :ERROR
    echo Userid/password MUST be supplied!

    pause
    :EXIT
    Can someone help me please? I've been going crazy! Thanks in advance.

  • RELEVANCY SCORE 3.02

    DB:3.02:Compiling Files k1



    I need help compiling several files on a page under one heading so that only the heading shows, but you can click on the heading and all the files are accessible.

    DB:3.02:Compiling Files k1


    And that is supposed to be what...? A web site? A PDF? A PDF Portfolio? Something completely different? You need to provide a lot more info. If you mean a flyout menu on a web page, ask in the Dreamweaver or other web forums. If it's PDF, ask in the Acro forum.

    Mylenium

  • RELEVANCY SCORE 2.97

    DB:2.97:Error:Edk:369 - Make Failed For Target "Libs" d9



    Running libs - 'make -s libs "COMPILER=arm-xilinx-eabi-gcc""ARCHIVER=arm-xilinx-eabi-ar" "COMPILER_FLAGS= -O2 -c""EXTRA_COMPILER_FLAGS=-g"'."Compiling common"arm-xilinx-eabi-ar: creating ../../../lib/libxil.a"Compiling xadc""Compiling standalone""Compiling axidma"xaxidma_bdring.c: In function 'XAxiDma_BdRingToHw':xaxidma_bdring.c:1068:2: error: 'DATA_SYNC' undeclared (first use in this function)xaxidma_bdring.c:1068:2: note: each undeclared identifier is reported only once for each function it appears inmake[1]: *** [libs]"Compiling iic""Compiling axivdma""Compiling devcfg""Compiling dmaps""Compiling emacps""Compiling gpiops""Compiling iicps""Compiling qspips""Compiling scugic""Compiling scutimer""Compiling scuwdt""Compiling ttcps""Compiling uartps""Compiling usbps""Compiling cpu_cortexa9"ERROR:EDK:369 - make failed for target "libs" ERROR:EDK:3418 - Error(s) while running make.make: *** [ps7_cortexa9_0/lib/libxil.a]

    I build a Planhead project using ISE14.3, and export the .bit file to SDK, so comes there two errors.

    The reason of the first error may be the 'DATA_SYNC',it is automatically generated, but I donot know why this error happened.Maybe inxaxidma_bdring.c: In function 'XAxiDma_BdRingToHw', there is something wrong.

    How about the second error?

    I found

    in the directory 'lib' filefolder, i cannot find 'libxil.a'.

    So thank you for your help.

    DB:2.97:Error:Edk:369 - Make Failed For Target "Libs" d9


    Running libs - 'make -s libs "COMPILER=arm-xilinx-eabi-gcc""ARCHIVER=arm-xilinx-eabi-ar" "COMPILER_FLAGS= -O2 -c""EXTRA_COMPILER_FLAGS=-g"'."Compiling common"arm-xilinx-eabi-ar: creating ../../../lib/libxil.a"Compiling xadc""Compiling standalone""Compiling axidma"xaxidma_bdring.c: In function 'XAxiDma_BdRingToHw':xaxidma_bdring.c:1068:2: error: 'DATA_SYNC' undeclared (first use in this function)xaxidma_bdring.c:1068:2: note: each undeclared identifier is reported only once for each function it appears inmake[1]: *** [libs]"Compiling iic""Compiling axivdma""Compiling devcfg""Compiling dmaps""Compiling emacps""Compiling gpiops""Compiling iicps""Compiling qspips""Compiling scugic""Compiling scutimer""Compiling scuwdt""Compiling ttcps""Compiling uartps""Compiling usbps""Compiling cpu_cortexa9"ERROR:EDK:369 - make failed for target "libs" ERROR:EDK:3418 - Error(s) while running make.make: *** [ps7_cortexa9_0/lib/libxil.a]

    I build a Planhead project using ISE14.3, and export the .bit file to SDK, so comes there two errors.

    The reason of the first error may be the 'DATA_SYNC',it is automatically generated, but I donot know why this error happened.Maybe inxaxidma_bdring.c: In function 'XAxiDma_BdRingToHw', there is something wrong.

    How about the second error?

    I found

    in the directory 'lib' filefolder, i cannot find 'libxil.a'.

    So thank you for your help.

  • RELEVANCY SCORE 2.95

    DB:2.95:Edk Compiling And Building Problem zs



    hi everyone,

    can any one tell me abt how to fix these errors as i click to build the project in edk or i try to generate libraries

    "There appears to be a conflict in the Cygwin DLLs loaded in memory. Please close all Cygwin-based programs, and launch EDK Shell again"

    urgent help required

    how to remove this error?

    which programs are cygwin-based programs and how to detect them

    Thanks in advance







    Solved!
    Go to Solution.

    DB:2.95:Edk Compiling And Building Problem zs


    thank god i have solved this problem.

    i just changed my antivirus bitdefender internet security to game mode and edk started to respond.

    Now i am happy and playing with edk.

  • RELEVANCY SCORE 2.94

    DB:2.94:11gr2 Installation Hanging At Step 7 During Processing Oracle Text 11.2.0. 38


    Hi,

    I am trying to install 11gr2 software on my linux 64 bit server.
    I had installled the same 11gr2 software successfully on the same server without any issues.

    Now i want another oracle home. But the installation is hanging at step 7, 8% was completed.

    The details tab showing

    Verifying whether Central Inventory is locked by any other OUI session...
    Central Inventory is not locked.
    Loading products list. Please wait.
    Loading products. Please wait.
    Analyzing dependencies
    Setting up install types
    Executing pre-requisites
    Loading Oracle Database 11g
    Loading Enterprise Edition Options
    Loading Oracle Partitioning
    Loading Oracle Spatial
    Loading Oracle OLAP
    Loading Oracle Database 11g
    Loading Oracle Net Services
    Loading Oracle Text
    Loading Oracle Net Listener
    Loading Oracle Enterprise Manager Console DB
    Loading HAS Files for DB
    Loading Oracle Internet Directory Client
    Loading Oracle Advanced Security
    Loading Oracle JVM
    Loading Oracle XML Development Kit
    Loading Database Configuration and Upgrade Assistants
    Loading Oracle Net
    Loading Oracle Multimedia
    Loading Oracle Multimedia Locator
    Loading Oracle Call Interface (OCI)
    Loading SQL*Plus
    Loading Oracle Netca Client
    Loading Enterprise Manager Agent
    Loading Oracle Database Utilities
    Loading Oracle Programmer
    Loading Oracle Database Gateway for ODBC
    Loading Generic Connectivity Common Files
    Loading PL/SQL
    Loading Oracle Recovery Manager
    Loading Assistant Common Files
    Loading Buildtools Common Files
    Loading Oracle LDAP administration
    Loading Oracle Help for the Web
    Loading Installation Common Files
    Loading Precompiler Common Files
    Loading HAS Common Files
    Loading Enterprise Manager plugin Common Files
    Loading Oracle UIX
    Loading Oracle Clusterware RDBMS Files
    Loading Cluster Verification Utility Common Files
    Loading Oracle Wallet Manager
    Loading Oracle Security Developer Tools
    Loading XML Parser for Java
    Loading Enterprise Manager Minimal Integration
    Loading Oracle Notification Service
    Loading Oracle Database User Interface
    Loading Oracle ODBC Driver
    Loading SQL*Plus Files for Instant Client
    Loading Required Support Files
    Loading Oracle Globalization Support
    Loading Database SQL Scripts
    Loading OLAP SQL Scripts
    Loading PL/SQL Embedded Gateway
    Loading Oracle Locale Builder
    Loading Character Set Migration Utility
    Loading Oracle Java Client
    Loading Oracle Multimedia Client Option
    Loading Oracle JDBC/THIN Interfaces
    Loading Oracle Universal Connection Pool
    Loading Secure Socket Layer
    Loading Oracle Net Required Support Files
    Loading Oracle Code Editor
    Loading Oracle Containers for Java
    Loading JAccelerator (COMPANION)
    Loading Perl Interpreter
    Loading Oracle Quality of Service Management (Client)
    Loading Deinstallation Tool
    Loading Perl Modules
    Loading Enterprise Manager Common Files
    Loading Installation Plugin Files
    Loading Expat libraries
    Loading XML Parser for Oracle JVM
    Loading Oracle XML Query
    Loading Oracle Message Gateway Common Files
    Loading Oracle Starter Database
    Loading Sample Schema Data
    Loading Oracle Help For Java
    Loading Oracle Core Required Support Files
    Loading Oracle Multimedia Locator RDBMS Files
    Loading Oracle JDBC/OCI Instant Client
    Loading Oracle Multimedia Annotator
    Loading Oracle Multimedia Java Advanced Imaging
    Loading Oracle Database 11g Multimedia Files
    Loading Precompiler Required Support Files
    Loading Oracle Text Required Support Files
    Loading Oracle Notification Service (eONS)
    Loading Oracle 11g Warehouse Builder Required Files
    Loading Parser Generator Required Support Files
    Loading regexp
    Loading Agent Required Support Files
    Loading Enterprise Manager Agent Core Files
    Loading Enterprise Manager Common Core Files
    Loading Enterprise Manager Grid Control Core Files
    Loading Enterprise Manager Database Plugin -- Agent Support
    Loading Enterprise Manager Repository Core Files
    Loading Enterprise Manager Database Plugin -- Repository Support
    Loading Provisioning Advisor Framework
    Loading Exadata Storage Server
    Loading Oracle Globalization Support
    Loading RDBMS Required Support Files
    Loading Database Workspace Manager
    Loading SQLJ Runtime
    Loading RDBMS Required Support Files for Instant Client
    Loading XDK Required Support Files
    Loading Oracle Application Express
    Loading Oracle SQL Developer
    Loading Oracle JDBC Server Support Package
    Loading Oracle Ice Browser
    Loading Oracle Display Fonts
    Loading SQL*Plus Required Support Files
    Loading Oracle RAC Required Support Files-HAS
    Loading Oracle Database Vault option
    Loading Platform Required Support Files
    Loading Oracle OLAP API
    Loading Oracle OLAP RDBMS Files
    Loading Oracle Data Mining RDBMS Files
    Loading Oracle Label Security
    Loading Oracle Database Vault J2EE Application
    Loading Oracle Real Application Testing
    Loading Oracle JFC Extended Windowing Toolkit
    Loading Oracle Extended Windowing Toolkit
    Loading Bali Share
    Loading SSL Required Support Files for InstantClient
    Loading LDAP Required Support Files
    Loading Oracle ODBC Driverfor Instant Client
    Loading Oracle Configuration Manager
    Loading Oracle Database Deconfiguration
    Loading Oracle RAC Deconfiguration
    Loading Oracle DBCA Deconfiguration
    Loading Oracle Configuration Manager Deconfiguration
    Loading Oracle Universal Installer
    Loading Oracle One-Off Patch Installer
    Loading Installer SDK Component
    Loading Sun JDK
    Loading dialogs for Oracle Database 11g
    Loading dialogs for Enterprise Edition Options
    Loading dialogs for Oracle Partitioning
    Loading dialogs for Oracle Spatial
    Loading dialogs for Oracle OLAP
    Loading dialogs for Oracle Database 11g
    Loading dialogs for Oracle Net Services
    Loading dialogs for Oracle Text
    Loading dialogs for Oracle Net Listener
    Loading dialogs for Oracle Enterprise Manager Console DB
    Loading dialogs for HAS Files for DB
    Loading dialogs for Oracle Internet Directory Client
    Loading dialogs for Oracle Advanced Security
    Loading dialogs for Oracle JVM
    Loading dialogs for Oracle XML Development Kit
    Loading dialogs for Database Configuration and Upgrade Assistants
    Loading dialogs for Oracle Net
    Loading dialogs for Oracle Multimedia
    Loading dialogs for Oracle Multimedia Locator
    Loading dialogs for Oracle Call Interface (OCI)
    Loading dialogs for SQL*Plus
    Loading dialogs for Oracle Netca Client
    Loading dialogs for Enterprise Manager Agent
    Loading dialogs for Oracle Database Utilities
    Loading dialogs for Oracle Programmer
    Loading dialogs for Oracle Database Gateway for ODBC
    Loading dialogs for Generic Connectivity Common Files
    Loading dialogs for PL/SQL
    Loading dialogs for Oracle Recovery Manager
    Loading dialogs for Assistant Common Files
    Loading dialogs for Buildtools Common Files
    Loading dialogs for Oracle LDAP administration
    Loading dialogs for Oracle Help for the Web
    Loading dialogs for Installation Common Files
    Loading dialogs for Precompiler Common Files
    Loading dialogs for HAS Common Files
    Loading dialogs for Enterprise Manager plugin Common Files
    Loading dialogs for Oracle UIX
    Loading dialogs for Oracle Clusterware RDBMS Files
    Loading dialogs for Cluster Verification Utility Common Files
    Loading dialogs for Oracle Wallet Manager
    Loading dialogs for Oracle Security Developer Tools
    Loading dialogs for XML Parser for Java
    Loading dialogs for Enterprise Manager Minimal Integration
    Loading dialogs for Oracle Notification Service
    Loading dialogs for Oracle Database User Interface
    Loading dialogs for Oracle ODBC Driver
    Loading dialogs for SQL*Plus Files for Instant Client
    Loading dialogs for Required Support Files
    Loading dialogs for Oracle Globalization Support
    Loading dialogs for Database SQL Scripts
    Loading dialogs for OLAP SQL Scripts
    Loading dialogs for PL/SQL Embedded Gateway
    Loading dialogs for Oracle Locale Builder
    Loading dialogs for Character Set Migration Utility
    Loading dialogs for Oracle Java Client
    Loading dialogs for Oracle Multimedia Client Option
    Loading dialogs for Oracle JDBC/THIN Interfaces
    Loading dialogs for Oracle Universal Connection Pool
    Loading dialogs for Secure Socket Layer
    Loading dialogs for Oracle Net Required Support Files
    Loading dialogs for Oracle Code Editor
    Loading dialogs for Oracle Containers for Java
    Loading dialogs for JAccelerator (COMPANION)
    Loading dialogs for Perl Interpreter
    Loading dialogs for Oracle Quality of Service Management (Client)
    Loading dialogs for Deinstallation Tool
    Loading dialogs for Perl Modules
    Loading dialogs for Enterprise Manager Common Files
    Loading dialogs for Installation Plugin Files
    Loading dialogs for Expat libraries
    Loading dialogs for XML Parser for Oracle JVM
    Loading dialogs for Oracle XML Query
    Loading dialogs for Oracle Message Gateway Common Files
    Loading dialogs for Oracle Starter Database
    Loading dialogs for Sample Schema Data
    Loading dialogs for Oracle Help For Java
    Loading dialogs for Oracle Core Required Support Files
    Loading dialogs for Oracle Multimedia Locator RDBMS Files
    Loading dialogs for Oracle JDBC/OCI Instant Client
    Loading dialogs for Oracle Multimedia Annotator
    Loading dialogs for Oracle Multimedia Java Advanced Imaging
    Loading dialogs for Oracle Database 11g Multimedia Files
    Loading dialogs for Precompiler Required Support Files
    Loading dialogs for Oracle Text Required Support Files
    Loading dialogs for Oracle Notification Service (eONS)
    Loading dialogs for Oracle 11g Warehouse Builder Required Files
    Loading dialogs for Parser Generator Required Support Files
    Loading dialogs for regexp
    Loading dialogs for Agent Required Support Files
    Loading dialogs for Enterprise Manager Agent Core Files
    Loading dialogs for Enterprise Manager Common Core Files
    Loading dialogs for Enterprise Manager Grid Control Core Files
    Loading dialogs for Enterprise Manager Database Plugin -- Agent Support
    Loading dialogs for Enterprise Manager Repository Core Files
    Loading dialogs for Enterprise Manager Database Plugin -- Repository Support
    Loading dialogs for Provisioning Advisor Framework
    Loading dialogs for Exadata Storage Server
    Loading dialogs for Oracle Globalization Support
    Loading dialogs for RDBMS Required Support Files
    Loading dialogs for Database Workspace Manager
    Loading dialogs for SQLJ Runtime
    Loading dialogs for RDBMS Required Support Files for Instant Client
    Loading dialogs for XDK Required Support Files
    Loading dialogs for Oracle Application Express
    Loading dialogs for Oracle SQL Developer
    Loading dialogs for Oracle JDBC Server Support Package
    Loading dialogs for Oracle Ice Browser
    Loading dialogs for Oracle Display Fonts
    Loading dialogs for SQL*Plus Required Support Files
    Loading dialogs for Oracle RAC Required Support Files-HAS
    Loading dialogs for Oracle Database Vault option
    Loading dialogs for Platform Required Support Files
    Loading dialogs for Oracle OLAP API
    Loading dialogs for Oracle OLAP RDBMS Files
    Loading dialogs for Oracle Data Mining RDBMS Files
    Loading dialogs for Oracle Label Security
    Loading dialogs for Oracle Database Vault J2EE Application
    Loading dialogs for Oracle Real Application Testing
    Loading dialogs for Oracle JFC Extended Windowing Toolkit
    Loading dialogs for Oracle Extended Windowing Toolkit
    Loading dialogs for Bali Share
    Loading dialogs for SSL Required Support Files for InstantClient
    Loading dialogs for LDAP Required Support Files
    Loading dialogs for Oracle ODBC Driverfor Instant Client
    Loading dialogs for Oracle Configuration Manager
    Loading dialogs for Oracle Database Deconfiguration
    Loading dialogs for Oracle RAC Deconfiguration
    Loading dialogs for Oracle DBCA Deconfiguration
    Loading dialogs for Oracle Configuration Manager Deconfiguration
    Loading dialogs for Oracle Universal Installer
    Loading dialogs for Oracle One-Off Patch Installer
    Loading dialogs for Installer SDK Component
    Loading dialogs for Sun JDK
    Processing Oracle Database 11g 11.2.0.1.0
    Processing Enterprise Edition Options 11.2.0.1.0
    Processing Oracle Partitioning 11.2.0.1.0
    Processing Oracle Spatial 11.2.0.1.0
    Processing Oracle OLAP 11.2.0.1.0
    Processing Oracle Database 11g 11.2.0.1.0
    Processing Oracle Net Services 11.2.0.1.0
    Processing Oracle Text 11.2.0.1.0

    Thanks,
    Kavitha

    DB:2.94:11gr2 Installation Hanging At Step 7 During Processing Oracle Text 11.2.0. 38

    Hello Expert,

    The issue was an OS issue.

    Just rebooting the server solved the issue. It is not conflicting with the old Oracle Home.

    I raised any SR for this issue.
    Metalink people confirmed that it is an OS issue and no mistake in the install procedure.

    Thanks a lot for your help.

  • RELEVANCY SCORE 2.94

    DB:2.94:Paktahn Wont Build 1k



    Good evening there.

    I am having an issue building paktahn (AUR package) from tarball; a debugger appears showing:
    ; compiling file /home/kakb/src/clbuild.paktahn/source/cl-store/sbcl/custom.lisp (written 12 AUG 2009 03:38:32 AM):
    ; compiling (IN-PACKAGE :CL-STORE)
    ; compiling (DEFUN CREATE-FLOAT-VALUES ...)
    ; compiling (DEFSTORE-CL-STORE (OBJ STRUCTURE-OBJECT ...) ...)
    ; compiling (DEFRESTORE-CL-STORE (STRUCTURE-OBJECT STREAM) ...)
    ; compiling (DEFUN GET-LAYOUT ...)
    ; compiling (DEFUN GET-INFO ...)
    ; compiling (DEFUN DD-NAME ...)
    ; compiling (DEFVAR *SBCL-STRUCT-INHERITS* ...)
    ; compiling (DEFSTRUCT (STRUCT-DEF #) ...)
    ; compiling (DEFUN INFO-OR-DIE ...)
    ; compiling (DEFUN SAVE-ABLE-SUPERS ...)
    ; compiling (DEFUN GET-SUPERS ...)
    ; compiling (DEFSTORE-CL-STORE (OBJ STRUCTURE-CLASS ...) ...)
    ; compiling (DEFSTORE-CL-STORE (OBJ STRUCT-DEF ...) ...);
    ; caught ERROR:
    ; READ error during COMPILE-FILE:
    ;
    ; Lock on package SB-KERNEL violated when interning CLASS-METHOD-DEFINITIONS
    ; while in package CL-STORE.
    ; See also:
    ; The SBCL Manual, Node Package Locks
    ;
    ; (in form starting at line: 76, column: 41, file-position: 2419)

    ; compilation aborted after 0:00:00.044

    debugger invoked on a UIOP/LISP-BUILD:COMPILE-FILE-ERROR in thread
    #THREAD main thread RUNNING {1003016D83}:
    COMPILE-FILE-ERROR while compiling #NON-REQUIRED-FILE cl-store custom

    Type HELP for debugger help, or (SB-EXT:EXIT) to exit from SBCL.

    restarts (invokable by number or by possibly-abbreviated name):
    0: [RETRY ] Retry
    compiling #NON-REQUIRED-FILE cl-store custom.
    1: [ACCEPT ] Continue, treating
    compiling #NON-REQUIRED-FILE cl-store custom
    as having been successful.
    2: Retry ASDF operation.
    3: [CLEAR-CONFIGURATION-AND-RETRY] Retry ASDF operation after resetting the
    configuration.
    4: [CONTINUE ] Ignore runtime option --eval (asdf:oos asdf:load-op paktahn).
    5: [ABORT ] Skip rest of --eval and --load options.
    6: Skip to toplevel READ/EVAL/PRINT loop.
    7: [EXIT ] Exit SBCL (calling #EXIT, killing the process).

    (UIOP/LISP-BUILD:CHECK-LISP-COMPILE-RESULTS NIL T T ~/asdf-action::format-action/ ((#ASDF/LISP-ACTION:COMPILE-OP . #CL-STORE.SYSTEM:NON-REQUIRED-FILE cl-store custom)))
    0]

  • RELEVANCY SCORE 2.93

    DB:2.93:S6000-H Source Code Compiling 38


    Using ubuntu 12.04.3 with JDK 6u35 and have the latest Android JDKI have downloaded the source code and installed all the needed programs and set up my PC to compile the code myself but I am now stuck.Is there not a single make file I can use to compile the whole system or does it need to be done in individual parts?Couldnt find a lunchrc file either so unsure on hope to compile it...Any help appreciated



    "You either die a hero, or live long enough to see yourself become the villain!"

    DB:2.93:S6000-H Source Code Compiling 38

    This is all the ReadMe saysexport PATH=~/Your_Toolchain_PATH/for_example/prebuilt/li​nux-x86/toolchain/arm-eabi-4.4.3/bin:$PATHuboot=====TARGET_PRODUCT=lenovo89_tb_twn_s_jb2 make lenovo89_tb_twn_s_jb2_configTARGET_PRODUCT=lenovo89_tb_twn_s_jb2 makekernel======cp mediatek-configs .configTARGET_PRODUCT=lenovo89_tb_twn_s_jb2 MTK_ROOT_CUSTOM=../mediatek/custom make======Contact Lenovo support for information on obtaining Open Source code.



    "You either die a hero, or live long enough to see yourself become the villain!"

  • RELEVANCY SCORE 2.92

    DB:2.92:Polygon Flicker Problem cx


    I'm having a problem that I was hoping someone out there might have an idea about, or at the very least, help me brainstorm possible things to check.

    I'm very nearly finished writing a game demo for a space-based game using Java3D, and I just imported our spaceship models, and for some reason whenever they move (or the view moves) various polygons on them flicker in and out of existence. I replaced them with non-textured (ColoringAttributes only) Spheres, and get the same thing. When a spaceship (or Sphere) passes in front of a planet, you can sort of see both flickering through each other, as though Java3D doesn't know what order to render polygons in.

    Now, what I think is the weirdest part, is that when i create a small program just to experiment with loading the models, that works fine. I've even added planets and backgrounds to it in a failed attempt to reproduce the problems I've been having in the game code. I've experimented with disabling picking, not compiling branch groups, high polygon counts, and everything else that I can think of that is different between the two programs. If you can think of anything that could cause this problem that is even halfway reasonable, please let me know.

    If any of you think that having images up would make it easier to understand what I'm talking about, let me know that too and I can probably swing something.

    DB:2.92:Polygon Flicker Problem cx

    alright, well lets see. My guess is that it has something to do with how you move your view or the objects. Cause you said it occurs when you move. I have a similar problem, which occurs only when I move, but it's only the edge of the model that flickers unsteadily. (I dont' know the solution to mine either lol) In any case, I suggest you re-examine the method in which you move things.

    Maybe an image would help us here on the forums to figure it out. Also, could you describe what you do to move your objects or view?

  • RELEVANCY SCORE 2.92

    DB:2.92:Altivec In C Compiling Problems k8


    Hi! I'm new to c and i dont really know if this thread does belong here. I've tried to compile my AltiVec programs on a dcc compiler but I invariably get a syntax error on the lines where I've used vectors. Am I supposed to include something which I'm not including? Or what could be the problem? Please help.

  • RELEVANCY SCORE 2.91

    DB:2.91:Compiling Classess 7x


    I am trying to reference a GUI class name MQTestGUI and I keep getting the following message
    cannot resolve symbol: class MQTestGUI
    I have realised this problem with all my programs now as I cannot refer to a Class earlier created so I can keep using my classes in other programs. Please help or mail me with an answer on hakeem.abimbola@electrolux.co.uk.

    Regards

    DB:2.91:Compiling Classess 7x

    Thank you so much, I think we finally cracked it. What I did was to create another folder in my jdk bin and lump all the programs there and it seems to be seeing all the classes now. I hope this keeps on working.

    Thank you and God bless
    Regards
    Hakeem

  • RELEVANCY SCORE 2.88

    DB:2.88:X Forwarding Over Ssh f8



    Hi all, Ive been trying to get this working for several days and finally figure that I need some help. I have an Arch box that I use for backups and for compiling large C programs that I recently installed all the X stuff on so that I could get some graphical apps on my Windows box. I thought the setup should be easy, with sshd_config:
    X11Forwarding yes
    X11DisplayOffset 10
    X11UseLocalhost yes

    DB:2.88:X Forwarding Over Ssh f8


    archwade, thats a 4 year old post. I am sure the op fixed it by now or stopped caring.

    Please do not necrobump threads.

    Our policy :: https://wiki.archlinux.org/index.php/Fo … Bumping.22

    Closing...

  • RELEVANCY SCORE 2.88

    DB:2.88:Vmware 2.0.4 And Kernel 2.4.23 Dont' Seem To Mix. sz



    Hi,

    I was successful in compiling the modules and loading them. The problem I am having is the application will not allow me to "power on" a virtual machine because the "kernel is not supported."

    Does anybody know whether this version of vmware can run on this kernel?

    DB:2.88:Vmware 2.0.4 And Kernel 2.4.23 Dont' Seem To Mix. sz


    Look for vmware-any-any-update83, download it and install it.

  • RELEVANCY SCORE 2.88

    DB:2.88:Office 2010 Programs Will Not Start, No Error Messages. 8z


    I downloaded and installed Office 2010. Since installing it, I have never been able to open any of the programs. When I try to open Word, for instance, the loading screen pops up and eventually says its processing, but never actually loads Word. I am
    running Windows 7 64-bit on an Acer Aspire One. I have un-intalled and re-installed the programs, but this did not help. What can I do to fix my problem?

    DB:2.88:Office 2010 Programs Will Not Start, No Error Messages. 8z

    Try to open the Office applications in clean boot and verify the status.
    If the issue persists, reinstall Office 2010.
    Note: After you have finished troubleshooting in clean boot, ensure you restart the computer in normal mode.

  • RELEVANCY SCORE 2.87

    DB:2.87:Problem Compiling Code a3


    I am trying to compile lots of different programs of the net and i keep getting this error : fatal error C1083: Cannot open include file: 'stdlib': No such file or directoryAny help?Cheers

    DB:2.87:Problem Compiling Code a3

    Is this when including a file?
    #include stdlib
    probably should be
    #include stdlib.h
    If that doesn't help you should check that your directory settings point to the correct folder Tools-Options-Project and solutions-VC++ directories (for include)
    Make sure it points to the include directory where you installed VC++
     
     

  • RELEVANCY SCORE 2.86

    DB:2.86:Lenovo Programs Not Loading At Start 8c


    All of the Lenove Thinkvantage programs are no longer loading at startup. (T61, XPSP3)Would it be best if I just downloaded the Lenovo software from the site and then installed it.Any help would be appreciated.They're still on the drive, they were not removed, they do not launch at start.

    DB:2.86:Lenovo Programs Not Loading At Start 8c

    i think at this point it would be more productive for you to reinstall the OS from scratch.



    Regards,Jin LiMay this year, be the year of 'DO'!I am a volunteer, and not a paid staff of Lenovo or Microsoft

  • RELEVANCY SCORE 2.86

    DB:2.86:Programs Not Loading 9x


    HI Programmes will not load, I recently upgraded Silverlight, then downgraded as I understood from the forum that some versions were having problems. I am using Version: 5.1.20913.0 . it worked on my next log in and now I am back to the same problem. Any help gratefully received. Thanks!

    DB:2.86:Programs Not Loading 9x

    Hi howe7711,

    Sorry to hear your having trouble with your viewing.

    Can you please advise; what device are you using? What operating system you are you using? Can you please also confirm if you are being repeatedly asked to to install Silverlight?

    Thanks




    Danielle
    Community Coordinator

  • RELEVANCY SCORE 2.86

    DB:2.86:App Loading On Device Slow df



    Hi,

    I have a webworks app that takes a while to load on the device. When tapping on the icon it takes 10 seconds for the application to load up before it starts running any of the code. I have slimmed down the config file and removed things I am not using, so there is very little in there now. I am using JQuery Mobile for the framework (min versions) for the framework. But, it is slow to just get to that point. I am running a Torch on OS6 and other apps seem to run fine.

    I am not sure where to look as I have cleaned up the config, minified all code, the app is 450kb before compiling and 1.0 MB after.

    Any help on what this could be or where to look would be great!

    Thanks!

    Simon.

    DB:2.86:App Loading On Device Slow df

    don't use jquery mobile on o.s. 6 or try using it externally. webworks seems to put on a lot of extra lbs to your app

  • RELEVANCY SCORE 2.85

    DB:2.85:Remote Java Compiler x9


    Does any one know of a web site that offers the service of remote compiling ( and running ) .java code.

    I work on a network on which i have limited permission and cant install software.

    As such i would be trying to write programs in notepad, and then compiling and running remotely.

    Thanks for your help.

    DB:2.85:Remote Java Compiler x9

    Yep , fair call , thanks for that your link did help.

  • RELEVANCY SCORE 2.84

    DB:2.84:Programs Will Not Compile That Have Seperate Classes k7


    I am trying to compile a program which has a seperate class, but it wont compile, it cant find the other class. I am compiling in the correct order, and I have tried re-compiling programs with seperate classes that I have done before, and they now wont compile. I tried compiling my program on my friends computer and it compiled fine.
    I am using jdk5.0 update 6 on Windows XP Pro
    Any help will be much appreciated

    DB:2.84:Programs Will Not Compile That Have Seperate Classes k7

    I'm just about out of ideas.

    Two things pop to mind:

    * Is javac a .bat file that sets up some environment or classpath before invoking javac.exe? Is there a reference to a zip file there?

    * In your ext directory (lib\ext under %JAVA_HOME% or %JDK_HOME% or %JRE_HOME%) is there a zip file?

    Other than that, I'm stumped. Good luck.

  • RELEVANCY SCORE 2.84

    DB:2.84:Flash Timeout Error On Frdm-Kl25z Using Jlink With Keil. Cannot Find Appropriate Flash Programming Algorithm. 38



    When I try to load my code to flash on my KL25Z, I get a flash timeout error. The project compiles, and JLink recognizes the device. I am using uVision 5, and JLink v4.78d.

    I believe the problem arises from using the wrong programming algorithm, but I can't figure out where to get the right one.

    -------- Here are my current flash options and settings ----------

    -------- Here are my current available flash programming algorithms ----------

    -------- Here is the compile output --------

    Rebuild Project 'mytest3' - Target 'KL25Z128 - Flash'

    compiling mytest3.c...

    compiling uif.c...

    compiling alloc.c...

    compiling assert.c...

    compiling io.c...

    compiling memtest.c...

    compiling queue.c...

    compiling stdlib.c...

    compiling nmi_isr_handler.c...

    compiling start.c...

    compiling sysinit.c...

    compiling system_MKL25Z4.c...

    assembling startup_MKL25Z4.s...

    compiling cmp.c...

    compiling llwu.c...

    compiling lptmr.c...

    compiling mcg.c...

    compiling pmc.c...

    compiling rcm.c...

    compiling rtc.c...

    compiling smc.c...

    compiling uart.c...

    compiling Serial.c...

    compiling Retarget.c...

    linking...

    Program Size: Code=7164 RO-data=1844 RW-data=40 ZI-data=0

    After Build - User command #1: C:\Keil\\ARM\ARMCC\bin\fromelf.exe --m32combined --output=.\UV4Build\mytest3_Flash.srec .\UV4Build\mytest3_Flash.axf

    After Build - User command #2: C:\Keil\\ARM\ARMCC\bin\fromelf.exe --bincombined --output=.\UV4Build\mytest3_Flash.bin .\UV4Build\mytest3_Flash.axf

    ".\UV4Build\mytest3_Flash.axf" - 0 Error(s), 0 Warning(s).

    -------- End -------

    -------------- Here is the Load Code output --------------

    Load "C:\\Users\\robga_000\\Documents\\KL25 Sample Code\\kl25_sc_rev9\\klxx-sc-baremetal\\build\\keil\\mytest3\\UV4Build\\mytest3_Flash.axf"

    Set JLink Project File to "C:\Users\robga_000\Documents\KL25 Sample Code\kl25_sc_rev9\klxx-sc-baremetal\build\keil\mytest3\JLinkSettings.ini"

    * JLink Info: Device "MKL25Z128XXX4" selected (128 KB flash, 16 KB RAM).

    JLink info:

    ------------

    DLL: V4.76d, compiled Sep 13 2013 16:35:06

    Firmware: J-Link V9 compiled Oct 18 2013 17:37:30

    Hardware: V9.00

    S/N : 59102566

    Feature(s) : GDB

    * JLink Info: Found SWD-DP with ID 0x0BC11477

    * JLink Info: Found SWD-DP with ID 0x0BC11477

    * JLink Info: Found Cortex-M0 r0p0, Little endian.

    * JLink Info: FPUnit: 2 code (BP) slots and 0 literal slots

    ROMTableAddr = 0xE00FF003

    * JLink Info: Kinetis L-series (setup): Disabling watchdog.

    Target info:

    ------------

    Device: MKL25Z128xxx4

    VTarget = 3.311V

    State of Pins:

    TCK: 0, TDI: 0, TDO: 0, TMS: 1, TRES: 1, TRST: 1

    Hardware-Breakpoints: 2

    Software-Breakpoints: 8192

    Watchpoints: 2

    JTAG speed: 1000 kHz

    Erase Failed!

    Error: Flash Download failed - "Cortex-M0+"

    -------------- End ---------------

    The erase doesn't get past a single bit:

    Here are the actual error windows:

    Thank you so much for reading all of this. I appreciate your help.

    DB:2.84:Flash Timeout Error On Frdm-Kl25z Using Jlink With Keil. Cannot Find Appropriate Flash Programming Algorithm. 38


    When I try to load my code to flash on my KL25Z, I get a flash timeout error. The project compiles, and JLink recognizes the device. I am using uVision 5, and JLink v4.78d.

    I believe the problem arises from using the wrong programming algorithm, but I can't figure out where to get the right one.

    -------- Here are my current flash options and settings ----------

    -------- Here are my current available flash programming algorithms ----------

    -------- Here is the compile output --------

    Rebuild Project 'mytest3' - Target 'KL25Z128 - Flash'

    compiling mytest3.c...

    compiling uif.c...

    compiling alloc.c...

    compiling assert.c...

    compiling io.c...

    compiling memtest.c...

    compiling queue.c...

    compiling stdlib.c...

    compiling nmi_isr_handler.c...

    compiling start.c...

    compiling sysinit.c...

    compiling system_MKL25Z4.c...

    assembling startup_MKL25Z4.s...

    compiling cmp.c...

    compiling llwu.c...

    compiling lptmr.c...

    compiling mcg.c...

    compiling pmc.c...

    compiling rcm.c...

    compiling rtc.c...

    compiling smc.c...

    compiling uart.c...

    compiling Serial.c...

    compiling Retarget.c...

    linking...

    Program Size: Code=7164 RO-data=1844 RW-data=40 ZI-data=0

    After Build - User command #1: C:\Keil\\ARM\ARMCC\bin\fromelf.exe --m32combined --output=.\UV4Build\mytest3_Flash.srec .\UV4Build\mytest3_Flash.axf

    After Build - User command #2: C:\Keil\\ARM\ARMCC\bin\fromelf.exe --bincombined --output=.\UV4Build\mytest3_Flash.bin .\UV4Build\mytest3_Flash.axf

    ".\UV4Build\mytest3_Flash.axf" - 0 Error(s), 0 Warning(s).

    -------- End -------

    -------------- Here is the Load Code output --------------

    Load "C:\\Users\\robga_000\\Documents\\KL25 Sample Code\\kl25_sc_rev9\\klxx-sc-baremetal\\build\\keil\\mytest3\\UV4Build\\mytest3_Flash.axf"

    Set JLink Project File to "C:\Users\robga_000\Documents\KL25 Sample Code\kl25_sc_rev9\klxx-sc-baremetal\build\keil\mytest3\JLinkSettings.ini"

    * JLink Info: Device "MKL25Z128XXX4" selected (128 KB flash, 16 KB RAM).

    JLink info:

    ------------

    DLL: V4.76d, compiled Sep 13 2013 16:35:06

    Firmware: J-Link V9 compiled Oct 18 2013 17:37:30

    Hardware: V9.00

    S/N : 59102566

    Feature(s) : GDB

    * JLink Info: Found SWD-DP with ID 0x0BC11477

    * JLink Info: Found SWD-DP with ID 0x0BC11477

    * JLink Info: Found Cortex-M0 r0p0, Little endian.

    * JLink Info: FPUnit: 2 code (BP) slots and 0 literal slots

    ROMTableAddr = 0xE00FF003

    * JLink Info: Kinetis L-series (setup): Disabling watchdog.

    Target info:

    ------------

    Device: MKL25Z128xxx4

    VTarget = 3.311V

    State of Pins:

    TCK: 0, TDI: 0, TDO: 0, TMS: 1, TRES: 1, TRST: 1

    Hardware-Breakpoints: 2

    Software-Breakpoints: 8192

    Watchpoints: 2

    JTAG speed: 1000 kHz

    Erase Failed!

    Error: Flash Download failed - "Cortex-M0+"

    -------------- End ---------------

    The erase doesn't get past a single bit:

    Here are the actual error windows:

    Thank you so much for reading all of this. I appreciate your help.

  • RELEVANCY SCORE 2.83

    DB:2.83:Help: Can't Compile Qmslib65.Pll Under Solaris 8k


    Hi,

    I am trying to apply patch 6.5.2.1. One of the files updated is qmslib65.pll.
    When I try and recompile it under Solaris I get the following error message:

    ---------------------
    .
    .
    .
    Compiling Package Body QMS$FORM_FUNCTION......
    Compiling Package Body QMS$FORMS_ERRORS......
    ERROR 315 at line 1149, column 78
    PL/SQL TABLE declarations must currently use binary_integer indexes
    ERROR 0 at line 1149, column 10
    Statement ignored
    Compiling Package Body QMS$FORM......
    Compiling Package Body QMS$FIND_BLOCK......
    Compiling Package Body QMS$ERRORS......
    ERROR 306 at line 131, column 4
    wrong number or types of arguments in call to 'POP'
    ERROR 0 at line 131, column 4
    Statement ignored
    ERROR 306 at line 139, column 7
    wrong number or types of arguments in call to 'POP'
    ERROR 0 at line 139, column 7
    Statement ignored
    Compiling Package Body QMS$CONTEXT......
    Compiling Package Body QMS$CONFIG......
    Compiling Package Body QMS$CALENDAR......
    Compiling Package Body QMS$BLOCK......
    Compiling Package Body QMS$APPLICATION......
    Compiling Procedure Body COPYRIGHT......
    Compiling Procedure Body CGHP$CALL_MS_HELP......
    Closing library QMSLIB65...
    Compilation errors on QMS$FORMS_ERRORS:
    PL/SQL ERROR 315 at line 1149, column 78
    PL/SQL TABLE declarations must currently use binary_integer indexes
    PL/SQL ERROR 0 at line 1149, column 10
    Statement ignored

    Compilation errors on QMS$ERRORS:
    PL/SQL ERROR 306 at line 131, column 4
    wrong number or types of arguments in call to 'POP'
    PL/SQL ERROR 0 at line 131, column 4
    Statement ignored
    PL/SQL ERROR 306 at line 139, column 7
    wrong number or types of arguments in call to 'POP'
    PL/SQL ERROR 0 at line 139, column 7
    Statement ignored

    Failed to generate library.

    FRM-30312: Failed to compile the library.

    -----------------------------------------------

    When I try under Forms on NT/2000 and Tru64 UNIX it compiles without issue.

    Under solaris gui (f60desm) and command line I get the above errors. I am connecting
    to the same database using the same user (hst65).

    DB:2.83:Help: Can't Compile Qmslib65.Pll Under Solaris 8k

    Hi,

    Finally found out what the problem was. The PLSQL Version under the Solaris box was 8.0.6.0.0 this should have been
    updated when we applied patch 9. The database patch did not install (see note: 191573.1 on metalink) once fixed
    the PLSQL Version was updated to 8.0.6.3.0 and recompiling QMSLIB65.PLL was successfull.

    BTW: All the ofg*65.pll, qmsevh65.pll, and the others compiled without issue under plsql version 8.0.6.0.0.

    Thanks for your suggestions.

  • RELEVANCY SCORE 2.82

    DB:2.82:Computer Not Allowing Certain Programs 31


    I recently download updates for Microsoft protection and updated Mozilla. Now the computer will not let me play games on face book it seems to have trouble loading them. Also Mozilla is not shutting down properly help

    DB:2.82:Computer Not Allowing Certain Programs 31

    Are you using Microsoft Security Essentials as your antimalware protection?
    Regarding Mozilla, shouldn't you be contacting them to determine what their update did?
    If using MSE, state your OS and service pack, and your prior realtime antimalware.
    Doc

    Computers verified since 1972

  • RELEVANCY SCORE 2.82

    DB:2.82:Programs Wont Run After Compiling zx



    not sure what Im doing wrong here, looked around on the forums for anything, and found nothing regarding this issue.I have tried to install a few programs now, AWN, and Cairo-Clock, downloaded the tar files, unpacked them, cd to the directory, and run
    ./configure
    make
    make install

    DB:2.82:Programs Wont Run After Compiling zx


    You could also read ./configure --help for more details on this.

  • RELEVANCY SCORE 2.81

    DB:2.81:Compilation Of Jni Programs 77


    Hi there,

    am getting the following errors when compiling my JNI programs.

    HOME cc -I/opt/java1.3/include -I/opt/java1.3/include/hp-ux -L/opt/java1.3/jre/lib/PA_RISC2.0/libjava.sl -ljava invoke.c
    cc: "invoke.c", line 34: warning 604: Pointers are not assignment-compatible.
    cc: "invoke.c", line 34: warning 563: Argument #2 is not the correct type.
    /usr/ccs/bin/ld: Can't find library: "java"

    The invoke.c program is from http://java.sun.com/docs/books/tutorial/native1.1/invoking/invo.html
    Have set my CLASSPATH to include the *.h and libjava.sl files. Am using JVM 1.3.1 on HU-UX.

    Appreciate any help here. Thank you.

    - Sakthi

    DB:2.81:Compilation Of Jni Programs 77

    hi there,

    tks for the reply.

    But from the JNI tutorial, when invoking the JVM from a native program, there is no need to create a header file.

    But, I get the same error when the header file is created.

    - sakthi

  • RELEVANCY SCORE 2.81

    DB:2.81:Mpi Programming - Reg 8z


    We had installed Globus toolkit 1.0.1. Now we planned to do MPI programming. But we struck in finding the place for compiling and running the MPI programs. Kindly can anyone help me in compiling and running the MPI programs. Waiting for the reply..

    DB:2.81:Mpi Programming - Reg 8z

    I think you will find better assistance in the Globus community for this or the forums for your MPI redistribution.Rick Molloy Parallel Computing Platform : http://blogs.msdn.com/nativeconcurrency http://parallelroads.com/blog

  • RELEVANCY SCORE 2.81

    DB:2.81:Error In Compiling Java Source Code In A Package pj


    hi all...
    am having a problem in compiling a java source code:
    i have a class named 'Test' in the package 'packone'....
    i have another class named 'getTest' in the same package....
    in the class getTest i am taking a reference to Test class...
    on compiling i am getting the following error....
    cannot resolve symbol
    symbol : class Test
    The source code for the two classes are :

    package packone;
    public class Test{
    }

    and

    package packone;
    public class getTest{
    public void me(){
    Test t = new Test();
    }
    }

    i have included the directory path in the classpath....
    still its not compiling .....
    please help
    thanks....

    DB:2.81:Error In Compiling Java Source Code In A Package pj

    i have included the directory path in the
    classpath....
    still its not compiling .....
    please help
    thanks.... For example, if you have c:\myjava\packone\Text.classthen you need to have c:\myjava in the Classpath, NOT c:\myjava\packone.

    Oh, and make sure you have a Test.class file. It looks like you do not have any code in Test. I think javac will not produce a class file if there isn't anything to compile.

  • RELEVANCY SCORE 2.81

    DB:2.81:Compiling Invocation Programs ? Where To Find Javai.Lib ?? c8


    Hello,
    I'm having J2SE 1.4, VC++ 4.0. I'm trying to compile the invocation programs given in the Java Tutorial but I'm unable to compile since I've not found javai.lib in my J2SE folder. Can anyone help me on how to compile. Where to find javai.lib ??

    Thanks

    Wah Java!

    DB:2.81:Compiling Invocation Programs ? Where To Find Javai.Lib ?? c8

    Sorry, can't help you there. That jvm.lib should work fine. As an alternative, you can (and probably should) dynamically link the jvm.dll using LoadLibrary() and use GetProcAddress() to resolve the JVM invocation methods. This gives you the flexibility to change the JVM implementation dynamically rather than having to re-link (for example, you could switch from JDK 1.3 to JDK 1.4 without re-building).

    Good luck.

    Phil

  • RELEVANCY SCORE 2.80

    DB:2.80:Loading Impossible From Ods 7x


    Hi,I want to load a cube (CUBE1) from an ods (ODS1), but with corresponding info-package, my loading is never initiate. When I launch this loading, info-package compiling programs, etc. but never execute loading.I try load another structure. I create another ods (ODS2) like ODS1 and I've same problem to load this.I've checked ODS1 with rsrv, only test return error (foreign key et SID). According RSRV, ODS1 haven't SID for different caracteristics. When I check tables (/BIC/AODS110, /BIC/AODS140 and /BIC/AODS150) with SE14, SAP BW say me these 3 tables are consistent.I peruse different posts on this forum, the solution to reload master data can be solve this problem ? I don't think. If master data miss, during loading of CUBE1 SAP create a dummy or blank entry but they can't restrain the start of loading. Isn't it ?What's solution ? others check with rsrv show me green light. How can I repair my ODS1 ?Rgds,

    DB:2.80:Loading Impossible From Ods 7x

    Hi,check your autority. You might miss the authority to schedule a job. Additionally check the authorities of your background user (usually aleremote). May be there is also a lack of authorities.regardsSiggi

  • RELEVANCY SCORE 2.80

    DB:2.80:Mpi Programming - Reg ss


    We had installed Globus toolkit 1.0.1. Now we planned to do MPI programming. But we struck in finding the place for compiling and running the MPI programs. Kindly can anyone help me in compiling and running the MPI programs. Waiting for the reply..

    System Configuration:
    OS : Redhat 5.2 (RHEL 5.2)
    Toolkit : Globus Toolkit 1.0.1

    Thank you.

    DB:2.80:Mpi Programming - Reg ss

    This forum is focusing on Oracle Enterprise Manager Grid Control, you post isn't ;-)

  • RELEVANCY SCORE 2.79

    DB:2.79:Re: Hello I Need Help On Getting Java To Work On My Computer. fd


    You probably need to start Sun's Java Tutorial here:
    http://java.sun.com/docs/books/tutorial/

    Click on the First Steps link and follow the instructions. It will get you started compiling. Once you can compile and run programs just skip over material that you already know.

    DB:2.79:Re: Hello I Need Help On Getting Java To Work On My Computer. fd

    If it were me i would download Eclipse sdk 3.1. Its freeware and it works wonders

  • RELEVANCY SCORE 2.79

    DB:2.79:Watching Tivo Programs On Ipod sc


    Is there a simple way to watch shows recorded by my TiVo on my Nano? Everything I've seen online requires compiling code and using Terminal.

    DB:2.79:Watching Tivo Programs On Ipod sc

    Is there a simple way to watch shows recorded by my TiVo on my Nano? Everything I've seen online requires compiling code and using Terminal.

  • RELEVANCY SCORE 2.79

    DB:2.79:Not All Programs Show In Addremove Programs At The Control Panel pp


    Help me please when i go to control panel then add and remove programs nothing comes up and it says its done loading but all my programs work and i scanned with norton 360, malwarebytes, SUPERantispyware, and sophos anti rootkit and all of them reported
    nothing.

    DB:2.79:Not All Programs Show In Addremove Programs At The Control Panel pp

    Why not post to a more appropriate forum for your Windows operating system -
    http://social.answers.microsoft.com/Forums/en-US/group/WindowsAnswers

    This forum is dealing with Windows Updates.

    Thank you.

    TaurArian [MVP] 2005-2010 - Update Services

  • RELEVANCY SCORE 2.78

    DB:2.78:C++ Compiling Problem In Terminal.. k7


    I have a problem in compiling and executing c programs on my lion in terminal..can anyone help me with it plzz??

    DB:2.78:C++ Compiling Problem In Terminal.. k7

    Tried Steve's suggestion. I now have version 4.5.2 of Xcode. When I type gcc on the command line I get " gcc: Command not found."Carol

  • RELEVANCY SCORE 2.78

    DB:2.78:Error Compiling Gcc On Ppc ps



    Im trying to install the ps3toolchain from http://ps2dev.org/ps3/Tools/Toolchain/p … 26.tar.bz2 so I can compile programs specifically for ppu/spu, but I keep having problems. I noticed that in the i686 PKGCONFIG for gcc that it required the de_DE locale, so I regenerated my locales with that and began compiling. binutils compiled just fine, but a good ways into compiling gcc I get the following error:
    make[2]: Entering directory `/root/ps3toolchain/build/gcc-4.2.0/build-ppu-stage1
    Configuring stage 2 in ./intl
    configure: loading cache ./config.cache
    checking whether make sets $(MAKE)... yes
    checking for a BSD-compatible install... /bin/install -c
    checking whether NLS is requested... no
    checking for msgfmt... /usr/bin/msgfmt
    checking for gmsgfmt... /usr/bin/msgfmt
    checking for xgettext... /usr/bin/xgettext
    checking for msgmerge... /usr/bin/msgmerge
    checking for powerpc64-unknown-linux-gnu-gcc... /root/ps3toolchain/build/gcc-4.2.0/build-ppu-stage1/./prev-gcc/xgcc -B/root/ps3toolchain/build/gcc-4.2.0/build-ppu-stage1/./prev-gcc/ -B/usr/local/ps3dev/ppu/ppu/bin/
    checking for C compiler default output file name... configure: error: C compiler cannot create executables
    See `config.log for more details.
    make[2]: *** [configure-stage2-intl] Error 77
    make[2]: Leaving directory `/root/ps3toolchain/build/gcc-4.2.0/build-ppu-stage1
    make[1]: *** [stage2-bubble] Error 2
    make[1]: Leaving directory `/root/ps3toolchain/build/gcc-4.2.0/build-ppu-stage1
    make: *** [all] Error 2

    DB:2.78:Error Compiling Gcc On Ppc ps


    Im trying to install the ps3toolchain from http://ps2dev.org/ps3/Tools/Toolchain/p … 26.tar.bz2 so I can compile programs specifically for ppu/spu, but I keep having problems. I noticed that in the i686 PKGCONFIG for gcc that it required the de_DE locale, so I regenerated my locales with that and began compiling. binutils compiled just fine, but a good ways into compiling gcc I get the following error:
    make[2]: Entering directory `/root/ps3toolchain/build/gcc-4.2.0/build-ppu-stage1
    Configuring stage 2 in ./intl
    configure: loading cache ./config.cache
    checking whether make sets $(MAKE)... yes
    checking for a BSD-compatible install... /bin/install -c
    checking whether NLS is requested... no
    checking for msgfmt... /usr/bin/msgfmt
    checking for gmsgfmt... /usr/bin/msgfmt
    checking for xgettext... /usr/bin/xgettext
    checking for msgmerge... /usr/bin/msgmerge
    checking for powerpc64-unknown-linux-gnu-gcc... /root/ps3toolchain/build/gcc-4.2.0/build-ppu-stage1/./prev-gcc/xgcc -B/root/ps3toolchain/build/gcc-4.2.0/build-ppu-stage1/./prev-gcc/ -B/usr/local/ps3dev/ppu/ppu/bin/
    checking for C compiler default output file name... configure: error: C compiler cannot create executables
    See `config.log for more details.
    make[2]: *** [configure-stage2-intl] Error 77
    make[2]: Leaving directory `/root/ps3toolchain/build/gcc-4.2.0/build-ppu-stage1
    make[1]: *** [stage2-bubble] Error 2
    make[1]: Leaving directory `/root/ps3toolchain/build/gcc-4.2.0/build-ppu-stage1
    make: *** [all] Error 2

  • RELEVANCY SCORE 2.78

    DB:2.78:Problems With Pro*Cobol On 10g xk


    Hi ,
    We are trying to migrate from 9i to 10g. We were using pro*cobol 1.8. Now we are facing many problems while compiling and running these programs on Pro*COBOL: Release 10.2.0.2.0.

    Are there any migration guides available which might have the specific changes to be done.

    Thanks
    Akhila

    DB:2.78:Problems With Pro*Cobol On 10g xk

    Hi ,
    We are trying to migrate from 9i to 10g. We were using pro*cobol 1.8. Now we are facing many problems while compiling and running these programs on Pro*COBOL: Release 10.2.0.2.0.

    Are there any migration guides available which might have the specific changes to be done.

    Thanks
    Akhila

  • RELEVANCY SCORE 2.78

    DB:2.78:Help With Rc Files And 10.1.024 kz



    For some reason, possibly related to the 10.1.024 update to the compiler, my popup dialogs and toolbars are not displaying.

    I am guessing it's related to the RC file? an/or the update?

    On a recomiple and then a complete rebuild, the program compiles OK and loads/runs, however the

    To check that it isn't something with my programs, i went to the samples/win32 and tried to comiple, for example, angle.

    It compiles fine, but only a grid displays, the dialog does not.

    Trying some other samples, dialogs are not loading.

    Any ideas where to search for what was changed in 10.1.024 or some other update that has caused this to occur?

    Thanks

    Details on setup as follows: (note except for 10.1.024 update, everything was working/compiling/displaying correctly)

    Visual Studio .NET 2003, SP1

    XP Pro 2002 SP2

    MV C++ Net

    DB:2.78:Help With Rc Files And 10.1.024 kz


    When Visual Studio installs, it sets up this relationship. I don't know if doing a "repair" would fix it. I will make a note to add this to our FAQ list.

  • RELEVANCY SCORE 2.77

    DB:2.77:Help With Programs Loading On Bottom Left Delaying Typing In Anything Anywhere 1a



    Well, apparently it looks like alot of these posts get moved so I'm prepared but this didn't seem to fit elsewhere.

    Let me know if it doesn't.

    When I sign in, Win 8.1, it looks like fluff programs loading on bottom left.

    It delays me typing in the command line till it goes through these programs loading.

    Can anyone, from what I just described, tell me where to go so I can stop these from loading and delaying me.

    Thanks in advance

    Srk

    DB:2.77:Help With Programs Loading On Bottom Left Delaying Typing In Anything Anywhere 1a


    Where are you talking about---------on the Start screen in Windows 8.1, or the home page for Comcast/Xfinity? What kind of programs are you seeing? Which browser are you using?




    ___________________________________________________________________________________________________These are customer to customer support forums. We are paying customers just like you. We volunteer our time to try and help other customers with how-to help, and troubleshoot problems if we can. We can't look at your account. The only Comcast employees in the forums are those with their names in RED.

  • RELEVANCY SCORE 2.77

    DB:2.77:Problems With Hdl Co-Simulation!!!! s7



    Hi:

    everyone!

    There is a blackbox in my SystemGenerator model,and I think I have done the right setting of the blackbox block ,cause if I chose ISE simulator as the simulation mode, the whole simulation was OK. However,when I chose ModelSim as the simulator, there will be some errors listed as follows:

    An internal error occurred in the Xilinx Blockset Library.(reported by SystemGenerator)

    (imformation listed as follows in Transcript Window when ModelSim was compliling)

    # Model Technology ModelSim SE vcom 6.3c Compiler 2007.09 Sep 11 2007# -- Loading package standard# -- Loading package std_logic_1164# -- Loading package numeric_std# -- Compiling package conv_pkg# -- Compiling package body conv_pkg# -- Loading package conv_pkg# -- Compiling package clock_pkg# ** Error: ofdm_txrx_mimo_coded_cosim.vhd(1410): Library unisim not found.# ** Error: ofdm_txrx_mimo_coded_cosim.vhd(1411): (vcom-1136) Unknown identifier "unisim".# -- Loading package conv_pkg# ** Error: ofdm_txrx_mimo_coded_cosim.vhd(1416): VHDL Compiler exiting# ** Error: f:/Modeltech_6.3c/win32/vcom failed.# Executing ONERROR command at macro ./ofdm_txrx_mimo_coded_cosim_cw.tcl line 141

    The question is that why ModelSim would compile the VHDLmodules while my module included by blackbox is a verilog module? I mean the HDL file format in the directory is #.v not #.vhd, the ModelSim should do the verilog compiling .

    Version : ModelSim 6.3c ,Matlab 2008a ,ISE 10.1,SystemGenerator 10.1

    I had complied the library unsim and xilinxcore to ModelSim, and it was OK when I did simulation using ModelSim in other project.

    Please help!!

    DB:2.77:Problems With Hdl Co-Simulation!!!! s7


    Thank you again ! benchan.

    I think Xilinx should hire you as an employee !

  • RELEVANCY SCORE 2.76

    DB:2.76:Re: Memory Access Violation Caused In String Class 7m


    Are you compiling and linking with "-mt" on every CC command line?
    The option is required for multithreaded programs, and must be used consistently.

    DB:2.76:Re: Memory Access Violation Caused In String Class 7m

    My same code runs on HPUX and has the exactly same data to work on like its solaris counterpart. I strongly suspect that the problem lies with the libC version. I am not sure if we need the following patch(just released):
    108993-43

  • RELEVANCY SCORE 2.76

    DB:2.76:Moving Pictures And Loading Programs Like Streets And Trips 11


    I want to change the look of the desktop of my axim 30 I just need to find instructions on all of it/ The book is not much help in area. Can someone direct me to a help sight?

    DB:2.76:Moving Pictures And Loading Programs Like Streets And Trips 11

    This depends on what you want to do with your today screen, there are many possibilities! Head on over to Aximsite.com and see if you can find a solution there. How specifically do you want to change your today screen. It could be as simple as clicking start - settings - today, then
    changing the theme on the appearance tab.

    To add more themes, copy the theme's .tsk file to your Axim's \Windows folder. Then it will appear as a theme on the appearance tab.

    Finally, there are third party skinning apps, such as Lakeridge Software's Wisbar Advance 2. I've choosen to stay with the 1.3.xx version since I don't have Windows Mobile 2003 SE. Definitely take a look @ this app, most folks are very happy with it!!

    Hope this helps.

  • RELEVANCY SCORE 2.76

    DB:2.76:Help Compiling And Loading Programs On To The 1321xcsk-Bdm Development Kit. m9



    I am new to freescale. I just bought the 1321XCSK-BDM development kit for my senior project. It comes with the Code Warrior IDE and BeeKit. I have all the C-code written. It so happens I cannot seem to figure out how to compile and load the programs on to the board. Can anybody help?

    DB:2.76:Help Compiling And Loading Programs On To The 1321xcsk-Bdm Development Kit. m9


    I'm using CW for MCU10.x with the MC1321x boards/cards. You might check out

    SMAC with Processor Expert | MCU on Eclipse

    http://mcuoneclipse.com/2013/05/12/freedom-track-robot-with-ieee802-15-4/

    above is using the SMAC Freescale stack with Processor Expert.

    The RNet stack supports the MC1321x too:

    http://mcuoneclipse.com/2013/11/17/rnet-a-simple-open-source-radio-network-stack/

    To program the board, you need to use a BDM programming cable (e.g. PE Multilink).

    I hope this helps,

    Erich

  • RELEVANCY SCORE 2.76

    DB:2.76:Runtime Compiling Of Java Code 9c


    Does anyone know of anu way i can get a java app to run java code without having to compile the code into a class.

    The reason i ask is that i am creating a java resource editor and am finding loading times for the resources too long. on avarage 1 dialog to load from XML to a class file takes 2 - 3 seconds. This is not good enough!!

    What i was looking at was the interface runnable am i on the right track or can what i need even be done?

    Help !!

    Thanks in advance

    Kuldip

    DB:2.76:Runtime Compiling Of Java Code 9c

    The reason i ask is that i am creating a java resource
    editor and am finding loading times for the resources
    too long. on avarage 1 dialog to load from XML to a
    class file takes 2 - 3 seconds. This is not good
    enough!!How do you figure having uncompiled code will speed this up? I would think compileing at runtime would make things run slower than having a pre compiled class

    What i was looking at was the interface runnable am i
    on the right track or can what i need even be done?No, Runnable is for use with threads. I don't think what you want to do is possible unless you right your own java interpeter which would be quite difficult if you don't know how the JVM works and some serious Assembly language and even then it would be no easy task.

  • RELEVANCY SCORE 2.75

    DB:2.75:Compiling Pll And Forms kx


    Hi,

    I am compiling my forms and libraries using ADADMIN, but I got this error:

    The following Oracle Forms objects did not generate successfully:

    au resource OEXOEHDR.pll
    fnd forms/US FNDFFIDF.fmx
    fnd forms/US FNDFFMDC.fmx
    inv forms/US INVIDITM.fmx
    inv forms/US INVTVPTX.fmx
    inv forms/US INVTTMTX.fmx
    wip forms/US WIPTXCFM.fmxI tried manually compiling them 1 by 1

    ]$ f60gen module=OEXOEHDR.pll userid=APPS/APPS module_type=library
    Forms 6.0 (Form Compiler) Version 6.0.8.26.0 (Production)

    Forms 6.0 (Form Compiler): Release - Production

    (c) Copyright 1999 Oracle Corporation. All rights reserved.

    Oracle9i Enterprise Edition Release 9.2.0.6.0 - Production
    With the Partitioning, OLAP and Oracle Data Mining options
    JServer Release 9.2.0.6.0 - Production
    PL/SQL Version 8.0.6.3.0 (Production)
    Oracle Procedure Builder V6.0.8.21.0 Build #0 - Production
    Oracle Virtual Graphics System Version 6.0.5.39.0 (Production)
    Oracle Multimedia Version 6.0.8.25.0 (Production)
    Oracle Tools Integration Version 6.0.8.17.0 (Production)
    Oracle Tools Common Area Version 6.0.5.32.0
    Oracle CORE Version 4.0.6.0.0 - Production
    Compiling library OEXOEHDR...
    Compiling Package Spec OE_VERSION_ORDERS......
    Compiling Package Spec OE_TELESALES_HDR......
    Compiling Package Spec OE_SOURCE_FIELDS......
    Compiling Package Spec OE_SET_DEPENDENT_HEADER_ATTR......
    Compiling Package Body ADDRESSES_POPUP......
    Closing library OEXOEHDR...
    Compilation errors on OE_OE_VLD_HEADER:
    PL/SQL ERROR 306 at line 92, column 5
    wrong number or types of arguments in call to 'VALIDATE_AND_WRITE'
    PL/SQL ERROR 0 at line 92, column 5
    Statement ignored

    Failed to generate library.

    FRM-30312: Failed to compile the library.I tried to check the "OE_OE_VLD_HEADER" in the database object for recompiling but I can not find it :(

    Please help....

    Thanks a lot

    MsK

    DB:2.75:Compiling Pll And Forms kx

    Hi,

    Do you have any invalid objects in the database?

    The same error is addressed in (Note 566381.1 - ERROR: ORA-04062 Signature Package Apps.OE_OE.FORM_HEADER Has Been Changed), so please review the document and see if it helps.

    Regards,
    Hussein

  • RELEVANCY SCORE 2.75

    DB:2.75:Error Running Swingapplication Tutorial kj


    I'm trying to run the SwingApplication from the 'Compiling and Running Swing Programs' tutorial at http://java.sun.com/docs/books/tutorial/uiswing/start/swingStart12.html.

    When I enter: 'java SwingApplication' I get the following error:

    Exception in thread "main" java.lang.NoClassDefFoundError: SwingApplication

    I'm running Java version 1.3.1_02. Can anyone please help me with this error?
    Thanks in advance.

    DB:2.75:Error Running Swingapplication Tutorial kj

    Thank you very much for your input. I was running in the wrong directory. When I got into the right directory, ....\jdk\bin, and used the -classpath option, everything worked fine. One more arrow in the back to becoming an expert......... :-)

  • RELEVANCY SCORE 2.75

    DB:2.75:Pci Express Endpointpipe V1.7 Simulation Problem 71



    When I execute the simulation script simulate_mit.do in modelsim, The wave of the dsport, endpointpipe, PIO/RX or TX enginewas not the same as I expected(all of the Pin of data was zero),and the simulation end with:# [ 8522100] : Transaction Reset Is De-asserted...

    my simulation process is as follows:

    Reading C:/Modeltech_xe_starter/tcl/vsim/pref.tcl cd C:/coregen/endpoint_pipe/simulation/functionaldo simulate_mti.do# ** Warning: (vlib-34) Library already exists at "work".# Reading C:\Modeltech_xe_starter\win32xoem/../modelsim.ini# "work" maps to directory work. (Default mapping)# Model Technology ModelSim XE III vlog 6.5c Compiler 2010.02 Feb 10 2010# -- Compiling module px1011a# -- Compiling module boardx01# -- Compiling module sys_clk_gen# -- Compiling module sys_clk_gen_ds# -- Compiling module xilinx_pci_exp_1_lane_epipe_ep# -- Compiling module endpoint_pipe# -- Compiling module glbl# -- Compiling module pci_exp_32b_app# -- Compiling module PIO_EP# -- Compiling module PIO_EP_MEM_ACCESS# -- Compiling module EP_MEM# -- Compiling module PIO_32_RX_ENGINE# -- Compiling module PIO_32_TX_ENGINE# -- Compiling module PIO_TO_CTRL# -- Compiling module PIO# -- Compiling module xilinx_pci_exp_1_lane_downstream_port# -- Compiling module xilinx_pci_exp_1_lane_dsport# -- Compiling module dsport_cfg# -- Compiling module pci_exp_usrapp_rx# -- Compiling module pci_exp_usrapp_tx# -- Compiling module pci_exp_usrapp_com# -- Compiling module pci_exp_usrapp_cfg# -- Compiling module pci_exp_1_lane_64b_dsport# -- Scanning library directory 'C:\Xilinx\10.1\ISE/verilog/src/simprims'# -- Scanning library directory 'C:\Xilinx\10.1\ISE/verilog/src/unisims'# -- Compiling module OBUF# -- Compiling module IBUF# -- Compiling module VCC# -- Compiling module GND# -- Compiling module INV# -- Compiling module FD# -- Compiling module SRL16# -- Compiling module FDE# -- Compiling module SRL16E# -- Compiling module LUT4_L# -- Compiling module LUT4_D# -- Compiling module LUT3_L# -- Compiling module LUT3_D# -- Compiling module LUT2_D# -- Compiling module LUT2_L# -- Compiling module MUXF5# -- Compiling module LUT2# -- Compiling module LUT3# -- Compiling module LUT4# -- Compiling module FDP# -- Compiling module FDR# -- Compiling module BUF# -- Compiling module LUT1# -- Compiling module FDRSE# -- Compiling module FDRE# -- Compiling module FDCE# -- Compiling module FDRS# -- Compiling module FDS# -- Compiling module MUXF6# -- Compiling module MUXCY# -- Compiling module XORCY# -- Compiling module FDSE# -- Compiling module SRLC16E# -- Compiling module RAMB16_S9_S9# -- Compiling module FDPE# -- Compiling module FDC# -- Compiling module RAM16X1D# -- Compiling module FDDRCPE# -- Compiling module BUFG# -- Compiling module DCM# -- Compiling module dcm_clock_divide_by_2# -- Compiling module dcm_maximum_period_check# -- Compiling module dcm_clock_lost# -- Compiling module RAMB16_S36_S36# -- Compiling module GT11CLK_MGT# -- Compiling module LUT1_L# -- Compiling module DCM_ADV# -- Compiling module dcm_adv_clock_divide_by_2# -- Compiling module dcm_adv_maximum_period_check# -- Compiling module dcm_adv_clock_lost# -- Compiling module MUXCY_L# -- Compiling module SRLC16# -- Compiling module GT11# -- Compiling module MULT_AND# -- Compiling module RAMB16_S18_S18# -- Compiling module GT11_SWIFT# -- Scanning library directory 'C:\Xilinx\10.1\ISE/smartmodel/nt/wrappers/mtiveri​log'# -- Compiling module GT11_SWIFT_BIT# # Top level modules:#boardx01#glbl# vsim +notimingchecks +TESTNAME=sample_smoke_test0 -L work work.boardx01 glbl # Loading C:\Xilinx\10.1\ISE\smartmodel\nt\installed_nt/lib/​pcnt.lib/swiftpli_mti.dll# //ModelSim XE 6.5c Feb 10 2010 # //# //Copyright 1991-2010 Mentor Graphics Corporation# // All Rights Reserved.# //# //THIS WORK CONTAINS TRADE SECRET AND # //PROPRIETARY INFORMATION WHICH IS THE PROPERTY# //OF MENTOR GRAPHICS CORPORATION OR ITS LICENSORS# //AND IS SUBJECT TO ****** TERMS.# //# Loading work.boardx01# Loading work.px1011a# Loading work.xilinx_pci_exp_1_lane_epipe_ep# Loading work.OBUF# Loading work.IBUF# Loading work.pci_exp_32b_app# Loading work.PIO# Loading work.PIO_EP# Loading work.PIO_EP_MEM_ACCESS# Loading work.EP_MEM# Loading work.RAMB16_S36_S36# Loading work.PIO_32_RX_ENGINE# Loading work.PIO_32_TX_ENGINE# Loading work.PIO_TO_CTRL# Loading work.endpoint_pipe# Loading work.VCC# Loading work.GND# Loading work.INV# Loading work.FD# Loading work.SRL16# Loading work.FDE# Loading work.SRL16E# Loading work.LUT4_L# Loading work.LUT4_D# Loading work.LUT3_L# Loading work.LUT3_D# Loading work.LUT2_D# Loading work.LUT2_L# Loading work.MUXF5# Loading work.LUT2# Loading work.LUT3# Loading work.LUT4# Loading work.FDP# Loading work.FDR# Loading work.BUF# Loading work.LUT1# Loading work.FDRSE# Loading work.FDRE# Loading work.FDCE# Loading work.FDRS# Loading work.FDS# Loading work.MUXF6# Loading work.MUXCY# Loading work.XORCY# Loading work.FDSE# Loading work.SRLC16E# Loading work.RAMB16_S9_S9# Loading work.FDPE# Loading work.FDC# Loading work.RAM16X1D# Loading work.FDDRCPE# Loading work.BUFG# Loading work.DCM# Loading work.xilinx_pci_exp_1_lane_downstream_port# Loading work.xilinx_pci_exp_1_lane_dsport# Loading work.GT11CLK_MGT# Loading work.pci_exp_1_lane_64b_dsport# Loading work.LUT1_L# Loading work.DCM_ADV# Loading work.dcm_adv_clock_divide_by_2# Loading work.dcm_adv_maximum_period_check# Loading work.dcm_adv_clock_lost# Loading work.MUXCY_L# Loading work.SRLC16# Loading work.GT11# Loading work.GT11_SWIFT# Loading work.GT11_SWIFT_BIT# Loading work.MULT_AND# Loading work.RAMB16_S18_S18# Loading work.dsport_cfg# Loading work.pci_exp_usrapp_rx# Loading work.pci_exp_usrapp_tx# Loading work.pci_exp_usrapp_cfg# Loading work.pci_exp_usrapp_com# Loading work.sys_clk_gen_ds# Loading work.sys_clk_gen# Loading work.glbl# Loading work.dcm_clock_divide_by_2# Loading work.dcm_maximum_period_check# Loading work.dcm_clock_lost# ** Warning: (vsim-WLF-5000) WLF file currently in use: vsim.wlf# File in use by: sdjHostname: SDJ-6EDBA9F8AC8ProcessID: 1216# Attempting to use alternate WLF file "./wlft7eszev".# ** Warning: (vsim-WLF-5001) Could not open WLF file: vsim.wlf# Using alternate file: ./wlft7eszev# ** Warning: (vsim-PLI-3003) ../px1011a_pli.v(82): [TOFD] - System task or function '$omi_adapter' is not defined.# Region: /boardx01/px1011a_inst# ** Warning: (vsim-3017) ../../example_design/xilinx_pci_exp_1_lane_epipe_e​p.v(482): [TFMPC] - Too few port connections. Expected 64, found 63.# Region: /boardx01/xilinx_pci_exp_1_lane_epipe_ep/app# ** Warning: (vsim-3722) ../../example_design/xilinx_pci_exp_1_lane_epipe_e​p.v(482): [TFMPC] - Missing connection for port 'trn_lnk_up_n'.# ** Warning: (vsim-3015) ../../example_design/PIO_EP.v(251): [PCDPC] - Port size (32 or 32) does not match connection size (13) for port 'req_addr_i'.# Region: /boardx01/xilinx_pci_exp_1_lane_epipe_ep/app/PIO/P​IO_EP/EP_TX# ** Warning: Design size of 521118 statements or 36516 non-Xilinx leaf instances exceeds ModelSim XE-Starter recommended capacity.# Expect performance to be quite adversely affected.# Runtime, LMTV v12.4# Copyright (c) 1984-2010 Synopsys Inc. ALL RIGHTS RESERVED# You can use the Browser tool to configure the SmartModel# Library and access information about SmartModels:# $LMC_HOME/bin/sl_browser# # SmartModel product documentation is available here:# $LMC_HOME/doc/smartmodel/manuals/intro.pdf# http://www.synopsys.com/products/lm/doc/smartmodel​.html# # Model gt11_swift: Model Vendor: `Xilinx'.# Running test {sample_smoke_test0}......# [ 0] : System Reset Asserted...# [ 4995000] : System Reset De-asserted...# [ 8522100] : Transaction Reset Is De-asserted...

    can anyone tell me where is my problem??

    and how could i handle it

    DB:2.75:Pci Express Endpointpipe V1.7 Simulation Problem 71


    You may want to open a webcase with the technical support team to help.

  • RELEVANCY SCORE 2.74

    DB:2.74:Help - Deployejb On Oracle 8.1.6 3z


    Does anyone succesfully use deployejb on Oracle 8.1.6 ?
    I try to deploy Helo World sample application.
    The application is compiled by JDK 1.1.8

    This is the command and output I use:

    call deployejb -republish -temp temp -u scott -p tiger -s sess_iiop://localhost:2481:SMS -descriptor hello.ejb server.jar

    Reading Deployment Descriptor...done
    Verifying Deployment Descriptor...done
    Gathering users...done
    Generating Comm Stubs.....................................done
    Compiling Stubs...done
    Generating Jar File...done
    Loading EJB Jar file and Comm Stubs Jar file...done
    Generating EJBHome and EJBObject on the server...
    An unexpected exception occurred deserializing deployment descriptor: null

    null

    DB:2.74:Help - Deployejb On Oracle 8.1.6 3z

    Thank you it, works fine now.
    I used JDeveloper 3.1.1.2 and it's no problem now.
    But if anybody has ever used Oracle Com Corba Bridge please post how to do.
    I only get an error:
    IfrTool: cannot open file "C:\ORACLE\ORA81\javavm/admin/AuroraIFR.idl"
    null

  • RELEVANCY SCORE 2.74

    DB:2.74:Unable To Get Xilinx Video Deinterlacer Test Bench V3.00 Working 3p



    Hi,

    I have recently downloaded the Video Deinterlacer Test Bench v3.00 fromhttp://www.xilinx.com/member/video_deinterlacer/however I am unable to get it working.

    When I try to run the ModelSim batch file run_mtifrom the unzipped downloaded folder, I get the following messages in the ModelSim transcript window:

    # Reading C:/modelsim_dlx_10.1d/tcl/vsim/pref.tcl

    # vsim -do mti_wave.do -gui -t ps -novopt testbench

    # ** Error: (vsim-3170) Could not find 'C:/Users/steve/Downloads/v_deinterlacer_v3_00_a_t​b/v_deinterlacer_v3_00_a_tb/work.testbench'.

    #

    # Error loading design

    I have checked that all the files have unzipped, and am not entirely sure which file ‘work.testbench’ refers to, I assume it is ‘testbench.vhd’ in the work folder.

    I am using ModelSim DE version 10.1d.

    When I try running the ModelSim batch file I also get the following messages in the command prompt:

    C:\Users\steve\Downloads\v_deinterlacer_v3_00_a_tb​\v_dei

    nterlacer_v3_00_a_tbREM Uncomment the following lines or run compxlib if you do

    not have the Xilinx Libraries already compiled for your simulator version

    C:\Users\steve\Downloads\v_deinterlacer_v3_00_a_tb​\v_dei

    nterlacer_v3_00_a_tbREM vlib unisim

    C:\Users\steve\Downloads\v_deinterlacer_v3_00_a_tb​\v_dei

    nterlacer_v3_00_a_tbREM vmap unisim .\unisim

    C:\Users\steve\Downloads\v_deinterlacer_v3_00_a_tb​\v_dei

    nterlacer_v3_00_a_tbREM vcom -work unisim -93 \vhdl\src\unisims\unisim_VPKG.vhd

    C:\Users\steve\Downloads\v_deinterlacer_v3_00_a_tb​\v_dei

    nterlacer_v3_00_a_tbREM vcom -work unisim -93 \vhdl\src\unisims\unisim_VCOMP.vh

    d

    C:\Users\steve\Downloads\v_deinterlacer_v3_00_a_tb​\v_dei

    nterlacer_v3_00_a_tbREM for /F %i IN (\vhdl\src\unisims\primitive\vhdl_analyze_

    order) DO @vcom -work unisim -93 \vhdl\src\unisims\primitive\%i

    C:\Users\steve\Downloads\v_deinterlacer_v3_00_a_tb​\v_dei

    nterlacer_v3_00_a_tbvlib work

    ** Warning: (vlib-34) Library already exists at "work".

    C:\Users\steve\Downloads\v_deinterlacer_v3_00_a_tb​\v_dei

    nterlacer_v3_00_a_tbvmap work .\work

    Modifying modelsim.ini

    C:\Users\steve\Downloads\v_deinterlacer_v3_00_a_tb​\v_dei

    nterlacer_v3_00_a_tbvlib v_deinterlacer_v3_00_a

    ** Warning: (vlib-34) Library already exists at "v_deinterlacer_v3_00_a".

    C:\Users\steve\Downloads\v_deinterlacer_v3_00_a_tb​\v_dei

    nterlacer_v3_00_a_tbvmap v_deinterlacer_v3_00_a .\v_deinterlacer_v3_00_a

    Modifying modelsim.ini

    C:\Users\steve\Downloads\v_deinterlacer_v3_00_a_tb​\v_dei

    nterlacer_v3_00_a_tbvcom -work work -93 src\v_deinterlacer_u0.vhd

    Model Technology ModelSim DE vcom 10.1d Compiler 2012.11 Nov 1 2012

    -- Loading package STANDARD

    -- Loading package TEXTIO

    -- Loading package std_logic_1164

    ** Error: src\v_deinterlacer_u0.vhd(39): Library unisim not found.

    ** Error: src\v_deinterlacer_u0.vhd(40): (vcom-1136) Unknown identifier "UNISIM"

    .

    ** Error: src\v_deinterlacer_u0.vhd(41): (vcom-1136) Unknown identifier "UNISIM"

    .

    ** Error: src\v_deinterlacer_u0.vhd(43): VHDL Compiler exiting

    C:\Users\steve\Downloads\v_deinterlacer_v3_00_a_tb​\v_dei

    nterlacer_v3_00_a_tbvcom -work work -93 tb_src\include_deint_tb.vhd tb_src\a

    xi_model.vhd tb_src\bmp_reader.vhd tb_src\bmp_writer.vhd tb_src\yuv_rea

    der.vhd tb_src\vid_gold.vhd tb_src\vid_reader.vhd tb_src\vid_writer.vhd

    tb_src\testbench.vhd

    Model Technology ModelSim DE vcom 10.1d Compiler 2012.11 Nov 1 2012

    -- Loading package STANDARD

    -- Loading package TEXTIO

    -- Loading package std_logic_1164

    -- Loading package std_logic_arith

    -- Compiling package include_deint_tb

    -- Compiling package body include_deint_tb

    -- Loading package include_deint_tb

    -- Loading package STD_LOGIC_UNSIGNED

    -- Loading package include_deint_tb

    -- Compiling entity axi_model

    -- Compiling architecture behave of axi_model

    -- Compiling entity bmp_reader

    -- Compiling architecture behave of bmp_reader

    -- Compiling entity bmp_writer

    -- Compiling architecture behave of bmp_writer

    -- Compiling entity yuv_reader

    -- Compiling architecture behave of yuv_reader

    -- Compiling entity vid_gold

    -- Compiling architecture behave of vid_gold

    ** Error: tb_src\vid_reader.vhd(69): Library unisim not found.

    ** Error: tb_src\vid_reader.vhd(70): (vcom-1136) Unknown identifier "unisim".

    ** Error: tb_src\vid_reader.vhd(72): VHDL Compiler exiting

    C:\Users\steveDownloads\v_deinterlacer_v3_00_a_tb\​v_dei

    nterlacer_v3_00_a_tbvsim -gui -novopt -t ps -do mti_wave.do testbench

    So I presume there is some issue finding the unisim library.

    I have also run compxlib from within ISE 14.3 previously, using the commands:

    C:\Xilinx\14.3\ISE_DS\ISE\bin\nt64\unwrapped\compx​lib.exe -s mti_de -l all -p C:/modelsim_dlx_10.1d/win32pe -arch spartan6 -lib unisim -lib simprim -lib xilinxcorelib -lib edk -exclude_superseded -intstyle ise

    After removing the ‘REM’ comments from the run_mti batch file, I get the same message in the ModelSim transcript window as before :Error loading designand the following messages in the command prompt (ie the same issue with the unisim library):

    C:\Users\steve\Downloads\v_deinterlacer_v3_00_a_tb​\v_dei

    nterlacer_v3_00_a_tbREM Uncomment the following lines or run compxlib if you do

    not have the Xilinx Libraries already compiled for your simulator version

    C:\Users\steve\Downloads\v_deinterlacer_v3_00_a_tb​\v_dei

    nterlacer_v3_00_a_tbvlib unisim vmap unisim .\unisim

    Usage: vlib -help

    vlib [-short | -dos | -long | -unix ] [-archive [-compact compact]]

    [-unnamed_designs count] [(-lock|-unlock) design]

    [-locklib|-unlocklib] library_name

    C:\Users\steve\Downloads\v_deinterlacer_v3_00_a_tb​\v_dei

    nterlacer_v3_00_a_tbvcom -work unisim -93 \vhdl\src\unisims\unisim_VPKG.vhd

    Model Technology ModelSim DE vcom 10.1d Compiler 2012.11 Nov 1 2012

    ** Error: (vcom-19) Failed to access library 'unisim' at "unisim".

    No such file or directory. (errno = ENOENT)

    C:\Users\steve\Downloads\v_deinterlacer_v3_00_a_tb​\v_dei

    nterlacer_v3_00_a_tbvcom -work unisim -93 \vhdl\src\unisims\unisim_VCOMP.vhd

    Model Technology ModelSim DE vcom 10.1d Compiler 2012.11 Nov 1 2012

    ** Error: (vcom-19) Failed to access library 'unisim' at "unisim".

    No such file or directory. (errno = ENOENT)

    C:\Users\steve\Downloads\v_deinterlacer_v3_00_a_tb​\v_dei

    nterlacer_v3_00_a_tbfor /F %i IN (\vhdl\src\unisims\primitive\vhdl_analyze_orde

    r) DO @vcom -work unisim -93 \vhdl\src\unisims\primitive\%i

    The system cannot find the file \vhdl\src\unisims\primitive\vhdl_analyze_order.

    C:\Users\steve\Downloads\v_deinterlacer_v3_00_a_tb​\v_dei

    nterlacer_v3_00_a_tbvlib work

    ** Warning: (vlib-34) Library already exists at "work".

    C:\Users\steve\Downloads\v_deinterlacer_v3_00_a_tb​\v_dei

    nterlacer_v3_00_a_tbvmap work .\work

    Modifying modelsim.ini

    C:\Users\steve\Downloads\v_deinterlacer_v3_00_a_tb​\v_dei

    nterlacer_v3_00_a_tbvlib v_deinterlacer_v3_00_a

    ** Warning: (vlib-34) Library already exists at "v_deinterlacer_v3_00_a".

    C:\Users\steve\Downloads\v_deinterlacer_v3_00_a_tb​\v_dei

    nterlacer_v3_00_a_tbvmap v_deinterlacer_v3_00_a .\v_deinterlacer_v3_00_a

    Modifying modelsim.ini

    C:\Users\steve\Downloads\v_deinterlacer_v3_00_a_tb​\v_dei

    nterlacer_v3_00_a_tbvcom -work work -93 src\v_deinterlacer_u0.vhd

    Model Technology ModelSim DE vcom 10.1d Compiler 2012.11 Nov 1 2012

    -- Loading package STANDARD

    -- Loading package TEXTIO

    -- Loading package std_logic_1164

    ** Error: src\v_deinterlacer_u0.vhd(39): Library unisim not found.

    ** Error: src\v_deinterlacer_u0.vhd(40): (vcom-1136) Unknown identifier "UNISIM"

    .

    ** Error: src\v_deinterlacer_u0.vhd(41): (vcom-1136) Unknown identifier "UNISIM"

    .

    ** Error: src\v_deinterlacer_u0.vhd(43): VHDL Compiler exiting

    C:\Users\steve\Downloads\v_deinterlacer_v3_00_a_tb​\v_dei

    nterlacer_v3_00_a_tbvcom -work work -93 tb_src\include_deint_tb.vhd tb_src\a

    xi_model.vhd tb_src\bmp_reader.vhd tb_src\bmp_writer.vhd tb_src\yuv_rea

    der.vhd tb_src\vid_gold.vhd tb_src\vid_reader.vhd tb_src\vid_writer.vhd

    tb_src\testbench.vhd

    Model Technology ModelSim DE vcom 10.1d Compiler 2012.11 Nov 1 2012

    -- Loading package STANDARD

    -- Loading package TEXTIO

    -- Loading package std_logic_1164

    -- Loading package std_logic_arith

    -- Compiling package include_deint_tb

    -- Compiling package body include_deint_tb

    -- Loading package include_deint_tb

    -- Loading package STD_LOGIC_UNSIGNED

    -- Loading package include_deint_tb

    -- Compiling entity axi_model

    -- Compiling architecture behave of axi_model

    -- Compiling entity bmp_reader

    -- Compiling architecture behave of bmp_reader

    -- Compiling entity bmp_writer

    -- Compiling architecture behave of bmp_writer

    -- Compiling entity yuv_reader

    -- Compiling architecture behave of yuv_reader

    -- Compiling entity vid_gold

    -- Compiling architecture behave of vid_gold

    ** Error: tb_src\vid_reader.vhd(69): Library unisim not found.

    ** Error: tb_src\vid_reader.vhd(70): (vcom-1136) Unknown identifier "unisim".

    ** Error: tb_src\vid_reader.vhd(72): VHDL Compiler exiting

    C:\Users\steve\Downloads\v_deinterlacer_v3_00_a_tb​\v_dei

    nterlacer_v3_00_a_tbvsim -gui -novopt -t ps -do mti_wave.do testbench

    I have also tried running the ISim batch file run_isim, but ISim doesn’t load and the command prompt disappears too fast for me to tell what is going on, even when I try inserting ‘pause’ statements into the batch file. (I am running the file with adminstrator privileges.)

    The same problems occur when I download and try running v2.00 of the testbench. The v1.0 testbench batch file did run fine in ModelSim, but obviously this core functions completely differently to the V3.00 core.

    I am quite new to the Xilinx design tools in general, so any help with this would be much appreciated,

    Kind regards,

    Steve







    Solved!
    Go to Solution.

    DB:2.74:Unable To Get Xilinx Video Deinterlacer Test Bench V3.00 Working 3p


    Hi Satish,

    Many thanks for the response. The testbench is up and running now. The problem was due to my lack of knowledge of scripting and the ModelSim commands. I removed the 'REM' comments in the batch file using notepad instead of wordpad, and inadvertently removed the newline characters (which don't appear in notepad). Hence the batch file was trying to execute multiple ModelSim commands in the same line, and therefore not compiling the unisim libraries.

    Regards,

    Steve

  • RELEVANCY SCORE 2.74

    DB:2.74:Problem Compiling With Swing 99


    I am new to java.

    I have recently installed jdk-1.3.1_01 and am able to compile and run basic java programs. However, when trying to compile HelloWorldSwing.java, I get the following error:

    HelloWorldSwing.java:6: error:Cannot find class "JFrame" [JLS 8]

    Is this a classpath problem? Please help!

    DB:2.74:Problem Compiling With Swing 99

    yes, I'm sure the code is right. What is strange is that when I first installed jdk, I was able to compile and run the swing program. Once I closed the terminal, though, and opened a new one, I was unable to compile. I'm using Linux Mandrake 8.1. Any ideas?

  • RELEVANCY SCORE 2.74

    DB:2.74:Compling Ens Programs j1


    Hi,
    Can u please give the c compiling options for compiling Sample programs apub.c and asub.c.

    Regards
    msjeyabalan

    DB:2.74:Compling Ens Programs j1

    I found a Makefile decribed in a Calendar document and tried it out and it seems to work (with a bit of tinkering).

    The document is at:http://docs.sun.com/source/816-6712-10/introens.html

    I'm able to compile apub.c and asub.c. I haven't tested whether they run corectly. apub does return a message about the required options.

    Here's my slightly altered verson:

    #
    # Sample makefile
    #

    # your C compiler

    CC = gcc

    # LIBS

    BASE = /opt/SUNWics5/cal

    LIBS = -L$(BASE)/bin -lens -lgap -lxenp -lcyrus -lchartable -lyasr -lasync -lnspr3 -lplc3 -lplds3 -R$(BASE)/bin

    all: apub asub

    apub: apub.c
    $(CC) -o apub -I $(BASE)/csapi/include apub.c $(LIBS)

    asub: asub.c
    $(CC) -o asub -I $(BASE)/csapi/include asub.c $(LIBS)

  • RELEVANCY SCORE 2.74

    DB:2.74:I Get In Excel On Each File To Open The Info Mistake In Compiling Distmon And When Files Need To Be Closed Mistake In Compiling Autoexecnew c9


    Original Title: Excel 2010
    I did upload Office 2010 on a XP system with service pack 3 after delete Office 2003. Meanwhile I get in Excel on each file to open the info "Mistake in compiling DistMon" and when files need to be closed "Mistake in compiling AutoExecNew". Can someone help?

  • RELEVANCY SCORE 2.74

    DB:2.74:Problems Compiling C++ Programs.. zk



    Hi, Im having real problems compiling some C++ programs - ive tried Stellarium (Sky maps) and Hugin (Panorama software) and both fail with various errors.

    I wont post the full error logs here yet, because theres probably no need, but both the programs seem to use alot of .hxx files and complain about many undeclared variables.

    Anyone have any ideas what package ive missed?

    Thanks Dan

    DB:2.74:Problems Compiling C++ Programs.. zk

    sarah31 wrote:
    looks like a gcc issue on stellarium. looking at some ebuilds out there there is nothing really special needed to build it.

  • RELEVANCY SCORE 2.73

    DB:2.73:Internal Compiler Error kj


    Was in the middle of burning discs, I have three done, when doing the fourth this error came up. What does it mean? How can I resolve this issue? Help!
    Here is myh build log, I forgot to paste it on.

    Compiling Menu PGCs...
    Compiling Menu#1 (Main Menu)...
    Rendering Menu:Main Menu,Language:1...
    Compiling Menu#2 (Slideshow Menu)...
    Rendering Menu:Slideshow Menu,Language:1...
    Compiling Menu#3 (Video Loop Menu)...
    Rendering Menu:Video Loop Menu,Language:1...
    Compiling Menu#4 (Video Menu)...
    Rendering Menu:Video Menu,Language:1...
    Compiling Menu#5 (Standard Videos)...
    Rendering Menu:Standard Videos,Language:1...
    Generating Transition: VTSM #01, VOB #1...
    Internal Compiler Error

    DB:2.73:Internal Compiler Error kj

    Take a look here

    http://dvdstepbystep.com/layofland.php

    There is a a blue section and a green section towards the upper left, if you follow accross between them to the right (almost exactly under the sixth icon in from the left in the red section) you will see a button that will toggle the view to VTS

    As to AC3 and Compressor, go down to step 4 in the following

    http://dvdstepbystep.com/fasttrackover.php

    There is also a movie with details at the bottom of the page (click the link) about 1 minute into the movie is Compressor

  • RELEVANCY SCORE 2.73

    DB:2.73:Wdk 7.1 Win7 X86 Compiling Error p3


    Hi,
    I'm trying to compile WDM codes on Win7 x86 Checked Built Environment.
    I have two different dokument, first one compiled succesfully but i have problems with other one;
    i opened the compiler and go to my code's directory then wrote BLD and result
    C:\deneme\apco25_vpcc_device_driverBLD
    BUILD: Compile and Link for x86
    BUILD: Loading c:\winddk\build.dat...
    BUILD: Computing Include file dependencies:
    BUILD: Start time: Wed Feb 09 15:18:53 2011
    BUILD: Examining c:\deneme\apco25_vpcc_device_driver directory for files to comp
    ile.
    c:\deneme\apco25_vpcc_device_driver Invalidating OACR warning log for 'root:
    x86chk'
    BUILD: Saving c:\winddk\build.dat...
    BUILD: Compiling and Linking c:\deneme\apco25_vpcc_device_driver directory
    Configuring OACR for 'root:x86chk' - OACR on
    Compiling resources - driver.rc
    Compiling - apco25_vpcc_driver_entry.cpp
    Compiling - apco25_vpcc_read_write.cpp
    Compiling - apco25_vpcc_queue_wr_functions.cpp
    Compiling - stddcls.cpp
    Compiling - generating code...
    1errors in directory c:\deneme\apco25_vpcc_device_driver
    1NMAKE : fatal error U1073: don't know how to make '\apco25_vpcc_driver_generic
    _functions\objchk_win7_x86\i386\apco25_vpcc_driver_generic_functions.lib'
    1nmake.exe /nologo BUILDMSG=Stop. -i BUILD_PASS=PASS2 LINKONLY=1 NOPASS0=1 MAKE
    DIR_RELATIVE_TO_BASEDIR= failed - rc = 2
    BUILD: Finish time: Wed Feb 09 15:18:54 2011
    BUILD: Done
    7 files compiled - 5 Warnings - 2 Errors

    I couldnt find the reason, pls take me a hand...
    Thanks,
    Osman.

    DB:2.73:Wdk 7.1 Win7 X86 Compiling Error p3

    for posterity and others who hit this problem, how?d -- This posting is provided AS IS with no warranties, and confers no rights.

  • RELEVANCY SCORE 2.73

    DB:2.73:Runtime Error For All Programs zp


    i recently installed the jdk 1.5.0 in windows xp sp2. i have no problems in compiling a program, but whenever i run it, i get a error : "Exception in thread main : java.Lang.NoClassDefFoundError ". this error occurs for all the programs i try to run

    this happens even though the class file is located in the bin directory. also i have tried reinstalling both the jre and jdk, but still no effect. what gets me confused is that the same code runs just fine on linux .

    can some one help me out??

    DB:2.73:Runtime Error For All Programs zp

    Change the cmd window prompt to a directory that contains your .class file and issue this command:

    java -cp . nameOfYourClass

    IMPORTANT: Include the period and the surrounding spaces

    If that works, learn to use the classpath, here:
    http://java.sun.com/j2se/1.5.0/docs/tooldocs/index.html#general

  • RELEVANCY SCORE 2.73

    DB:2.73:Java Invokation Api 78


    Hi,
    I am working on Java Invokation API. I am using Java 1.4.1. I wrote a C program to load JVM from a C program and invoke a method of a java class. I complete this program with the help of example programs on Java 1.3.1. For executing those programs, we need jvm.dll. The jvm.lib is used for compilation as a wraper so it is compiling w/o error. I am using Windows 2002 and Java 1.4.1. In Java1.3.1 the corresponding jvm.dll is in j2sdk1.4.1\jre\bin\classic\. But there is no such directory in Java 1.4.1, instead there are two directories j2sdk1.4.1\jre\bin\server and j2sdk1.4.1\jre\bin\client\. I think they are used for RMI. The pgm is compiling. But if we put path to either client or server instead of classic (Since there is no classic directory), the method in the java class is not getting executed. That is the Jvm is loading successfully, I am getting the class and Methid id. But that methid is not getting executed. Where is that jvm.dll in Java 1.4.1? Could you please help in resolving the problem .

    Yours Sincerely
    Joby P. Thomas,

    DB:2.73:Java Invokation Api 78

    Hi,
    I am working on Java Invokation API. I am using Java 1.4.1. I wrote a C program to load JVM from a C program and invoke a method of a java class. I complete this program with the help of example programs on Java 1.3.1. For executing those programs, we need jvm.dll. The jvm.lib is used for compilation as a wraper so it is compiling w/o error. I am using Windows 2002 and Java 1.4.1. In Java1.3.1 the corresponding jvm.dll is in j2sdk1.4.1\jre\bin\classic\. But there is no such directory in Java 1.4.1, instead there are two directories j2sdk1.4.1\jre\bin\server and j2sdk1.4.1\jre\bin\client\. I think they are used for RMI. The pgm is compiling. But if we put path to either client or server instead of classic (Since there is no classic directory), the method in the java class is not getting executed. That is the Jvm is loading successfully, I am getting the class and Methid id. But that methid is not getting executed. Where is that jvm.dll in Java 1.4.1? Could you please help in resolving the problem .

    Yours Sincerely
    Joby P. Thomas,

  • RELEVANCY SCORE 2.73

    DB:2.73:Compiling All Abap Programs In Ecc6.0 33



    hi,

    i need the T-code for compiling all programs in sap. any help would be appreciated

    thanks

    mohan

    DB:2.73:Compiling All Abap Programs In Ecc6.0 33


    No interview questions.

    No research done

    Read the "Rules of Engagement"

    This info is widely available...

    Regards

    Juan

  • RELEVANCY SCORE 2.73

    DB:2.73:Any Instrcution On Compiling Wps V2.2 ? 8s



    Dear Experts,

    Is there any instruction for compiling WPS (WRF PREPROCESSING) V2.2? I followed the instruction (http://software.intel.com/en-us/articles/performance-tools-for-software-developers-building-wrf-with-the-intel-compilers/) for compiling WRF and it works fine. However, when I try to compile WPS, it appears that the program only provide options for compiling using PGI compiler (however, WRF V2.2 provide intel option, that's wired.). I tried to edit the configure.wps based on my experience from working with WRF V3, but no success.

    Any help will be much appreciated!

    DB:2.73:Any Instrcution On Compiling Wps V2.2 ? 8s


    Not for WPS 2.2, but WPS 3.1 has this article:

    http://software.intel.com/en-us/articles/wrf-and-wps-v311-installation-b...

    The WPS portion is about halfway down the page.

  • RELEVANCY SCORE 2.72

    DB:2.72:Trouble Compiling zz


    My JDK tools are in C:\Program Files\Java\jdk1.5.0_01\bin and im putting my source codes in C:Java Programs. The Problem that i am having is that i can't seem to get javac to compile my codes in Java Programs folder. If there is anyone that can help me. Thanks

    DB:2.72:Trouble Compiling zz

    Thanks lutogoog 1337 finaly got MyProgram to compile This problem has been driving me mad so thanks again.

  • RELEVANCY SCORE 2.72

    DB:2.72:Not Able To Run Servlet Programs mx


    I`d been trying to run a simple servlet program on my PC. But after compiling I`am constantly getting message
    "The package javax.servlet not recognised"

    what should i do, please help

    i have installed j2sdk1.4.2.13 and j2sdkee1.3.1 i had also tried the higher versions that is jdk6 and Java EE 5 SDK but the problem remained.

    DB:2.72:Not Able To Run Servlet Programs mx

    That is always a classpath issue. Fix your classpath so it uses the J2ee.jar. If you are using an IDE you will have to look up how to add JARs to the IDE's classpath, which is usually not the same as the system classpath.

  • RELEVANCY SCORE 2.72

    DB:2.72:Some Programs Not Loading And Showing Up On The Screen Correctly 3z


    When i open some of my programs (ie hp photo creations and now avery) it loads correctly but I can't see everything on the screen. I've tried messing with the resolution, but I don't know enough to fix it. The program loads correctly and lets me navigate,
    but I can't see all the links I can click on or menu options. With photo creations, it doesn't show any images. Looking for some help.

    DB:2.72:Some Programs Not Loading And Showing Up On The Screen Correctly 3z

    Hi,

    This behavior can occur due to issues with display drivers.

    -What is the make and model number of the computer?

    To fix this issue, I would suggest you to visit computer manufacturer website and install the latest display driver. To get the best display on your monitor, you may also refer to this link and check if it makes any difference:

    http://windows.microsoft.com/en-US/windows-8/get-best-display-monitor

    After updating the display driver check the difference. Let us know the status of the issue.

  • RELEVANCY SCORE 2.72

    DB:2.72:Servlets Not Compiling d3


    Hi all,

    I am using tomcat 5.5 and did all the classpath and path setting , but my servlet is not compiling , what to do ?
    Please help me , How should I configure this .

    Thnx

    DB:2.72:Servlets Not Compiling d3

    The only thing you need to compile a servlet is the servlet-api.jar file in the tomcat\common\lib directory. Make sure it is part of your classpath and servlets should compile. If not then something else is wrong, so investigate the error you are getting from the compiler (or post it here if you really have no clue).

  • RELEVANCY SCORE 2.72

    DB:2.72:Looking For Neko Nots Posted On Sqlcxt Error...Plz Help 8c


    I m looking for a message posted by

    neko poseted on sqlcxt

    where i can find help on setting

    envoirnment variables,
    pcscfg.cfg

    for compiling sample programs of proc
    Oracle8i (8.1.7) and linux.

    if anyone plz i'll really thankful to u.

    Naveed.
    naveed_kunjahi@hotmail.com

    DB:2.72:Looking For Neko Nots Posted On Sqlcxt Error...Plz Help 8c

    Ok !
    First, check if your pcscfg.cfg file (in $ORACLE_HOME/precomp/admin) contain some necessary include files path

    ---- pcscfg.cfg ----
    sys_include=(/usr/include)
    sys_include=/usr/i486-glibc20-linux/include
    sys_include=/usr/src/linux/include/linux
    sys_include=/usr/lib/gcc-lib/i386-redhat-linux/egcs-2.91.66/include
    include=(/u01/app/oracle/product/816/precomp/public)
    include=/u01/app/oracle/product/816/precomp/hdrs
    include=/u01/app/oracle/product/816/tpcc2x_2/src
    include=/u01/app/oracle/product/816/precomp/include
    include=/u01/app/oracle/product/816/oracore/include
    include=/u01/app/oracle/product/816/oracore/public
    include=/u01/app/oracle/product/816/rdbms/include
    include=/u01/app/oracle/product/816/rdbms/public
    include=/u01/app/oracle/product/816/rdbms/demo
    include=/u01/app/oracle/product/816/nlsrtl/include
    include=/u01/app/oracle/product/816/nlsrtl/public
    include=/u01/app/oracle/product/816/network_src/include
    include=/u01/app/oracle/product/816/network_src/public
    include=/u01/app/oracle/product/816/network/include
    include=/u01/app/oracle/product/816/network/public
    include=/u01/app/oracle/product/816/plsql/public
    ltype=short
    ---- End ----

    after that, add in sysliblist file ($ORACLE_HOME/lib)
    all libs name (.a) preceded by -l, and with no extension
    ex:
    with -- libclient8.a
    write -- -lclient8 in the sysliblist file

    here we have :
    ---- sysliblist ----
    -lagent8 -laurora -lclient8 -lcommon8 -lcore8 -lctx8 -lctxc8 -lctxs8 -ldbicx
    8 -lgeneric8 -lgslavl8 -lgslber_s8 -lgsldb8 -lgslr8 -lgslsg8 -lgslssb8 -lgslssf8
    -lgx8 -lldapclnt8 -lmm -ln8 -lnbeq8 -lnent8 -lnhost8 -lnl8 -lnldap8 -lnls8
    -lnoname8 -lnro8 -lnsgr8 -lnsslb8 -lntcp8 -lntcps8 -lntns8 -lnus8 -lnzjs8
    -lordim8 -lordsdo8 -lordts8 -lordvirt8 -lplc8 -lplp8 -lpls8 -lpsa8 -lserver8
    -lsgsl_s8-lslax8 -lslpm -lsql8 -lsqlplus -lsvrmgrl -ltrace8 -ltracefe8 -ltracept8
    -lvsn8 -lzx8
    ---- End ----

    Third, setting the environments variables :
    in your .bash_profile file add :

    PATH=.:/usr/local/bin:/bin:/usr/bin:/usr/X11R6/bin:/home/oracle/bin:/u01/app/oracle/product/816/bin:/u01/app/oracle/product/816/ctx/lib

    LD_LIBRARY_PATH=/u01/app/oracle/product/816/ctx/lib:/u01/app/oracle/product/816/lib:/usr/lib/usr/X11R6/lib

    Now with your oracle login, do make sample.
    with another login use the demo_proc.mk makefile:
    make -f $ORACLE_HOME/precomp/demo/proc/demo_proc.mk build OBJS=sample.o EXE=sample

    This is finish ;) I hope that this work fine in your system

    A+
    :: NeKo ::
    [a little french oracle coder, so sorry by this poor english]

  • RELEVANCY SCORE 2.72

    DB:2.72:Errors Compiling C++ Programs For Cin xs



    Hello,

    I am using Microsoft Visual C++ C to compile my .cpp program to build a .lsb. I have the following errors.

    LINK : warning LNK4098: defaultlib "LIBCMTD" conflicts with use of other libs; use /NODEFAULTLIB:library
    cin.obj : error LNK2001: unresolved external symbol _CINRun

    Cany anyone help, please?

    Beanie

    DB:2.72:Errors Compiling C++ Programs For Cin xs

    Hi Beanie,What National Instruments software are you using?Check this out first. If it doesn't help, explain more about what software you are usingGood luck



    Van LNI Applications Engineer

  • RELEVANCY SCORE 2.72

    DB:2.72:Simulation Problem With Pci Express Endpoint_Pipe V1.7-Help???!! ms



    I have used the modelsim se6.1b+ISE 10.1webpack to do the simulation of PCI-E endpoint_pipe v1.7 example design,the fault occer:

    cd C:/coregen/endpoint_pipe/simulation/functionaldo C:/coregen/endpoint_pipe/simulation/functional/sim​ulate_mti.do# ** Warning: (vlib-34) Library already exists at "work".# Reading C:\Modeltech_6.1b\win32/../modelsim.ini# "work" maps to directory work. (Default mapping)# Model Technology ModelSim SE vlog 6.1b Compiler 2005.09 Sep 8 2005# ** Warning: (vlog-2103) Directory "C:\Xilinx\10.1\ISE/smartmodel/lin/wrappers/mtiver​ilog" for -y option not found.# -- Compiling module px1011a# -- Compiling module boardx01# -- Compiling module sys_clk_gen# -- Compiling module sys_clk_gen_ds# -- Compiling module xilinx_pci_exp_1_lane_epipe_ep# -- Compiling module endpoint_pipe# -- Compiling module glbl# -- Compiling module pci_exp_32b_app# -- Compiling module PIO_EP# -- Compiling module PIO_EP_MEM_ACCESS# -- Compiling module EP_MEM# -- Compiling module PIO_32_RX_ENGINE# -- Compiling module PIO_32_TX_ENGINE# -- Compiling module PIO_TO_CTRL# -- Compiling module PIO# -- Compiling module xilinx_pci_exp_1_lane_downstream_port# -- Compiling module xilinx_pci_exp_1_lane_dsport# -- Compiling module dsport_cfg# -- Compiling module pci_exp_usrapp_rx# -- Compiling module pci_exp_usrapp_tx# -- Compiling module pci_exp_usrapp_com# -- Compiling module pci_exp_usrapp_cfg# -- Compiling module pci_exp_1_lane_64b_dsport# -- Scanning library directory 'C:\Xilinx\10.1\ISE/verilog/src/simprims'# -- Scanning library directory 'C:\Xilinx\10.1\ISE/verilog/src/unisims'# -- Compiling module OBUF# -- Compiling module IBUF# -- Compiling module VCC# -- Compiling module GND# -- Compiling module INV# -- Compiling module FD# -- Compiling module SRL16# -- Compiling module FDE# -- Compiling module SRL16E# -- Compiling module LUT4_L# -- Compiling module LUT4_D# -- Compiling module LUT3_L# -- Compiling module LUT3_D# -- Compiling module LUT2_D# -- Compiling module LUT2_L# -- Compiling module MUXF5# -- Compiling module LUT2# -- Compiling module LUT3# -- Compiling module LUT4# -- Compiling module FDP# -- Compiling module FDR# -- Compiling module BUF# -- Compiling module LUT1# -- Compiling module FDRSE# -- Compiling module FDRE# -- Compiling module FDCE# -- Compiling module FDRS# -- Compiling module FDS# -- Compiling module MUXF6# -- Compiling module MUXCY# -- Compiling module XORCY# -- Compiling module FDSE# -- Compiling module SRLC16E# -- Compiling module RAMB16_S9_S9# -- Compiling module FDPE# -- Compiling module FDC# -- Compiling module RAM16X1D# -- Compiling module FDDRCPE# -- Compiling module BUFG# -- Compiling module DCM# -- Compiling module dcm_clock_divide_by_2# -- Compiling module dcm_maximum_period_check# -- Compiling module dcm_clock_lost# -- Compiling module RAMB16_S36_S36# -- Compiling module GT11CLK_MGT# -- Compiling module LUT1_L# -- Compiling module DCM_ADV# -- Compiling module dcm_adv_clock_divide_by_2# -- Compiling module dcm_adv_maximum_period_check# -- Compiling module dcm_adv_clock_lost# -- Compiling module MUXCY_L# -- Compiling module SRLC16# -- Compiling module GT11# -- Compiling module MULT_AND# -- Compiling module RAMB16_S18_S18# -- Scanning library directory 'C:\Xilinx\10.1\ISE/verilog/src/simprims'# -- Scanning library directory 'C:\Xilinx\10.1\ISE/verilog/src/unisims'# # Referenced (but uncompiled) modules or primitives:# GT11_SWIFT# # Top level modules:# boardx01# glbl# vsim +notimingchecks +TESTNAME=sample_smoke_test0 -L work work.boardx01 glbl # Loading work.boardx01# Loading work.px1011a# Loading work.xilinx_pci_exp_1_lane_epipe_ep# Loading work.OBUF# Loading work.IBUF# Loading work.pci_exp_32b_app# Loading work.PIO# Loading work.PIO_EP# Loading work.PIO_EP_MEM_ACCESS# Loading work.EP_MEM# Loading work.RAMB16_S36_S36# Loading work.PIO_32_RX_ENGINE# Loading work.PIO_32_TX_ENGINE# Loading work.PIO_TO_CTRL# Loading work.endpoint_pipe# Loading work.VCC# Loading work.GND# Loading work.INV# Loading work.FD# Loading work.SRL16# Loading work.FDE# Loading work.SRL16E# Loading work.LUT4_L# Loading work.LUT4_D# Loading work.LUT3_L# Loading work.LUT3_D# Loading work.LUT2_D# Loading work.LUT2_L# Loading work.MUXF5# Loading work.LUT2# Loading work.LUT3# Loading work.LUT4# Loading work.FDP# Loading work.FDR# Loading work.BUF# Loading work.LUT1# Loading work.FDRSE# Loading work.FDRE# Loading work.FDCE# Loading work.FDRS# Loading work.FDS# Loading work.MUXF6# Loading work.MUXCY# Loading work.XORCY# Loading work.FDSE# Loading work.SRLC16E# Loading work.RAMB16_S9_S9# Loading work.FDPE# Loading work.FDC# Loading work.RAM16X1D# Loading work.FDDRCPE# Loading work.BUFG# Loading work.DCM# Loading work.xilinx_pci_exp_1_lane_downstream_port# Loading work.xilinx_pci_exp_1_lane_dsport# Loading work.GT11CLK_MGT# Loading work.pci_exp_1_lane_64b_dsport# Loading work.LUT1_L# Loading work.DCM_ADV# Loading work.dcm_adv_clock_divide_by_2# Loading work.dcm_adv_maximum_period_check# Loading work.dcm_adv_clock_lost# Loading work.MUXCY_L# Loading work.SRLC16# Loading work.GT11# ** Error: (vsim-3033) C:/Xilinx/10.1/ISE/verilog/src/unisims/GT11.v(2563​): Instantiation of 'GT11_SWIFT' failed. The design unit was not found.# Region: /boardx01/xilinx_pci_exp_1_lane_downstream_port/xi​linx_pci_exp_1_lane_dsport/pci_exp_1_lane_64b_dspo​rt/plm_v4f_mgt_gt11_by1_GT11_PCIEXP_2_INST# Searched libraries:# work# work# ** Error: (vsim-3033) C:/Xilinx/10.1/ISE/verilog/src/unisims/GT11.v(2563​): Instantiation of 'GT11_SWIFT' failed. The design unit was not found.# Region: /boardx01/xilinx_pci_exp_1_lane_downstream_port/xi​linx_pci_exp_1_lane_dsport/pci_exp_1_lane_64b_dspo​rt/plm_v4f_mgt_gt11_by1_GT11_PCIEXP_2_INST2# Searched libraries:# work# work# Loading work.MULT_AND# Loading work.RAMB16_S18_S18# Loading work.dsport_cfg# Loading work.pci_exp_usrapp_rx# Loading work.pci_exp_usrapp_tx# Loading work.pci_exp_usrapp_cfg# Loading work.pci_exp_usrapp_com# Loading work.sys_clk_gen_ds# Loading work.sys_clk_gen# Loading work.glbl# Error loading design# Error: Error loading design # Pausing macro execution # MACRO C:\coregen\endpoint_pipe\simulation\functional\sim​ulate_mti.do PAUSED at line 8

    DB:2.72:Simulation Problem With Pci Express Endpoint_Pipe V1.7-Help???!! ms


    Do you know if you compiled your libraries for Modelsim?

    You should see them in your Libraries tab.

    The Libraries that you should see is the "secureip" and "unisims_ver" libraries.

    If you have them compiled, then you need to make sure that your vsim command uses these libraries.

    You'll need to add the following to you vsim command:

    -L unisims_ver

    -L secureip

  • RELEVANCY SCORE 2.71

    DB:2.71:Burn Failure Because "Video Bitrate Too High" zf


    Hi all, I'm trying to burn a dvd with 10 short films on it and just got this error:

    Starting DVD Build TESTING_DVD...
    Compiler Initializing...
    Precompiling Project TESTING_DVD
    Compiling VMG Information...
    Created 25 PGCs in VTSM1
    Created 5 PGCs in VTSM2
    Created 13 PGCs in VMG.
    19 Menu(s) will be created...
    Compiling Menu PGCs...
    Compiling Menu#1 (Ravens)...
    Rendering Menu:Ravens,Language:1...
    Compiling Menu#2 (Cowboys in Kosovo)...
    Rendering Menu:Cowboys in Kosovo,Language:1...
    Compiling Menu#3 (Red Rubber Boots)...
    Rendering Menu:Red Rubber Boots,Language:1...
    Compiling Menu#4 (Images From the Corner)...
    Rendering Menu:Images From the Corner,Language:1...
    Compiling Menu#5 (House of Wisdom)...
    Rendering Menu:House of Wisdom,Language:1...
    Compiling Menu#6 (A Conversation with Haris)...
    Rendering Menu:A Conversation with Haris,Language:1...
    Compiling Menu#7 (Its Only Mine)...
    Rendering Menu:Its Only Mine,Language:1...
    Compiling Menu#8 (I Don't Know Where)...
    Rendering Menu:I Don't Know Where,Language:1...
    Compiling Menu#9 (Father, Son, Holy Ghost)...
    Rendering Menu:Father, Son, Holy Ghost,Language:1...
    Compiling Menu#10 (Menu 1)...
    Rendering Menu:Menu 1,Language:1...
    Compiling Menu#11 (Menu 3)...
    Rendering Menu:Menu 3,Language:1...
    Compiling Menu#12 (About AMMAM)...
    Rendering Menu:About AMMAM,Language:1...
    Compiling Menu#13 (Zel bio)...
    Rendering Menu:Zel bio,Language:1...
    Compiling Menu#14 (Roberto bio)...
    Rendering Menu:Roberto bio,Language:1...
    Compiling Menu#15 (Corrine bio)...
    Rendering Menu:Corrine bio,Language:1...
    Compiling Menu#16 (Jasmila bio)...
    Rendering Menu:Jasmila bio,Language:1...
    Compiling Menu#17 (Sheila bio)...
    Rendering Menu:Sheila bio,Language:1...
    Compiling Menu#18 (HoW statement)...
    Rendering Menu:HoW statement,Language:1...
    Compiling Menu#19 (CiK statement)...
    Rendering Menu:CiK statement,Language:1...
    Writing VIDEO_TS.VOB
    Compiling Menu PGCs...
    Writing VTS020.VOB
    2 VTSs and 12 Titles will be created...
    Compiling VTS#1 (Animation demo)...
    Muxing VTS011.VOB
    Done.
    Compiling VTS#2 (Play All)...
    Writing VTS020.VOB
    Muxing VTS021.VOB
    Video Bitrate Too High

    Build cancelled
    Formatting finished.
    Building was not successful. See log.

    Does this mean the first film in the Play All track needs to be adjusted? Or that they all need to be adjusted? And adjusted to what? They fit on the disc in terms of space. Please help!

    Message was edited by: ErinSayHi

    DB:2.71:Burn Failure Because "Video Bitrate Too High" zf

    Hi.
    I'm having a similar problem here.
    This is the log I get:

    Starting DVD Build DEMOREELOMARVELAZQUEZ...
    Compiler Initializing...
    Precompiling Project DEMOREELOMARVELAZQUEZ
    Parsing Assets...
    Encoding Assets...
    Compiling VMG Information...
    Created 7 PGCs in VTSM1
    Created 5 PGCs in VTSM2
    Created 14 PGCs in VMG.
    1 Menu(s) will be created...
    Compiling Menu PGCs...
    Compiling Menu#1 (Menu Principal)...
    Writing VIDEO_TS.VOB
    Compiling Menu PGCs...
    Writing VTS020.VOB
    2 VTSs and 4 Titles will be created...
    Compiling VTS#1 (Pizarra Ldica Omar)...
    Muxing VTS011.VOB
    Done.
    Compiling VTS#2 (Track Spots)...
    Writing VTS020.VOB
    Muxing VTS021.VOB
    Video Bitrate Too High

    Build cancelled
    Formatting finished.
    Building was not successful. See log.

    This is a project that I already had burned to DVD with no problems whatsoever, but I recently moved from OSX 10.4 to OSX 10.5 and also moved from DVDSP 3 to DVDSP 4 and there my problem began. At the moment I have 768mb of RAM and I'm aware that DVDSP 4 is asking me for at least 1gb to work properly. Would the RAM be the problem?.

    I hope you can help me out.

    Thanx.
    Omar

  • RELEVANCY SCORE 2.71

    DB:2.71:Class Loader Issue c8


    When compiling a .java file the class loader fails to load a seperate class file being called from the same directory.

    See verbose output:

    C:\tempjavac class4.java -verbose
    [parsing started class4.java]
    [parsing completed 110ms]
    [loading C:\j2sdk1.4.1\jre\lib\rt.jar(java/lang/Object.class)]
    [loading C:\j2sdk1.4.1\jre\lib\rt.jar(java/lang/String.class)]
    [checking Class4]
    [loading C:\j2sdk1.4.1\jre\lib\rt.jar(java/lang/System.class)]
    [loading C:\j2sdk1.4.1\jre\lib\rt.jar(java/io/PrintStream.class)]
    [loading C:\j2sdk1.4.1\jre\lib\rt.jar(java/io/FilterOutputStream.class)]
    [loading C:\j2sdk1.4.1\jre\lib\rt.jar(java/io/OutputStream.class)]
    class4.java:14: cannot resolve symbol
    symbol : variable Keyboard
    location: class Class4
    i = Keyboard.readInt();
    ^
    class4.java:18: cannot resolve symbol
    symbol : variable Keyboard
    location: class Class4
    j = Keyboard.readInt()

    Here is the output from the same two files compiled on a different machine.

    C:\Tempjavac class4.java -verbose
    [parsing started class4.java]
    [parsing completed 170ms]
    [loading C:\j2sdk1.4.1\jre\lib\rt.jar(java/lang/Object.class)]
    [loading C:\j2sdk1.4.1\jre\lib\rt.jar(java/lang/String.class)]
    [checking Class4]
    [loading C:\j2sdk1.4.1\jre\lib\rt.jar(java/lang/System.class)]
    [loading C:\j2sdk1.4.1\jre\lib\rt.jar(java/io/PrintStream.class)]
    [loading C:\j2sdk1.4.1\jre\lib\rt.jar(java/io/FilterOutputStream.class)]
    [loading C:\j2sdk1.4.1\jre\lib\rt.jar(java/io/OutputStream.class)]
    [loading .\Keyboard.class]
    [loading C:\j2sdk1.4.1\jre\lib\rt.jar(java/lang/StringBuffer.class)]
    [wrote Class4.class]
    [total 861ms]

    Any help would be great, but please don't tell me I'm using an undeclaired variable. The files used on each PC are identical.

    Thanks

    DB:2.71:Class Loader Issue c8

    Can I overcome this problem long term by adding
    .;%CLASSPATH% to the environment variables on this
    machine?Generally alot of people add the ".;" piece to their CLASSPATH environment variable, but IMO it's a bad idea to have this "global" CLASSPATH environment variable in the first place, as you may have several Java programs you need to run, each possibly with their own, unique, classpath requirement. So a better solution is to either type in the classpath parameter to the command-line tools (which can get tedious if long) or create .cmd / .bat files containing the command lines.

  • RELEVANCY SCORE 2.71

    DB:2.71:Error Compiling Movie 9z



    hii i am workong on a hd files on premire cs6 and when trying to export them on a quichtime HD the following message pop up "error compiling movie :unkown error" but when exporting with pal dv wide screen their is no problem any help plzz

    my client want the files today

    DB:2.71:Error Compiling Movie 9z


    The Max Depth setting is under the the video tab in the export settings and Max Render Quality is at the bottom of the export panel

    Eric

    ADK

  • RELEVANCY SCORE 2.71

    DB:2.71:Java Invokation Api 1f


    Hi,
    I am working on Java Invokation API. I am using Java 1.4.1. I wrote a C program to load JVM from a C program and invoke a method of a java class. I complete this program with the help of example programs on Java 1.3.1. For executing those programs, we need jvm.dll. The jvm.lib is used for compilation as a wraper so it is compiling w/o error. I am using Windows 2002 and Java 1.4.1. In Java1.3.1 the corresponding jvm.dll is in j2sdk1.4.1\jre\bin\classic\. But there is no such directory in Java 1.4.1, instead there are two directories j2sdk1.4.1\jre\bin\server and j2sdk1.4.1\jre\bin\client\. I think they are used for RMI. The pgm is compiling. But if we put path to either client or server instead of classic (Since there is no classic directory), the method in the java class is not getting executed. That is the Jvm is loading successfully, I am getting the class and Methid id. But that methid is not getting executed. Where is that jvm.dll in Java 1.4.1? Could you please help in resolving the problem .

    Yours Sincerely
    Joby P. Thomas
    jobyp@ivega.com

    DB:2.71:Java Invokation Api 1f

    Joby,

    By the way, please don't cross post in the forums it really annoys a lot of people.

    Many thanks,

    Dom.

  • RELEVANCY SCORE 2.71

    DB:2.71:Compile .Java File In Xcode 8c


    I am new to programming in java and can only make simple programs in the console. I do this with a .java file, and then compiling it and running the .class file. On windows, I simply use javac.exe and java.exe. On the mac, how can I compile a .java file and run it with xcode.

    DB:2.71:Compile .Java File In Xcode 8c

    Not bad. But I'd rather use xcode. How do I do this.

  • RELEVANCY SCORE 2.71

    DB:2.71:Executing A C Program In Visual Studio 2005 s3


    I am a novice programmer (noob) who needs help with compiling and executing C code with C++ Visual Studio 2005. I have renamed the document to end with .c so the compiler will acknowledge C syntax. Another topic on the forum about compling helped but it didnt show how to execute the program. I need help executing a simple program after successfully compling. Also, I usually code simple programs using Emacs on an XWin32 machine. It outputs through a terminal window. I would assume that Visual Studio outputs to MS-DOS and if so, is there a way to run the source code via MS-DOS?  I guess my main question is, how do I run a program after successfully compiling it in C++ Visual Studio 2005? Thanks in advance.

    DB:2.71:Executing A C Program In Visual Studio 2005 s3

    I want to thank cgraus for your reply to his question. I had the same problem. I am also noob programmer and could execute it after I successfully compiled it. Thanks very much.  This post was a big help.

  • RELEVANCY SCORE 2.71

    DB:2.71:Re-Compiling Service? zm


    "Does NI or anyone else offer a service to compile Mac LabView programs into applications to run in Windows and Linux?"

    DB:2.71:Re-Compiling Service? zm

    Just a bit of clarification. All LabVIEW VIs are compiled. A standalone application is built from the compiled VIs. If you need a built application, I would contact an Alliance member company to see how much they would charge. It might be a little or it might be a lot if the original Windows VIs used a lot of platform specific functions, (i.e. ActiveX). Go to http://www.ni.com/alliance/ to find a list of Alliance members.

  • RELEVANCY SCORE 2.70

    DB:2.70:Jni And Stl Undr Sun C++ 6 Compiler 9p


    Compiling a shared library (for loading by VM) according JNI specification
    i get "library not found" error in runtime.
    This error does not appear when compiling the same code with g++
    or erasing all STL related code fragments.
    Has anybody an idea, what is the reason and hoe to fix the problem?

    DB:2.70:Jni And Stl Undr Sun C++ 6 Compiler 9p

    Compiling a shared library (for loading by VM) according JNI specification
    i get "library not found" error in runtime.
    This error does not appear when compiling the same code with g++
    or erasing all STL related code fragments.
    Has anybody an idea, what is the reason and hoe to fix the problem?

  • RELEVANCY SCORE 2.70

    DB:2.70:J2me Programs And Compiling mp


    has anyone managed to get any programs off the ground using the J2ME libries?

    I want to write to MIDlets for my mobile phone but cant find the same support and documentation that is available with all the other java classes

    how do i include the libries in my programs and what compiler do i use?

    DB:2.70:J2me Programs And Compiling mp

    or just go to http://java.sun.com/j2me/

    lots of information and helpful stuff about the J2ME universe.

    good luck and have fun!!

  • RELEVANCY SCORE 2.70

    DB:2.70:Compiling Tools.H++ Programs: Error: Ws Is Not Defined ap


    I am trying to compile some of the sample RogueWave (Tools.h++)
    programs provided with the distribution. For example, compiling
    the sortvec.cpp program results in the following errors:

    all from rw7/rw/vstream.h:

    - ws is not defined
    - the name ios is ambiguous, ios and std:ios

    - ... other errors related to ios

    What am i missing? I typed:

    CC sortvec.cpp

    We seem to be using version SC5.0

    Bowden
    wisegb@crd.ge.com

    DB:2.70:Compiling Tools.H++ Programs: Error: Ws Is Not Defined ap

    Please check out that when you tell compiler the location of the include files (for RW) with -I option, you dont give /rw.
    for eg., it should be
    -I/opt/SUNWspro/SC4.2/include/CC/rw7
    and not
    -I/opt/SUNWspro/SC4.2/include/CC/rw7/rw

    reg

  • RELEVANCY SCORE 2.70

    DB:2.70:Compiling And Linking Pro*C 1p


    Hi All.

    i want to know the complete process os compiling and linking Pro*c programs.

    Q:1. Do i need to install visual studio?
    Q:2. If yes, please tell me complete procedure for setting environment variables and usage.
    Q:3. If visual studio is not required, how can i compile and link Pro*c programs.

    i heard that we can compile and link using COMPLINK.BAT
    if yes, how to set the complink.bat into execution(ie any paths need to be modified in .bat file)

    need help urgent.
    thanx in advance

    DB:2.70:Compiling And Linking Pro*C 1p

    Q:1. Do i need to install visual studio? -
    Yes you need this

    Q:2. If yes, please tell me complete procedure for setting environment variables and usage.:
    Refer V.Studio installation manual and PROC++ Programmers Guide.

    Q:3. If visual studio is not required, how can i compile and link Pro*c programs.
    Yes you need this

  • RELEVANCY SCORE 2.70

    DB:2.70:Help Needed On Servlets And Jstl 9f


    Hi

    I am using tomcat 5.5 and JDK 1.5. What are the softwares I have to download for compiling servlets and creating JSTL ?. Help needed.

    Thanks

    IndyaRaja

    DB:2.70:Help Needed On Servlets And Jstl 9f

    I tried compling servlet, but it is raising error
    that coul not find package javax.servletWhat I did not mention... you need to add those JARs in the Classpath explicitly. You will find them in %TOMCAT_HOME%\common\lib. You atleast need to add servlet-api.jar to your Classpath. :)

  • RELEVANCY SCORE 2.70

    DB:2.70:How To Load/Unload Resources Dynamically? cf


    hi i have an application on system tray. Initially it should not load resources when it starts. When i double click on tray icon the resources should load when i close only application resources should get unload. for this i have create one dll only for resources, then deleted all resources from application before compiling, used the methods ::LoadResources and ::UnloadResources for load and unload dynamically then compile and ran it, now only got system tray icon, when i double click on that, application is not loading if you have any ideas, help me please Thank you

    DB:2.70:How To Load/Unload Resources Dynamically? cf

    Hi, Can you provide the code to see, how are you using ::LoadResources and it's counter parts?I hope, You must have used ::LoadLibrary method before making these calls. Please go through this link for the sample program, which uses ::LoadLibrary and ::LoadResource methods etc...Revert to me with the code if you are still not be able to find the solution...CheersAnand

  • RELEVANCY SCORE 2.70

    DB:2.70:Java.Rmi.Server.Exportexception: Listen Failed On Port: 1099; 1j


    Hi All,

    I am trying to run RMI tutorial from sun's java tutorial. It has 8 parts. The last two parts are "Compiling the Example Programs" and "Running the Example Programs".

    Until "Compiling the Example Programs", I am okay.

    But I am stuck in the last part, "Running the Example Programs". When I use the command "rmiregistry", it gives me a list of exceptions as follows.

    c:\home\ann\srcrmiregistry
    java.rmi.server.ExportException: Listen failed on port: 1099; nested exception is:
    java.net.SocketException: Permission denied: listen failed
    at sun.rmi.transport.tcp.TCPTransport.listen(TCPTransport.java:312)
    at sun.rmi.transport.tcp.TCPTransport.exportObject(TCPTransport.java:218)
    at sun.rmi.transport.tcp.TCPEndpoint.exportObject(TCPEndpoint.java:393)
    at sun.rmi.transport.LiveRef.exportObject(LiveRef.java:129)
    at sun.rmi.server.UnicastServerRef.exportObject(UnicastServerRef.java:190)
    at sun.rmi.registry.RegistryImpl.setup(RegistryImpl.java:92)
    at sun.rmi.registry.RegistryImpl.init(RegistryImpl.java:78)
    at sun.rmi.registry.RegistryImpl.main(RegistryImpl.java:322)
    Caused by: java.net.SocketException: Permission denied: listen failed
    at java.net.PlainSocketImpl.socketListen(Native Method)
    at java.net.PlainSocketImpl.listen(PlainSocketImpl.java:380)
    at java.net.ServerSocket.bind(ServerSocket.java:320)
    at java.net.ServerSocket.init(ServerSocket.java:185)
    at java.net.ServerSocket.init(ServerSocket.java:97)
    at sun.rmi.transport.proxy.RMIDirectSocketFactory.createServerSocket(RMIDirectSocketFactory.java:27)
    at sun.rmi.transport.proxy.RMIMasterSocketFactory.createServerSocket(RMIMasterSocketFactory.java:333)
    at sun.rmi.transport.tcp.TCPEndpoint.newServerSocket(TCPEndpoint.java:649)
    at sun.rmi.transport.tcp.TCPTransport.listen(TCPTransport.java:299)
    ... 7 more

    c:\home\ann\src

    Then, I try to use "start rmiregistry" command. At that time, a command window stating the above exception popup just for a while and closed automatically.

    Now, I use jdk1.6.0_16 on Windows Vista.

    Previously, I used j2sdk1.4.2_19. That time, I could run "start rmiregistry" properly and could try testing another RMI example application.

    But if I use j2sdk1.4.2_19, compiling some statements in the sun's RMI tutorial gives me error. So, I change to use jdk1.6.0_16 for this tutorial. "jdk1.6.0_16" compiles all programs in the tutorial with no error. But I can't run the statement "start rmiregistry".

    I use the command prompt from Vista's default Administrator account and already disable User Account Control too.

    Any help, please!

    Thanks a lot,
    atzm111

    DB:2.70:Java.Rmi.Server.Exportexception: Listen Failed On Port: 1099; 1j

    Hi,

    This is the result of netstat -an

    c:\home\ann\srcnetstat -an

    Active Connections

    Proto Local Address Foreign Address State
    TCP 0.0.0.0:135 0.0.0.0:0 LISTENING
    TCP 0.0.0.0:2868 0.0.0.0:0 LISTENING
    TCP 0.0.0.0:3999 0.0.0.0:0 LISTENING
    TCP 0.0.0.0:49152 0.0.0.0:0 LISTENING
    TCP 0.0.0.0:49153 0.0.0.0:0 LISTENING
    TCP 0.0.0.0:49154 0.0.0.0:0 LISTENING
    TCP 192.168.1.102:139 0.0.0.0:0 LISTENING
    TCP 192.168.1.102:49475 64.233.189.17:80 ESTABLISHED
    TCP 192.168.1.102:49620 64.233.189.83:80 ESTABLISHED
    TCP 192.168.1.102:49625 72.5.124.102:80 ESTABLISHED
    TCP 192.168.1.102:49626 72.5.124.102:80 ESTABLISHED
    TCP 192.168.1.102:49627 72.5.124.102:80 ESTABLISHED
    TCP 192.168.1.102:49628 72.5.124.102:80 ESTABLISHED
    TCP 192.168.1.102:49629 72.5.124.102:80 ESTABLISHED
    TCP 192.168.1.102:49631 72.5.124.61:80 TIME_WAIT
    TCP 192.168.1.102:49634 124.155.222.16:80 ESTABLISHED
    TCP [::]:135 [::]:0 LISTENING
    TCP [::]:49152 [::]:0 LISTENING
    TCP [::]:49153 [::]:0 LISTENING
    TCP [::]:49154 [::]:0 LISTENING
    UDP 0.0.0.0:123 *:*
    UDP 0.0.0.0:500 *:*
    UDP 0.0.0.0:4500 *:*
    UDP 0.0.0.0:5355 *:*
    UDP 127.0.0.1:1900 *:*
    UDP 127.0.0.1:51196 *:*
    UDP 127.0.0.1:64757 *:*
    UDP 192.168.1.102:137 *:*
    UDP 192.168.1.102:138 *:*
    UDP 192.168.1.102:1900 *:*
    UDP 192.168.1.102:51195 *:*
    UDP [::]:123 *:*
    UDP [::]:500 *:*
    UDP [::]:5355 *:*
    UDP [::1]:1900 *:*
    UDP [::1]:51193 *:*
    UDP [fe80::100:7f:fffe%16]:1900 *:*
    UDP [fe80::100:7f:fffe%16]:51194 *:*
    UDP [fe80::18c1:1fa4:382b:261%12]:1900 *:*
    UDP [fe80::18c1:1fa4:382b:261%12]:51191 *:*
    UDP [fe80::69bc:321e:5e99:dc7c%11]:1900 *:*
    UDP [fe80::69bc:321e:5e99:dc7c%11]:51192 *:*
    UDP [fe80::a0a0:89c2:b2fd:e4b9%13]:1900 *:*
    UDP [fe80::a0a0:89c2:b2fd:e4b9%13]:51190 *:*

    c:\home\ann\src

    So, port 1099 is not in use. I don't know how to check your second fact. I'll find it out coz I can't ask you. :D

    Thanks!

  • RELEVANCY SCORE 2.69

    DB:2.69:Compiling Multiple Programs For Mindstorms ka



    Can someone help me out. In the nxt software it guided me through the robogator programming and their 3 different programs. One for the jaws to bite, one for the legs, and one for the ultrasonic sensor. The problem is i dont know how to combine all three programs into one, so the gator would walk around flapping its jaws and the sensor prolly wouldnt even work lol. I was wondering if anyone can help me.

    One person said to just copy and paste each program onto one but i think that wouldnt work because all the blocks would be parallel so i dont think that would work, please somebody help me i really want to learn how to program things. Thanks

    DB:2.69:Compiling Multiple Programs For Mindstorms ka


    Can you post the URL for each of the three programs? Without seeing them, it will be very difficult to comment on how to combine them.

  • RELEVANCY SCORE 2.69

    DB:2.69:Cant Select Tools In Old Java Programs 8s


    compiling and running Java programs in notebook

    Have some old Java programs that were compiled and run on WindowsWP by using Tools . Can't find a means to select
    Tools with Windows 7.
    Suggestions, anyone?

    DB:2.69:Cant Select Tools In Old Java Programs 8s

    Did you mean Administrative Tools? If yes, in Windows 7 go to the Programs menu and in the Search box start typing... It is not that accessible in Windows 7 AND depending on how your machine is set up you amy or may NOT be able to make changes.

  • RELEVANCY SCORE 2.69

    DB:2.69:Compiling In Kdevelop xm



    Hi,

    I installed kdevelop, but it doesnt have an option under the build menu to build the code. Im using the C editor... and have already installed most of the tools I need for compiling C, of course including GCC.

    Already checked the configuration menu, but it says nothing about the compiler.

    What should I do to build C programs directly on it?

    Thanks in advance.

    DB:2.69:Compiling In Kdevelop xm

    abijr wrote:
    Have you tried compiling directly with gcc?like

    gcc -Wall hello.c -o hello

    just to check if it works.

  • RELEVANCY SCORE 2.69

    DB:2.69:Simulation Compile Error Of Example Design File pj



    I face simulation error for compiling the example design file ofAC701 board ----ac701-pcie-rdf0225-2013.2-c,

    does anyone have this error and help me solve it?

    Thanks a lot

    OS: winXP--x64 32 bit

    Tool:Vivado 2013.2

    Compiling module secureip.xil_pcie_fuji_mod3(TIEOFF="1",T_...Compiling module secureip.xil_pcie_fuji_mod3(TIEOFF="1",T_...Compiling module secureip.xil_pcie_fuji_mod3(TIEOFF="0",T_...Compiling module secureip.xil_pcie_fuji_mod3(TIEOFF="0",T_...Compiling module secureip.xil_pcie_fuji_mod3(TIEOFF="0",T_...Compiling module secureip.xil_pcie_fuji_mod3(TIEOFF="0",T_...Compiling module secureip.xil_pcie_fuji_mod3(TIEOFF="0",T_...Compiling module secureip.xil_pcie_fuji_mod3(TIEOFF="0",T_...Compiling module secureip.xil_pcie_fuji_mod3(TIEOFF="0",T_...Compiling module secureip.xil_pcie_fuji_mod3(TIEOFF="0",T_...Compiling module secureip.xil_pcie_fuji_mod3(TIEOFF="1",T_...Compiling module secureip.xil_pcie_fuji_mod3(TIEOFF="1",T_...Compiling module secureip.xil_pcie_fuji_mod3(TIEOFF="1",T_...Compiling module secureip.xil_pcie_fuji_mod3(TIEOFF="1",T_...Compiling module secureip.xil_pcie_fuji_mod3(TIEOFF="0",T_...Compiling module secureip.xil_pcie_fuji_mod3(TIEOFF="0",T_...Compiling module secureip.xil_pcie_fuji_mod3(TIEOFF="0",T_...Compiling module secureip.xil_pcie_fuji_mod3(TIEOFF="0",T_...Compiling module secureip.xil_pcie_fuji_mod3(TIEOFF="0",T_...Compiling module secureip.xil_pcie_fuji_mod3(TIEOFF="1",T_...Compiling module secureip.xil_pcie_fuji_mod3(TIEOFF="1",T_...Compiling module secureip.xil_pcie_fuji_mod3(TIEOFF="1",T_...Compiling module secureip.xil_pcie_fuji_mod3(TIEOFF="1",T_...Compiling module secureip.xil_pcie_fuji_mod3(TIEOFF="0",T_...Compiling module secureip.xil_pcie_fuji_mod3(TIEOFF="0",T_...Compiling module secureip.xil_pcie_fuji_mod3(TIEOFF="1",T_...Compiling module secureip.xil_pcie_fuji_mod3(TIEOFF="0",T_...Compiling module secureip.xil_pcie_fuji_mod3(TIEOFF="0",T_...Compiling module secureip.xil_pcie_fuji_mod3(TIEOFF="0",T_...Compiling module secureip.xil_pcie_fuji_mod3(TIEOFF="0",T_...Compiling module secureip.xil_pcie_fuji_mod3(TIEOFF="0",T_...Compiling module secureip.xil_pcie_fuji_mod3(TIEOFF="1",T_...Compiling module secureip.xil_pcie_fuji_mod3(TIEOFF="1",T_...Compiling module secureip.xil_pcie_fuji_mod3(TIEOFF="1",T_...Compiling module secureip.xil_pcie_fuji_mod3(TIEOFF="0",T_...Compiling module secureip.xil_pcie_fuji_mod3(TIEOFF="0",T_...Compiling module secureip.xil_pcie_fuji_mod3(TIEOFF="0",T_...Compiling module secureip.xil_pcie_fuji_mod3(TIEOFF="0",T_...Compiling module secureip.xil_pcie_fuji_mod3(TIEOFF="0",T_...Compiling module secureip.xil_pcie_fuji_mod3(TIEOFF="0",T_...Compiling module secureip.xil_pcie_fuji_mod3(TIEOFF="1",T_...Compiling module secureip.xil_pcie_fuji_mod3(TIEOFF="0",T_...Compiling module secureip.xil_pcie_fuji_mod3(TIEOFF="0",T_...Compiling module secureip.xil_pcie_fuji_mod3(TIEOFF="1",T_...Compiling module secureip.xil_pcie_fuji_mod3(TIEOFF="1",T_...Compiling module secureip.xil_pcie_fuji_mod3(TIEOFF="DoNot...Compiling module secureip.xil_pcie_fuji_mod3(TIEOFF="1",T_...Compiling module secureip.xil_pcie_fuji_mod3(TIEOFF="1",T_...Compiling module secureip.xil_pcie_fuji_mod3(TIEOFF="1",T_...Compiling module secureip.xil_pcie_fuji_mod3(TIEOFF="1",T_...Compiling module secureip.xil_pcie_fuji_mod3(TIEOFF="1",T_...Compiling module secureip.xil_pcie_fuji_mod3(TIEOFF="0",T_...Compiling module secureip.xil_pcie_fuji_mod3(TIEOFF="0",T_...Compiling module secureip.xil_pcie_fuji_mod3(TIEOFF="0",T_...Compiling module secureip.xil_pcie_fuji_mod3(TIEOFF="0",T_...Compiling module secureip.xil_pcie_fuji_mod3(TIEOFF="1",T_...Compiling module secureip.xil_pcie_fuji_mod3(TIEOFF="1",T_...Compiling module secureip.xil_pcie_fuji_mod3(TIEOFF="1",T_...Compiling module secureip.xil_pcie_fuji_mod3(TIEOFF="1",T_...Compiling module secureip.xil_pcie_fuji_mod3(TIEOFF="1",T_...Compiling module secureip.xil_pcie_fuji_mod3(TIEOFF="1",T_...Compiling module secureip.xil_pcie_fuji_mod3(TIEOFF="DoNot...Compiling module secureip.xil_pcie_fuji_mod3(TIEOFF="1",T_...Compiling module secureip.xil_pcie_fuji_mod3(TIEOFF="0",T_...Compiling module secureip.xil_pcie_fuji_mod3(TIEOFF="0",T_...Compiling module secureip.xil_pcie_fuji_mod3(TIEOFF="0",T_...Compiling module secureip.xil_pcie_fuji_mod3(TIEOFF="0",T_...Compiling module secureip.xil_pcie_fuji_mod3(TIEOFF="1",T_...Compiling module secureip.xil_pcie_fuji_mod3(TIEOFF="1",T_...Compiling module secureip.xil_pcie_fuji_mod3(TIEOFF="DoNot...Compiling module secureip.xil_pcie_fuji_mod3(TIEOFF="1",T_...Compiling module secureip.xil_pcie_fuji_mod3(TIEOFF="0",T_...Compiling module secureip.xil_pcie_fuji_mod3(TIEOFF="0",T_...Compiling module secureip.xil_pcie_fuji_mod3(TIEOFF="1",T_...Compiling module secureip.xil_pcie_fuji_mod3(TIEOFF="0",T_...Compiling module secureip.xil_pcie_fuji_mod3(TIEOFF="0",T_...Compiling module secureip.xil_pcie_fuji_mod3(TIEOFF="0",T_...Compiling module secureip.xil_pcie_fuji_mod3(TIEOFF="0",T_...Compiling module secureip.xil_pcie_fuji_mod3(TIEOFF="0",T_...Compiling module secureip.xil_pcie_fuji_mod3(TIEOFF="1",T_...Compiling module secureip.xil_pcie_fuji_mod3(TIEOFF="1",T_...Compiling module secureip.xil_pcie_fuji_mod3(TIEOFF="1",T_...Compiling module secureip.xil_pcie_fuji_mod3(TIEOFF="1",T_...Compiling module secureip.xil_pcie_fuji_mod3(TIEOFF="DoNot...Compiling module secureip.xil_pcie_fuji_mod3(TIEOFF="0",T_...Compiling module secureip.xil_pcie_fuji_mod3(TIEOFF="0",T_...Compiling module secureip.xil_pcie_fuji_mod3(TIEOFF="0",T_...Compiling module secureip.xil_pcie_fuji_mod3(TIEOFF="0",T_...Compiling module secureip.xil_pcie_fuji_mod3(TIEOFF="1",T_...Compiling module secureip.xil_pcie_fuji_mod3(TIEOFF="0",T_...Compiling module secureip.xil_pcie_fuji_mod3(TIEOFF="0",T_...Compiling module secureip.xil_pcie_fuji_mod3(TIEOFF="1",T_...Compiling module secureip.xil_pcie_fuji_mod3(TIEOFF="1",T_...Compiling module secureip.xil_pcie_fuji_mod3(TIEOFF="1",T_...Compiling module secureip.xil_pcie_fuji_mod3(TIEOFF="1",T_...Compiling module secureip.xil_pcie_fuji_mod3(TIEOFF="1",T_...Compiling module secureip.xil_pcie_fuji_mod3(TIEOFF="1",T_...Compiling module secureip.xil_pcie_fuji_mod3(TIEOFF="1",T_...Compiling module secureip.xil_pcie_fuji_mod3(TIEOFF="DoNot...Compiling module secureip.xil_pcie_fuji_mod3(TIEOFF="0",T_...Compiling module secureip.xil_pcie_fuji_mod3(TIEOFF="0",T_...Compiling module secureip.xil_pcie_fuji_mod3(TIEOFF="0",T_...Compiling module secureip.xil_pcie_fuji_mod3(TIEOFF="0",T_...Compiling module secureip.xil_pcie_fuji_mod3(TIEOFF="1",T_...Compiling module secureip.xil_pcie_fuji_mod3(TIEOFF="1",T_...Compiling module secureip.xil_pcie_fuji_mod3(TIEOFF="1",T_...Compiling module secureip.xil_pcie_fuji_mod3(TIEOFF="1",T_...Compiling module secureip.xil_pcie_fuji_mod3(TIEOFF="1",T_...Compiling module secureip.xil_pcie_fuji_mod3(TIEOFF="1",T_...Compiling module secureip.xil_pcie_fuji_mod3(TIEOFF="DoNot...Compiling module secureip.xil_pcie_fuji_mod3(TIEOFF="1",T_...Compiling module secureip.xil_pcie_fuji_mod3(TIEOFF="1",T_...Compiling module secureip.xil_pcie_fuji_mod3(TIEOFF="0",T_...Compiling module secureip.xil_pcie_fuji_mod3(TIEOFF="0",T_...Compiling module secureip.xil_pcie_fuji_mod3(TIEOFF="0",T_...Compiling module secureip.xil_pcie_fuji_mod3(TIEOFF="1",T_...Compiling module secureip.xil_pcie_fuji_mod3(TIEOFF="1",T_...Compiling module secureip.xil_pcie_fuji_mod3(TIEOFF="1",T_...Compiling module secureip.xil_pcie_fuji_mod3(TIEOFF="1",T_...Compiling module secureip.xil_pcie_fuji_mod3(TIEOFF="1",T_...Compiling module secureip.xil_pcie_fuji_mod3(TIEOFF="1",T_...Compiling module secureip.xil_pcie_fuji_mod3(TIEOFF="1",T_...Compiling module secureip.xil_pcie_fuji_mod3(TIEOFF="1",T_...Compiling module secureip.xil_pcie_fuji_mod3(TIEOFF="1",T_...Compiling module secureip.xil_pcie_fuji_mod3(TIEOFF="DoNot...Compiling module secureip.xil_pcie_fuji_mod3(TIEOFF="0",T_...Compiling module secureip.xil_pcie_fuji_mod3(TIEOFF="0",T_...Compiling module secureip.xil_pcie_fuji_mod3(TIEOFF="0",T_...Compiling module secureip.xil_pcie_fuji_mod3(TIEOFF="0",T_...Compiling module secureip.xil_pcie_fuji_mod3(TIEOFF="0",T_...Compiling module secureip.xil_pcie_fuji_mod3(TIEOFF="0",T_...Compiling module secureip.xil_pcie_fuji_mod3(TIEOFF="0",T_...Compiling module secureip.xil_pcie_fuji_mod3(TIEOFF="DoNot...Compiling module secureip.xil_pcie_fuji_mod3(TIEOFF="0",T_...Compiling module secureip.xil_pcie_fuji_mod3(TIEOFF="0",T_...Compiling module secureip.xil_pcie_fuji_mod3(TIEOFF="0",T_...Compiling module secureip.xil_pcie_fuji_mod3(TIEOFF="0",T_...Compiling module secureip.xil_pcie_fuji_mod3(TIEOFF="1",T_...Compiling module secureip.xil_pcie_fuji_mod3(TIEOFF="1",T_...Compiling module secureip.xil_pcie_fuji_mod3(TIEOFF="1",T_...Compiling module secureip.xil_pcie_fuji_mod3(TIEOFF="1",T_...Compiling module secureip.xil_pcie_fuji_mod3(TIEOFF="0",T_...Compiling module secureip.xil_pcie_fuji_mod3(TIEOFF="0",T_...Compiling module secureip.xil_pcie_fuji_mod3(TIEOFF="0",T_...Compiling module secureip.xil_pcie_fuji_mod3(TIEOFF="0",T_...Compiling module secureip.xil_pcie_fuji_mod3(TIEOFF="0",T_...Compiling module secureip.xil_pcie_fuji_mod3(TIEOFF="0",T_...Compiling module secureip.xil_pcie_fuji_mod3(TIEOFF="0",T_...Compiling module secureip.xil_pcie_fuji_mod3(TIEOFF="0",T_...Compiling module secureip.xil_pcie_fuji_mod3(TIEOFF="0",T_...Compiling module secureip.xil_pcie_fuji_mod3(TIEOFF="0",T_...Compiling module secureip.xil_pcie_fuji_mod3(TIEOFF="0",T_...Compiling module secureip.xil_pcie_fuji_mod3(TIEOFF="0",T_...Compiling module secureip.xil_pcie_fuji_mod3(TIEOFF="0",T_...Compiling module secureip.xil_pcie_fuji_mod3(TIEOFF="0",T_...Compiling module secureip.xil_pcie_fuji_mod3(TIEOFF="0",T_...Compiling module secureip.xil_pcie_fuji_mod3(TIEOFF="0",T_...Compiling module secureip.xil_pcie_fuji_mod3(TIEOFF="0",T_...Compiling module secureip.xil_pcie_fuji_mod3(TIEOFF="0",T_...Compiling module secureip.xil_pcie_fuji_mod3(TIEOFF="0",T_...Compiling module secureip.xil_pcie_fuji_mod3(TIEOFF="0",T_...Compiling module secureip.xil_pcie_fuji_mod3(TIEOFF="0",T_...Compiling module secureip.xil_pcie_fuji_mod3(TIEOFF="0",T_...Compiling module secureip.xil_pcie_fuji_mod3(TIEOFF="1",T_...Compiling module secureip.xil_pcie_fuji_mod3(TIEOFF="0",T_...Compiling module secureip.xil_pcie_fuji_mod3(TIEOFF="0",T_...Compiling module secureip.xil_pcie_fuji_mod3(TIEOFF="0",T_...Compiling module secureip.xil_pcie_fuji_mod3(TIEOFF="0",T_...Compiling module secureip.xil_pcie_fuji_mod3(TIEOFF="0",T_...Compiling module secureip.xil_pcie_fuji_mod3(TIEOFF="0",T_...Compiling module secureip.xil_pcie_fuji_mod3(TIEOFF="0",T_...Compiling module secureip.xil_pcie_fuji_mod3(TIEOFF="0",T_...Compiling module secureip.xil_pcie_fuji_mod3(TIEOFF="0",T_...Compiling module secureip.xil_pcie_fuji_mod3(TIEOFF="1",T_...Compiling module secureip.xil_pcie_fuji_mod3(TIEOFF="0",T_...Compiling module secureip.xil_pcie_fuji_mod3(TIEOFF="1",T_...Compiling module secureip.xil_pcie_fuji_mod3(TIEOFF="0",T_...Compiling module secureip.xil_pcie_fuji_mod3(TIEOFF="1",T_...Compiling module secureip.xil_pcie_fuji_mod3(TIEOFF="1",T_...Compiling module secureip.xil_pcie_fuji_mod3(TIEOFF="1",T_...Compiling module secureip.xil_pcie_fuji_mod3(TIEOFF="1",T_...Compiling module secureip.xil_pcie_fuji_mod3(TIEOFF="0",T_...Compiling module secureip.xil_pcie_fuji_mod3(TIEOFF="0",T_...Compiling module secureip.xil_pcie_fuji_mod3(TIEOFF="0",T_...Compiling module secureip.xil_pcie_fuji_mod3(TIEOFF="0",T_...Compiling module secureip.xil_pcie_fuji_mod3(TIEOFF="1",T_...Compiling module secureip.xil_pcie_fuji_mod3(TIEOFF="1",T_...Compiling module secureip.xil_pcie_fuji_mod3(TIEOFF="1",T_...Compiling module secureip.xil_pcie_fuji_mod3(TIEOFF="1",T_...Compiling module secureip.xil_pcie_fuji_mod3(TIEOFF="1",T_...Compiling module secureip.xil_pcie_fuji_mod3(TIEOFF="1",T_...Compiling module secureip.xil_pcie_fuji_mod3(TIEOFF="0",T_...Compiling module secureip.xil_pcie_fuji_mod3(TIEOFF="0",T_...Compiling module secureip.xil_pcie_fuji_mod3(TIEOFF="0",T_...Compiling module secureip.xil_pcie_fuji_mod3(TIEOFF="0",T_...Compiling module secureip.xil_pcie_fuji_mod3(TIEOFF="1",T_...Compiling module secureip.xil_pcie_fuji_mod3(TIEOFF="1",T_...Compiling module secureip.xil_pcie_fuji_mod3(TIEOFF="1",T_...Compiling module secureip.xil_pcie_fuji_mod3(TIEOFF="1",T_...Compiling module secureip.xil_pcie_fuji_mod3(TIEOFF="1",T_...Compiling module secureip.xil_pcie_fuji_mod3(TIEOFF="1",T_...Compiling module secureip.xil_pcie_fuji_mod3(TIEOFF="0",T_...Compiling module secureip.xil_pcie_fuji_mod3(TIEOFF="0",T_...Compiling module secureip.xil_pcie_fuji_mod3(TIEOFF="0",T_...Compiling module secureip.xil_pcie_fuji_mod3(TIEOFF="0",T_...Compiling module secureip.xil_pcie_fuji_mod3(TIEOFF="1",T_...Compiling module secureip.xil_pcie_fuji_mod3(TIEOFF="1",T_...Compiling module secureip.xil_pcie_fuji_mod3(TIEOFF="1",T_...Compiling module secureip.xil_pcie_fuji_mod3(TIEOFF="1",T_...Compiling module secureip.xil_pcie_fuji_mod3(TIEOFF="1",T_...Compiling module secureip.xil_pcie_fuji_mod3(TIEOFF="1",T_...Compiling module secureip.xil_pcie_fuji_mod3(TIEOFF="0",T_...Compiling module secureip.xil_pcie_fuji_mod3(TIEOFF="0",T_...Compiling module secureip.xil_pcie_fuji_mod3(TIEOFF="0",T_...Compiling module secureip.xil_pcie_fuji_mod3(TIEOFF="0",T_...Compiling module secureip.xil_pcie_fuji_mod3(TIEOFF="1",T_...Compiling module secureip.xil_pcie_fuji_mod3(TIEOFF="1",T_...Compiling module secureip.xil_pcie_fuji_mod3(TIEOFF="1",T_...Compiling module secureip.xil_pcie_fuji_mod3(TIEOFF="1",T_...Compiling module secureip.xil_pcie_fuji_mod3(TIEOFF="1",T_...Compiling module secureip.xil_pcie_fuji_mod3(TIEOFF="1",T_...Compiling module secureip.xil_pcie_fuji_mod3(TIEOFF="0",T_...Compiling module secureip.xil_pcie_fuji_mod3(TIEOFF="0",T_...Compiling module secureip.xil_pcie_fuji_mod3(TIEOFF="0",T_...Compiling module secureip.xil_pcie_fuji_mod3(TIEOFF="0",T_...Compiling module secureip.xil_pcie_fuji_mod3(TIEOFF="0",T_...Compiling module secureip.xil_pcie_fuji_mod3(TIEOFF="0",T_...Compiling module secureip.xil_pcie_fuji_mod3(TIEOFF="1",T_...Compiling module secureip.xil_pcie_fuji_mod3(TIEOFF="1",T_...Compiling module secureip.xil_pcie_fuji_mod3(TIEOFF="1",T_...Compiling module secureip.xil_pcie_fuji_mod3(TIEOFF="1",T_...Compiling module secureip.xil_pcie_fuji_mod3(TIEOFF="0",T_...Compiling module secureip.xil_pcie_fuji_mod3(TIEOFF="0",T_...Compiling module secureip.xil_pcie_fuji_mod3(TIEOFF="0",T_...Compiling module secureip.xil_pcie_fuji_mod3(TIEOFF="0",T_...Compiling module secureip.xil_pcie_fuji_mod3(TIEOFF="0",T_...Compiling module secureip.xil_pcie_fuji_mod3(TIEOFF="0",T_...Compiling module secureip.xil_pcie_fuji_mod3(TIEOFF="1",T_...Compiling module secureip.xil_pcie_fuji_mod3(TIEOFF="1",T_...Compiling module secureip.xil_pcie_fuji_mod3(TIEOFF="1",T_...Compiling module secureip.xil_pcie_fuji_mod3(TIEOFF="1",T_...Compiling module secureip.xil_pcie_fuji_mod3(TIEOFF="0",T_...Compiling module secureip.xil_pcie_fuji_mod3(TIEOFF="0",T_...Compiling module secureip.xil_pcie_fuji_mod3(TIEOFF="0",T_...Compiling module secureip.xil_pcie_fuji_mod3(TIEOFF="0",T_...Compiling module secureip.xil_pcie_fuji_mod3(TIEOFF="0",T_...Compiling module secureip.xil_pcie_fuji_mod3(TIEOFF="0",T_...Compiling module secureip.xil_pcie_fuji_mod3(TIEOFF="1",T_...Compiling module secureip.xil_pcie_fuji_mod3(TIEOFF="1",T_...Compiling module secureip.xil_pcie_fuji_mod3(TIEOFF="1",T_...Compiling module secureip.xil_pcie_fuji_mod3(TIEOFF="1",T_...Compiling module secureip.xil_pcie_fuji_mod3(TIEOFF="0",T_...Compiling module secureip.xil_pcie_fuji_mod3(TIEOFF="0",T_...Compiling module secureip.xil_pcie_fuji_mod3(TIEOFF="0",T_...Compiling module secureip.xil_pcie_fuji_mod3(TIEOFF="0",T_...Compiling module secureip.xil_pcie_fuji_mod3(TIEOFF="0",T_...Compiling module secureip.xil_pcie_fuji_mod3(TIEOFF="0",T_...Compiling module secureip.xil_pcie_fuji_mod3(TIEOFF="1",T_...Compiling module secureip.xil_pcie_fuji_mod3(TIEOFF="1",T_...Compiling module secureip.xil_pcie_fuji_mod3(TIEOFF="1",T_...Compiling module secureip.xil_pcie_fuji_mod3(TIEOFF="1",T_...Compiling module secureip.xil_pcie_fuji_mod3(TIEOFF="0",T_...Compiling module secureip.xil_pcie_fuji_mod3(TIEOFF="0",T_...Compiling module secureip.xil_pcie_fuji_mod3(TIEOFF="0",T_...Compiling module secureip.xil_pcie_fuji_mod3(TIEOFF="0",T_...Compiling module secureip.xil_pcie_fuji_mod3(TIEOFF="0",T_...Compiling module secureip.xil_pcie_fuji_mod3(TIEOFF="0",T_...Compiling module secureip.xil_pcie_fuji_mod3(TIEOFF="0",T_...Compiling module secureip.xil_pcie_fuji_mod3(TIEOFF="1",T_...Compiling module secureip.xil_pcie_fuji_mod3(TIEOFF="0",T_...Compiling module secureip.xil_pcie_fuji_mod3(TIEOFF="1",T_...Compiling module secureip.xil_pcie_fuji_mod3(TIEOFF="0",T_...Compiling module secureip.xil_pcie_fuji_mod3(TIEOFF="0",T_...Compiling module secureip.xil_pcie_fuji_mod3(TIEOFF="0",T_...Compiling module secureip.xil_pcie_fuji_mod3(TIEOFF="0",T_...Compiling module secureip.xil_pcie_fuji_mod3(TIEOFF="0",T_...Compiling module secureip.xil_pcie_fuji_mod3(TIEOFF="0",T_...Compiling module secureip.xil_pcie_fuji_mod3(TIEOFF="0",T_...Compiling module secureip.xil_pcie_fuji_mod3(TIEOFF="0",T_...Compiling module secureip.xil_pcie_fuji_mod3(TIEOFF="0",T_...Compiling module secureip.xil_pcie_fuji_mod3(TIEOFF="0",T_...Compiling module secureip.xil_pcie_fuji_mod3(TIEOFF="0",T_...Compiling module secureip.xil_pcie_fuji_mod3(TIEOFF="0",T_...Compiling module secureip.xil_pcie_fuji_mod3(TIEOFF="0",T_...Compiling module secureip.xil_pcie_fuji_mod3(TIEOFF="0",T_...Compiling module secureip.xil_pcie_fuji_mod3(TIEOFF="0",T_...Compiling module secureip.xil_pcie_fuji_mod3(TIEOFF="0",T_...Compiling module secureip.xil_pcie_fuji_mod3(TIEOFF="0",T_...Compiling module secureip.xil_pcie_fuji_mod3(TIEOFF="0",T_...Compiling module secureip.xil_pcie_fuji_mod3(TIEOFF="0",T_...Compiling module secureip.xil_pcie_fuji_mod3(TIEOFF="0",T_...Compiling module secureip.xil_pcie_fuji_mod3(TIEOFF="0",T_...Compiling module secureip.xil_pcie_fuji_mod3(TIEOFF="0",T_...Compiling module secureip.xil_pcie_fuji_mod3(TIEOFF="0",T_...Compiling module secureip.xil_pcie_fuji_mod3(TIEOFF="0",T_...Compiling module secureip.xil_pcie_fuji_mod3(TIEOFF="0",T_...Compiling module secureip.xil_pcie_fuji_mod3(TIEOFF="0",T_...Compiling module secureip.xil_pcie_fuji_mod3(TIEOFF="1",T_...Compiling module secureip.xil_pcie_fuji_mod3(TIEOFF="1",T_...Compiling module secureip.xil_pcie_fuji_mod3(TIEOFF="0",T_...Compiling module secureip.xil_pcie_fuji_mod3(TIEOFF="0",T_...Compiling module secureip.xil_pcie_fuji_mod3(TIEOFF="1",T_...Compiling module secureip.xil_pcie_fuji_mod3(TIEOFF="1",T_...Compiling module secureip.xil_pcie_fuji_mod3(TIEOFF="0",T_...Compiling module secureip.xil_pcie_fuji_mod3(TIEOFF="0",T_...Compiling module secureip.xil_pcie_fuji_mod3(TIEOFF="1",T_...Compiling module secureip.xil_pcie_fuji_mod3(TIEOFF="1",T_...Compiling module secureip.xil_pcie_fuji_mod3(TIEOFF="0",T_...Compiling module secureip.xil_pcie_fuji_mod3(TIEOFF="0",T_...Compiling module secureip.xil_pcie_fuji_mod3(TIEOFF="1",T_...Compiling module secureip.xil_pcie_fuji_mod3(TIEOFF="1",T_...Compiling module secureip.xil_pcie_fuji_mod3(TIEOFF="1",T_...Compiling module secureip.xil_pcie_fuji_mod3(TIEOFF="1",T_...Compiling module secureip.xil_pcie_fuji_mod3(TIEOFF="0",T_...Compiling module secureip.xil_pcie_fuji_mod3(TIEOFF="0",T_...Compiling module secureip.xil_pcie_fuji_mod3(TIEOFF="0",T_...Compiling module secureip.xil_pcie_fuji_mod3(TIEOFF="0",T_...Compiling module secureip.xil_pcie_fuji_mod3(TIEOFF="0",T_...Compiling module secureip.xil_pcie_fuji_mod3(TIEOFF="0",T_...Compiling module secureip.xil_pcie_fuji_mod3(TIEOFF="1",T_...Compiling module secureip.xil_pcie_fuji_mod3(TIEOFF="1",T_...Compiling module secureip.xil_pcie_fuji_mod3(TIEOFF="1",T_...Compiling module secureip.xil_pcie_fuji_mod3(TIEOFF="1",T_...Compiling module secureip.xil_pcie_fuji_mod3(TIEOFF="0",T_...Compiling module secureip.xil_pcie_fuji_mod3(TIEOFF="0",T_...Compiling module secureip.xil_pcie_fuji_mod3(TIEOFF="0",T_...Compiling module secureip.xil_pcie_fuji_mod3(TIEOFF="0",T_...Compiling module secureip.xil_pcie_fuji_mod3(TIEOFF="0",T_...Compiling module secureip.xil_pcie_fuji_mod3(TIEOFF="0",T_...Compiling module secureip.xil_pcie_fuji_mod3(TIEOFF="1",T_...Compiling module secureip.xil_pcie_fuji_mod3(TIEOFF="1",T_...Compiling module secureip.xil_pcie_fuji_mod3(TIEOFF="1",T_...Compiling module secureip.xil_pcie_fuji_mod3(TIEOFF="1",T_...Compiling module secureip.xil_pcie_fuji_mod3(TIEOFF="0",T_...Compiling module secureip.xil_pcie_fuji_mod3(TIEOFF="0",T_...Compiling module secureip.xil_pcie_fuji_mod3(TIEOFF="0",T_...Compiling module secureip.xil_pcie_fuji_mod3(TIEOFF="0",T_...Compiling module secureip.xil_pcie_fuji_mod3(TIEOFF="0",T_...Compiling module secureip.xil_pcie_fuji_mod3(TIEOFF="0",T_...Compiling module secureip.xil_pcie_fuji_mod3(TIEOFF="1",T_...Compiling module secureip.xil_pcie_fuji_mod3(TIEOFF="1",T_...Compiling module secureip.xil_pcie_fuji_mod3(TIEOFF="1",T_...Compiling module secureip.xil_pcie_fuji_mod3(TIEOFF="1",T_...Compiling module secureip.xil_pcie_fuji_mod3(TIEOFF="0",T_...Compiling module secureip.xil_pcie_fuji_mod3(TIEOFF="0",T_...Compiling module secureip.xil_pcie_fuji_mod3(TIEOFF="0",T_...Compiling module secureip.xil_pcie_fuji_mod3(TIEOFF="0",T_...Compiling module secureip.xil_pcie_fuji_mod3(TIEOFF="0",T_...Compiling module secureip.xil_pcie_fuji_mod3(TIEOFF="0",T_...Compiling module secureip.xil_pcie_fuji_mod3(TIEOFF="1",T_...Compiling module secureip.xil_pcie_fuji_mod3(TIEOFF="1",T_...Compiling module secureip.xil_pcie_fuji_mod3(TIEOFF="1",T_...Compiling module secureip.xil_pcie_fuji_mod3(TIEOFF="1",T_...Compiling module secureip.xil_pcie_fuji_mod3(TIEOFF="0",T_...Compiling module secureip.xil_pcie_fuji_mod3(TIEOFF="0",T_...Compiling module secureip.xil_pcie_fuji_mod3(TIEOFF="0",T_...Compiling module secureip.xil_pcie_fuji_mod3(TIEOFF="0",T_...Compiling module secureip.xil_pcie_fuji_mod3(TIEOFF="0",T_...Compiling module secureip.xil_pcie_fuji_mod3(TIEOFF="0",T_...Compiling module secureip.xil_pcie_fuji_mod3(TIEOFF="1",T_...Compiling module secureip.xil_pcie_fuji_mod3(TIEOFF="1",T_...Compiling module secureip.xil_pcie_fuji_mod3(TIEOFF="1",T_...Compiling module secureip.xil_pcie_fuji_mod3(TIEOFF="1",T_...Compiling module secureip.xil_pcie_fuji_mod3(TIEOFF="0",T_...Compiling module secureip.xil_pcie_fuji_mod3(TIEOFF="0",T_...Compiling module secureip.xil_pcie_fuji_mod3(TIEOFF="0",T_...Compiling module secureip.xil_pcie_fuji_mod3(TIEOFF="0",T_...Compiling module secureip.xil_pcie_fuji_mod3(TIEOFF="0",T_...Compiling module secureip.xil_pcie_fuji_mod3(TIEOFF="0",T_...Compiling module secureip.xil_pcie_fuji_mod3(TIEOFF="1",T_...Compiling module secureip.xil_pcie_fuji_mod3(TIEOFF="1",T_...Compiling module secureip.xil_pcie_fuji_mod3(TIEOFF="1",T_...Compiling module secureip.xil_pcie_fuji_mod3(TIEOFF="1",T_...Compiling module secureip.xil_pcie_fuji_mod3(TIEOFF="0",T_...Compiling module secureip.xil_pcie_fuji_mod3(TIEOFF="0",T_...Compiling module secureip.xil_pcie_fuji_mod3(TIEOFF="0",T_...Compiling module secureip.xil_pcie_fuji_mod3(TIEOFF="1",T_...Compiling module secureip.xil_pcie_fuji_mod3(TIEOFF="0",T_...Compiling module secureip.xil_pcie_fuji_mod3(TIEOFF="1",T_...Compiling module secureip.xil_pcie_fuji_mod3(TIEOFF="0",T_...Compiling module secureip.xil_pcie_fuji_mod3(TIEOFF="0",T_...Compiling module secureip.xil_pcie_fuji_mod3(TIEOFF="0",T_...Compiling module secureip.xil_pcie_fuji_mod3(TIEOFF="0",T_...Compiling module secureip.xil_pcie_fuji_mod3(TIEOFF="1",T_...Compiling module secureip.xil_pcie_fuji_mod3(TIEOFF="0",T_...Compiling module secureip.xil_pcie_fuji_mod3(TIEOFF="1",T_...Compiling module secureip.xil_pcie_fuji_mod3(TIEOFF="0",T_...Compiling module secureip.xil_pcie_fuji_mod3(TIEOFF="1",T_...Compiling module secureip.xil_pcie_fuji_mod3(TIEOFF="1",T_...Compiling module secureip.xil_pcie_fuji_mod3(TIEOFF="0",T_...Compiling module secureip.xil_pcie_fuji_mod3(TIEOFF="0",T_...Compiling module secureip.xil_pcie_fuji_mod3(TIEOFF="0",T_...Compiling module secureip.xil_pcie_fuji_mod3(TIEOFF="0",T_...Compiling module secureip.xil_pcie_fuji_mod3(TIEOFF="0",T_...Compiling module secureip.xil_pcie_fuji_mod3(TIEOFF="0",T_...Compiling module secureip.xil_pcie_fuji_mod3(TIEOFF="1",T_...Compiling module secureip.xil_pcie_fuji_mod3(TIEOFF="1",T_...Compiling module secureip.xil_pcie_fuji_mod3(TIEOFF="1",T_...Compiling module secureip.xil_pcie_fuji_mod3(TIEOFF="1",T_...Compiling module secureip.xil_pcie_fuji_mod3(TIEOFF="0",T_...Compiling module secureip.xil_pcie_fuji_mod3(TIEOFF="0",T_...Compiling module secureip.xil_pcie_fuji_mod3(TIEOFF="0",T_...Compiling module secureip.xil_pcie_fuji_mod3(TIEOFF="1",T_...Compiling module secureip.xil_pcie_fuji_mod3(TIEOFF="1",T_...Compiling module secureip.xil_pcie_fuji_mod3(TIEOFF="1",T_...Compiling module secureip.xil_pcie_fuji_mod3(TIEOFF="1",T_...Compiling module secureip.xil_pcie_fuji_mod3(TIEOFF="1",T_...Compiling module secureip.xil_pcie_fuji_mod3(TIEOFF="1",T_...Compiling module secureip.xil_pcie_fuji_mod3(TIEOFF="1",T_...Compiling module secureip.xil_pcie_fuji_mod3(TIEOFF="0",T_...Compiling module secureip.xil_pcie_fuji_mod3(TIEOFF="0",T_...Compiling module secureip.xil_pcie_fuji_mod3(TIEOFF="1",T_...Compiling module secureip.xil_pcie_fuji_mod3(TIEOFF="1",T_...Compiling module secureip.xil_pcie_fuji_mod3(TIEOFF="1",T_...Compiling module secureip.xil_pcie_fuji_mod3(TIEOFF="0",T_...Compiling module secureip.xil_pcie_fuji_mod3(TIEOFF="1",T_...Compiling module secureip.xil_pcie_fuji_mod3(TIEOFF="1",T_...Compiling module secureip.xil_pcie_fuji_mod3(TIEOFF="1",T_...Compiling module secureip.xil_pcie_fuji_mod3(TIEOFF="1",T_...Compiling module secureip.xil_pcie_fuji_mod3(TIEOFF="0",T_...Compiling module secureip.xil_pcie_fuji_mod3(TIEOFF="0",T_...Compiling module secureip.xil_pcie_fuji_mod3(TIEOFF="1",T_...Compiling module secureip.xil_pcie_fuji_mod3(TIEOFF="1",T_...Compiling module secureip.xil_pcie_fuji_mod3(TIEOFF="0",T_...Compiling module secureip.xil_pcie_fuji_mod3(TIEOFF="0",T_...Compiling module secureip.xil_pcie_fuji_mod3(TIEOFF="0",T_...Compiling module secureip.xil_pcie_fuji_mod3(TIEOFF="0",T_...Compiling module secureip.xil_pcie_fuji_mod3(TIEOFF="0",T_...Compiling module secureip.xil_pcie_fuji_mod3(TIEOFF="0",T_...Compiling module secureip.xil_pcie_fuji_mod3(TIEOFF="0",T_...Compiling module secureip.xil_pcie_fuji_mod3(TIEOFF="0",T_...Compiling module secureip.xil_pcie_fuji_mod3(TIEOFF="1",T_...Compiling module secureip.xil_pcie_fuji_mod3(TIEOFF="1",T_...Compiling module secureip.xil_pcie_fuji_mod3(TIEOFF="1",T_...Compiling module secureip.xil_pcie_fuji_mod3(TIEOFF="0",T_...Compiling module secureip.xil_pcie_fuji_mod3(TIEOFF="0",T_...Compiling module secureip.xil_pcie_fuji_mod3(TIEOFF="1",T_...Compiling module secureip.xil_pcie_fuji_mod3(TIEOFF="0",T_...Compiling module secureip.xil_pcie_fuji_mod3(TIEOFF="0",T_...Compiling module secureip.xil_pcie_fuji_mod3(TIEOFF="0",T_...Compiling module secureip.xil_pcie_fuji_mod3(TIEOFF="0",T_...Compiling module secureip.xil_pcie_fuji_mod3(TIEOFF="0",T_...Compiling module secureip.xil_pcie_fuji_mod3(TIEOFF="1",T_...Compiling module secureip.xil_pcie_fuji_mod3(TIEOFF="0",T_...Compiling module secureip.xil_pcie_fuji_mod3(TIEOFF="0",T_...Compiling module secureip.xil_pcie_fuji_mod3(TIEOFF="0",T_...Compiling module secureip.xil_pcie_fuji_mod3(TIEOFF="0",T_...Compiling module secureip.xil_pcie_fuji_mod3(TIEOFF="0",T_...Compiling module secureip.xil_pcie_fuji_mod3(TIEOFF="0",T_...Compiling module secureip.xil_pcie_fuji_mod3(TIEOFF="0",T_...Compiling module secureip.xil_pcie_fuji_mod3(TIEOFF="1",T_...Compiling module secureip.xil_pcie_fuji_mod3(TIEOFF="0",T_...Compiling module secureip.xil_pcie_fuji_mod3(TIEOFF="0",T_...Compiling module secureip.xil_pcie_fuji_mod3(TIEOFF="0",T_...Compiling module secureip.xil_pcie_fuji_mod3(TIEOFF="0",T_...Compiling module secureip.xil_pcie_fuji_mod3(TIEOFF="0",T_...Compiling module secureip.xil_pcie_fuji_mod3(TIEOFF="0",T_...Compiling module secureip.xil_pcie_fuji_mod3(TIEOFF="0",T_...Compiling module secureip.xil_pcie_fuji_mod3(TIEOFF="0",T_...Compiling module secureip.xil_pcie_fuji_mod3(TIEOFF="1",T_...Compiling module secureip.xil_pcie_fuji_mod3(TIEOFF="0",T_...Compiling module secureip.xil_pcie_fuji_mod3(TIEOFF="0",T_...Compiling module secureip.xil_pcie_fuji_mod3(TIEOFF="0",T_...Compiling module secureip.xil_pcie_fuji_mod3(TIEOFF="0",T_...Compiling module secureip.xil_pcie_fuji_mod3(TIEOFF="0",T_...Compiling module secureip.xil_pcie_fuji_mod3(TIEOFF="0",T_...Compiling module secureip.xil_pcie_fuji_mod3(TIEOFF="0",T_...Compiling module secureip.xil_pcie_fuji_mod3(TIEOFF="0",T_...Compiling module secureip.xil_pcie_fuji_mod3(TIEOFF="0",T_...Compiling module secureip.xil_pcie_fuji_mod3(TIEOFF="0",T_...Compiling module secureip.xil_pcie_fuji_mod3(TIEOFF="0",T_...Compiling module secureip.xil_pcie_fuji_mod3(TIEOFF="0",T_...Compiling module secureip.xil_pcie_fuji_mod3(TIEOFF="0",T_...Compiling module secureip.xil_pcie_fuji_mod3(TIEOFF="0",T_...Compiling module secureip.xil_pcie_fuji_mod3(TIEOFF="0",T_...Compiling module secureip.xil_pcie_fuji_mod3(TIEOFF="0",T_...Compiling module secureip.xil_pcie_fuji_mod3(TIEOFF="1",T_...Compiling module secureip.xil_pcie_fuji_mod3(TIEOFF="0",T_...Compiling module secureip.xil_pcie_fuji_mod3(TIEOFF="0",T_...Compiling module secureip.xil_pcie_fuji_mod3(TIEOFF="1",T_...Compiling module secureip.xil_pcie_fuji_mod3(TIEOFF="0",T_...Compiling module secureip.xil_pcie_fuji_mod3(TIEOFF="0",T_...Compiling module secureip.xil_pcie_fuji_mod3(TIEOFF="0",T_...Compiling module secureip.xil_pcie_fuji_mod3(TIEOFF="0",T_...Compiling module secureip.xil_pcie_fuji_mod3(TIEOFF="0",T_...Compiling module secureip.xil_pcie_fuji_mod3(TIEOFF="0",T_...Compiling module secureip.xil_pcie_fuji_mod3(TIEOFF="0",T_...Compiling module secureip.xil_pcie_fuji_mod3(TIEOFF="0",T_...Compiling module secureip.xil_pcie_fuji_mod3(TIEOFF="0",T_...Compiling module secureip.xil_pcie_fuji_mod3(TIEOFF="0",T_...Compiling module secureip.xil_pcie_fuji_mod3(TIEOFF="0",T_...Compiling module secureip.xil_pcie_fuji_mod3(TIEOFF="0",T_...Compiling module secureip.xil_pcie_fuji_mod3(TIEOFF="0",T_...Compiling module secureip.xil_pcie_fuji_mod3(TIEOFF="1",T_...Compiling module secureip.xil_pcie_fuji_mod3(TIEOFF="0",T_...Compiling module secureip.xil_pcie_fuji_mod3(TIEOFF="0",T_...Compiling module secureip.xil_pcie_fuji_mod3(TIEOFF="0",T_...Compiling module secureip.xil_pcie_fuji_mod3(TIEOFF="0",T_...Compiling module secureip.xil_pcie_fuji_mod3(TIEOFF="0",T_...Compiling module secureip.xil_pcie_fuji_mod3(TIEOFF="0",T_...Compiling module secureip.xil_pcie_fuji_mod3(TIEOFF="0",T_...Compiling module secureip.xil_pcie_fuji_mod3(TIEOFF="0",T_...Compiling module secureip.xil_pcie_fuji_mod3(TIEOFF="1",T_...Compiling module secureip.xil_pcie_fuji_mod3(TIEOFF="0",T_...Compiling module secureip.xil_pcie_fuji_mod3(TIEOFF="0",T_...Compiling module secureip.xil_pcie_fuji_mod3(TIEOFF="0",T_...Compiling module secureip.xil_pcie_fuji_mod3(TIEOFF="0",T_...Compiling module secureip.xil_pcie_fuji_mod3(TIEOFF="0",T_...Compiling module secureip.xil_pcie_fuji_mod3(TIEOFF="0",T_...Compiling module secureip.xil_pcie_fuji_mod3(TIEOFF="0",T_...Compiling module secureip.xil_pcie_fuji_mod3(TIEOFF="0",T_...Compiling module secureip.xil_pcie_fuji_mod3(TIEOFF="0",T_...Compiling module secureip.xil_pcie_fuji_mod3(TIEOFF="0",T_...Compiling module secureip.xil_pcie_fuji_mod3(TIEOFF="0",T_...Compiling module secureip.xil_pcie_fuji_mod3(TIEOFF="0",T_...Compiling module secureip.xil_pcie_fuji_mod3(TIEOFF="0",T_...Compiling module secureip.xil_pcie_fuji_mod3(TIEOFF="0",T_...Compiling module secureip.xil_pcie_fuji_mod3(TIEOFF="0",T_...Compiling module secureip.xil_pcie_fuji_mod3(TIEOFF="0",T_...Compiling module secureip.xil_pcie_fuji_mod3(TIEOFF="0",T_...Compiling module secureip.xil_pcie_fuji_mod3(TIEOFF="0",T_...Compiling module secureip.xil_pcie_fuji_mod3(TIEOFF="0",T_...Compiling module secureip.xil_pcie_fuji_mod3(TIEOFF="0",T_...Compiling module secureip.xil_pcie_fuji_mod3(TIEOFF="0",T_...Compiling module secureip.xil_pcie_fuji_mod3(TIEOFF="0",T_...Compiling module secureip.xil_pcie_fuji_mod3(TIEOFF="0",T_...Compiling module secureip.xil_pcie_fuji_mod3(TIEOFF="0",T_...Compiling module secureip.xil_pcie_fuji_mod3(TIEOFF="1",T_...Compiling module secureip.xil_pcie_fuji_mod3(TIEOFF="1",T_...Compiling module secureip.xil_pcie_fuji_mod3(TIEOFF="1",T_...Compiling module secureip.xil_pcie_fuji_mod3(TIEOFF="1",T_...Compiling module secureip.xil_pcie_fuji_mod3(TIEOFF="0",T_...Compiling module secureip.xil_pcie_fuji_mod3(TIEOFF="0",T_...Compiling module secureip.xil_pcie_fuji_mod3(TIEOFF="0",T_...Compiling module secureip.xil_pcie_fuji_mod3(TIEOFF="0",T_...Compiling module secureip.xil_pcie_fuji_mod3(TIEOFF="0",T_...Compiling module secureip.xil_pcie_fuji_mod3(TIEOFF="0",T_...Compiling module secureip.xil_pcie_fuji_mod3(TIEOFF="1",T_...Compiling module secureip.xil_pcie_fuji_mod3(TIEOFF="0",T_...Compiling module secureip.xil_pcie_fuji_mod3(TIEOFF="0",T_...Compiling module secureip.xil_pcie_fuji_mod3(TIEOFF="1",T_...Compiling module secureip.xil_pcie_fuji_mod3(TIEOFF="0",T_...Compiling module secureip.xil_pcie_fuji_mod3(TIEOFF="0",T_...Compiling module secureip.xil_pcie_fuji_mod3(TIEOFF="0",T_...Compiling module secureip.xil_pcie_fuji_mod3(TIEOFF="0",T_...Compiling module secureip.xil_pcie_fuji_mod3(TIEOFF="0",T_...Compiling module secureip.xil_pcie_fuji_mod3(TIEOFF="0",T_...Compiling module secureip.xil_pcie_fuji_mod3(TIEOFF="0",T_...Compiling module secureip.xil_pcie_fuji_mod3(TIEOFF="1",T_...Compiling module secureip.xil_pcie_fuji_mod3(TIEOFF="0",T_...Compiling module secureip.xil_pcie_fuji_mod3(TIEOFF="0",T_...Compiling module secureip.xil_pcie_fuji_mod3(TIEOFF="0",T_...Compiling module secureip.xil_pcie_fuji_mod3(TIEOFF="0",T_...Compiling module secureip.xil_pcie_fuji_mod3(TIEOFF="0",T_...Compiling module secureip.xil_pcie_fuji_mod3(TIEOFF="1",T_...Compiling module secureip.xil_pcie_fuji_mod3(TIEOFF="0",T_...Compiling module secureip.xil_pcie_fuji_mod3(TIEOFF="0",T_...Compiling module secureip.xil_pcie_fuji_mod3(TIEOFF="0",T_...Compiling module secureip.xil_pcie_fuji_mod3(TIEOFF="0",T_...Compiling module secureip.xil_pcie_fuji_mod3(TIEOFF="0",T_...Compiling module secureip.xil_pcie_fuji_mod3(TIEOFF="0",T_...Compiling module secureip.xil_pcie_fuji_mod3(TIEOFF="0",T_...Compiling module secureip.xil_pcie_fuji_mod3(TIEOFF="0",T_...Compiling module secureip.xil_pcie_fuji_mod3(TIEOFF="1",T_...Compiling module secureip.xil_pcie_fuji_mod3(TIEOFF="0",T_...Compiling module secureip.xil_pcie_fuji_mod3(TIEOFF="0",T_...Compiling module secureip.xil_pcie_fuji_mod3(TIEOFF="0",T_...Compiling module secureip.xil_pcie_fuji_mod3(TIEOFF="0",T_...Compiling module secureip.xil_pcie_fuji_mod3(TIEOFF="0",T_...Compiling module secureip.xil_pcie_fuji_mod3(TIEOFF="0",T_...Compiling module secureip.xil_pcie_fuji_mod3(TIEOFF="0",T_...Compiling module secureip.xil_pcie_fuji_mod3(TIEOFF="0",T_...Compiling module secureip.xil_pcie_fuji_mod3(TIEOFF="0",T_...Compiling module secureip.xil_pcie_fuji_mod3(TIEOFF="0",T_...Compiling module secureip.xil_pcie_fuji_mod3(TIEOFF="0",T_...Compiling module secureip.xil_pcie_fuji_mod3(TIEOFF="0",T_...Compiling module secureip.xil_pcie_fuji_mod3(TIEOFF="0",T_...Compiling module secureip.xil_pcie_fuji_mod3(TIEOFF="0",T_...Compiling module secureip.xil_pcie_fuji_mod3(TIEOFF="0",T_...Compiling module secureip.xil_pcie_fuji_mod3(TIEOFF="0",T_...Compiling module secureip.xil_pcie_fuji_mod3(TIEOFF="1",T_...Compiling module secureip.xil_pcie_fuji_mod3(TIEOFF="0",T_...Compiling module secureip.xil_pcie_fuji_mod3(TIEOFF="0",T_...Compiling module secureip.xil_pcie_fuji_mod3(TIEOFF="1",T_...Compiling module secureip.xil_pcie_fuji_mod3(TIEOFF="0",T_...Compiling module secureip.xil_pcie_fuji_mod3(TIEOFF="0",T_...Compiling module secureip.xil_pcie_fuji_mod3(TIEOFF="0",T_...Compiling module secureip.xil_pcie_fuji_mod3(TIEOFF="0",T_...Compiling module secureip.xil_pcie_fuji_mod3(TIEOFF="0",T_...Compiling module secureip.xil_pcie_fuji_mod3(TIEOFF="0",T_...Compiling module secureip.xil_pcie_fuji_mod3(TIEOFF="0",T_...Compiling module secureip.xil_pcie_fuji_mod3(TIEOFF="0",T_...Compiling module secureip.xil_pcie_fuji_mod3(TIEOFF="0",T_...Compiling module secureip.xil_pcie_fuji_mod3(TIEOFF="0",T_...Compiling module secureip.xil_pcie_fuji_mod3(TIEOFF="0",T_...Compiling module secureip.xil_pcie_fuji_mod3(TIEOFF="0",T_...Compiling module secureip.xil_pcie_fuji_mod3(TIEOFF="0",T_...Compiling module secureip.xil_pcie_fuji_mod3(TIEOFF="1",T_...Compiling module secureip.xil_pcie_fuji_mod3(TIEOFF="0",T_...Compiling module secureip.xil_pcie_fuji_mod3(TIEOFF="0",T_...Compiling module secureip.xil_pcie_fuji_mod3(TIEOFF="0",T_...Compiling module secureip.xil_pcie_fuji_mod3(TIEOFF="0",T_...Compiling module secureip.xil_pcie_fuji_mod3(TIEOFF="0",T_...Compiling module secureip.xil_pcie_fuji_mod3(TIEOFF="0",T_...Compiling module secureip.xil_pcie_fuji_mod3(TIEOFF="0",T_...Compiling module secureip.xil_pcie_fuji_mod3(TIEOFF="0",T_...Compiling module secureip.xil_pcie_fuji_mod3(TIEOFF="1",T_...Compiling module secureip.xil_pcie_fuji_mod3(TIEOFF="0",T_...Compiling module secureip.xil_pcie_fuji_mod3(TIEOFF="0",T_...Compiling module secureip.xil_pcie_fuji_mod3(TIEOFF="0",T_...Compiling module secureip.xil_pcie_fuji_mod3(TIEOFF="0",T_...Compiling module secureip.xil_pcie_fuji_mod3(TIEOFF="0",T_...Compiling module secureip.xil_pcie_fuji_mod3(TIEOFF="0",T_...Compiling module secureip.xil_pcie_fuji_mod3(TIEOFF="0",T_...Compiling module secureip.xil_pcie_fuji_mod3(TIEOFF="0",T_...Compiling module secureip.xil_pcie_fuji_mod3(TIEOFF="0",T_...Compiling module secureip.xil_pcie_fuji_mod3(TIEOFF="0",T_...Compiling module secureip.xil_pcie_fuji_mod3(TIEOFF="0",T_...Compiling module secureip.xil_pcie_fuji_mod3(TIEOFF="0",T_...Compiling module secureip.xil_pcie_fuji_mod3(TIEOFF="0",T_...Compiling module secureip.xil_pcie_fuji_mod3(TIEOFF="0",T_...Compiling module secureip.xil_pcie_fuji_mod3(TIEOFF="0",T_...Compiling module secureip.xil_pcie_fuji_mod3(TIEOFF="0",T_...Compiling module secureip.xil_pcie_fuji_mod3(TIEOFF="0",T_...Compiling module secureip.xil_pcie_fuji_mod3(TIEOFF="0",T_...Compiling module secureip.xil_pcie_fuji_mod3(TIEOFF="0",T_...Compiling module secureip.xil_pcie_fuji_mod3(TIEOFF="0",T_...Compiling module secureip.xil_pcie_fuji_mod3(TIEOFF="0",T_...Compiling module secureip.xil_pcie_fuji_mod3(TIEOFF="0",T_...Compiling module secureip.xil_pcie_fuji_mod12Compiling module secureip.xil_pcie_fuji_mod13Compiling module secureip.xil_pcie_fuji_mod14Compiling module secureip.xil_pcie_fuji_mod15Compiling module secureip.xil_pcie_fuji_mod9Compiling module secureip.xil_pcie_fuji_mod8Compiling module secureip.xil_pcie_fuji_mod11Compiling module secureip.xil_pcie_fuji_mod10Compiling module secureip.xil_pcie_fuji_mod17Compiling module secureip.xil_pcie_fuji_mod21_defaultCompiling module secureip.xil_pcie_fuji_mod22Compiling module secureip.xil_pcie_fuji_mod27Compiling module secureip.xil_pcie_fuji_mod29Compiling module secureip.xil_pcie_fuji_mod0Compiling module secureip.xil_pcie_fuji_mod30Compiling module secureip.xil_pcie_fuji_mod36Compiling module secureip.xil_pcie_fuji_mod2Compiling module secureip.xil_pcie_fuji_mod37Compiling module secureip.xil_pcie_fuji_mod38Compiling module secureip.xil_pcie_fuji_mod35Compiling module secureip.xil_pcie_fuji_mod40Compiling module secureip.xil_pcie_fuji_mod41_defaultCompiling module secureip.xil_pcie_fuji_mod42Compiling module secureip.xil_pcie_fuji_mod39Compiling module secureip.xil_pcie_fuji_mod44Compiling module secureip.xil_pcie_fuji_mod43Compiling module secureip.xil_pcie_fuji_mod46Compiling module secureip.xil_pcie_fuji_mod47Compiling module secureip.xil_pcie_fuji_mod45Compiling module secureip.xil_pcie_fuji_mod34(NO_OF_LANES=...Compiling module secureip.xil_pcie_fuji_mod33Compiling module secureip.xil_pcie_fuji_mod31(NO_OF_LANES=...Compiling module secureip.xil_pcie_fuji_mod52Compiling module secureip.xil_pcie_fuji_mod51Compiling module secureip.xil_pcie_fuji_mod50Compiling module secureip.xil_pcie_fuji_mod49Compiling module secureip.xil_pcie_fuji_mod48(NO_OF_LANES=...Compiling module secureip.xil_pcie_fuji_mod26Compiling module secureip.xil_pcie_fuji_mod24Compiling module secureip.xil_pcie_fuji_mod25Compiling module secureip.xil_pcie_fuji_mod23_defaultCompiling module secureip.xil_pcie_fuji_mod20(NO_OF_LANES=...Compiling module secureip.xil_pcie_fuji_mod53(IMPL_TARGET=...Compiling module secureip.xil_pcie_fuji_mod75Compiling module secureip.xil_pcie_fuji_mod78Compiling module secureip.xil_pcie_fuji_mod79Compiling module secureip.xil_pcie_fuji_mod80Compiling module secureip.xil_pcie_fuji_mod74Compiling module secureip.xil_pcie_fuji_mod83(DW=64,TCQ=1)Compiling module secureip.xil_pcie_fuji_mod56(DEPTH=4,STYL...Compiling module secureip.xil_pcie_fuji_mod81Compiling module secureip.xil_pcie_fuji_mod77Compiling module secureip.xil_pcie_fuji_mod76Compiling module secureip.xil_pcie_fuji_mod82(TCQ=1)Compiling module secureip.xil_pcie_fuji_mod84(NUM_LANES=8,...Compiling module secureip.xil_pcie_fuji_mod69Compiling module secureip.xil_pcie_fuji_mod70Compiling module secureip.xil_pcie_fuji_mod71Compiling module secureip.xil_pcie_fuji_mod72Compiling module secureip.xil_pcie_fuji_mod73Compiling module secureip.xil_pcie_fuji_mod68Compiling module secureip.xil_pcie_fuji_mod55(TCQ=1,SCALE=...Compiling module secureip.xil_pcie_fuji_mod55(TCQ=1,DELAY_...Compiling module secureip.xil_pcie_fuji_mod67(TCQ=1,LINK_S...Compiling module secureip.xil_pcie_fuji_mod59(LINK_STATES=...Compiling module secureip.xil_pcie_fuji_mod65Compiling module secureip.xil_pcie_fuji_mod62(TCQ=1)Compiling module secureip.xil_pcie_fuji_mod63(TCQ=1)Compiling module secureip.xil_pcie_fuji_mod64Compiling module secureip.xil_pcie_fuji_mod60(TCQ=1)Compiling module secureip.xil_pcie_fuji_mod58Compiling module secureip.xil_pcie_fuji_mod61(TCQ=1)Compiling module secureip.xil_pcie_fuji_mod66(TCQ=1)Compiling module secureip.xil_pcie_fuji_mod57(TCQ=1)Compiling module secureip.xil_pcie_fuji_mod117(TCQ=1,DW=64...Compiling module secureip.xil_pcie_fuji_mod87(TCQ=1,IMPL_T...Compiling module secureip.xil_pcie_fuji_mod119(TCQ=1,TBAW=...Compiling module secureip.xil_pcie_fuji_mod118(TCQ=1)Compiling module secureip.xil_pcie_fuji_mod89Compiling module secureip.xil_pcie_fuji_mod88(TCQ=1,DW=64,...Compiling module secureip.xil_pcie_fuji_mod87(TCQ=1,IMPL_T...Compiling module secureip.xil_pcie_fuji_mod87(TCQ=1,IMPL_T...Compiling module secureip.xil_pcie_fuji_mod112(TCQ=1,TRAW=...Compiling module secureip.xil_pcie_fuji_mod111(TCQ=1,DW=64...Compiling module secureip.xil_pcie_fuji_mod110(DW=64,TBCW=...Compiling module secureip.xil_pcie_fuji_mod87(TCQ=1,IMPL_T...Compiling module secureip.xil_pcie_fuji_mod113(TCQ=1,TBAW=...Compiling module secureip.xil_pcie_fuji_mod87(TCQ=1,IMPL_T...Compiling module secureip.xil_pcie_fuji_mod87(TCQ=1,IMPL_T...Compiling module secureip.xil_pcie_fuji_mod87(TCQ=1,IMPL_T...Compiling module secureip.xil_pcie_fuji_mod114(TCQ=1,FCW=7...Compiling module secureip.xil_pcie_fuji_mod115(TCQ=1,TBAW=...Compiling module secureip.xil_pcie_fuji_mod116(TCQ=1,RETIM...Compiling module secureip.xil_pcie_fuji_mod109(TCQ=1,DW=64...Compiling module secureip.xil_pcie_fuji_mod120(TCQ=1,TBCW=...Compiling module secureip.xil_pcie_fuji_mod108(TCQ=1,DW=64...Compiling module secureip.xil_pcie_fuji_mod88(TCQ=1,DW=64,...Compiling module secureip.xil_pcie_fuji_mod101(DW=64,DMW=7...Compiling module secureip.xil_pcie_fuji_mod87(TCQ=1,IMPL_T...Compiling module secureip.xil_pcie_fuji_mod94(DW=64,DMW=72...Compiling module secureip.xil_pcie_fuji_mod87(TCQ=1,IMPL_T...Compiling module secureip.xil_pcie_fuji_mod93(DW=64,DMW=72...Compiling module secureip.xil_pcie_fuji_mod87(TCQ=1,IMPL_T...Compiling module secureip.xil_pcie_fuji_mod87(TCQ=1,IMPL_T...Compiling module secureip.xil_pcie_fuji_mod95(IMPL_TARGET=...Compiling module secureip.xil_pcie_fuji_mod96(DW=64,REG_CT...Compiling module secureip.xil_pcie_fuji_mod99(BARW=8,SBW_I...Compiling module secureip.xil_pcie_fuji_mod92(DW=64,DMW=72...Compiling module secureip.xil_pcie_fuji_mod98(FC_TYPE=2'b0...Compiling module secureip.xil_pcie_fuji_mod98(FC_TYPE=2'b0...Compiling module secureip.xil_pcie_fuji_mod98(FC_TYPE=2'b1...Compiling module secureip.xil_pcie_fuji_mod97(DW=64,MPS=10...Compiling module secureip.xil_pcie_fuji_mod100(DW=64,TCQ=1...Compiling module secureip.xil_pcie_fuji_mod91(RRAW=13,DW=6...Compiling module secureip.xil_pcie_fuji_mod105(DW=64,FCW=9...Compiling module secureip.xil_pcie_fuji_mod104(TCQ=1)Compiling module secureip.xil_pcie_fuji_mod103(DW=64,FCW=9...Compiling module secureip.xil_pcie_fuji_mod106(TCQ=1)Compiling module secureip.xil_pcie_fuji_mod102(DW=64,TCQ=1...Compiling module secureip.xil_pcie_fuji_mod107(OQ_HEADERS=...Compiling module secureip.xil_pcie_fuji_mod90(DW=64,DMW=72...Compiling module secureip.xil_pcie_fuji_mod86(TCQ=1)Compiling module secureip.xil_pcie_fuji_mod85(IMPL_TARGET=...Compiling module secureip.xil_pcie_fuji_mod56(WIDTH=137,DE...Compiling module secureip.xil_pcie_fuji_mod122(TCQ=1)Compiling module secureip.xil_pcie_fuji_mod123Compiling module secureip.xil_pcie_fuji_mod124(TCQ=1)Compiling module secureip.xil_pcie_fuji_mod56(WIDTH=16,DEP...Compiling module secureip.xil_pcie_fuji_mod56(WIDTH=133,DE...Compiling module secureip.xil_pcie_fuji_mod125(IMPL_TARGET...Compiling module secureip.xil_pcie_fuji_mod56(WIDTH=49,DEP...Compiling module secureip.xil_pcie_fuji_mod56(WIDTH=50,DEP...Compiling module secureip.xil_pcie_fuji_mod126(TCQ=1)Compiling module secureip.xil_pcie_fuji_mod127(LTW=15,TCQ=...Compiling module secureip.xil_pcie_fuji_mod128(TCQ=1)Compiling module secureip.xil_pcie_fuji_mod129(TCQ=1)Compiling module secureip.xil_pcie_fuji_mod130(TCQ=1)Compiling module secureip.xil_pcie_fuji_mod55(TCQ=1,LTW=15...Compiling module secureip.xil_pcie_fuji_mod121(TCQ=1,IMPL_...Compiling module secureip.xil_pcie_fuji_mod54(IMPL_TARGET=...Compiling module secureip.xil_pcie_fuji_mod131_defaultCompiling module secureip.xil_pcie_fuji_mod132(PROCESS="28...Compiling module secureip.xil_pcie_fuji_mod133Compiling module secureip.xil_pcie_fuji_mod19(PLM_NO_OF_LA...Compiling module secureip.xil_pcie_fuji_mod18Compiling module secureip.xil_pcie_fuji_mod7Compiling module secureip.xil_pcie_fuji_mod6Compiling module secureip.xil_pcie_fuji_mod5Compiling module secureip.xil_pcie_fuji_mod4(AER_BASE_PTR=...ERROR: [XSIM 43-3294] Signal EXCEPTION_ACCESS_VIOLATION receivedERROR: [XSIM 43-3294] Signal EXCEPTION_ACCESS_VIOLATION received










    Attachments:







    error.txt ‏85 KB

    DB:2.69:Simulation Compile Error Of Example Design File pj


    HiYash,

    Can you simulateac701-pcie-rdf0225-2013.2-c file on vivado 2013.2 Version for window xp x86?

    Thanks.

  • RELEVANCY SCORE 2.69

    DB:2.69:Problem With Cimom Process At Boot Up a7


    I have three ESX 3.5 U1 servers and all three of them have the same problem when it starts Pegasus CIMOM (cimserver). I don't know what it means or the impact it has on the server. Attached is an exceprt the log file. This error repeats over and over every time the system is restarted. I'm also curious why this install proceedure happens at every reboot. Is that necessary?

    Starting Pegasus CIMOM (cimserver)... [60G[ [0;32mOK

    CIMOM not responding, sleeping...

    CIMOM not responding, sleeping...

    CIMOM is up, proceeding...

    Installing MOFs...

    Compiling roleauth-schema.mof into root/PG_Interop

    Parsing error: parse error: Error adding class VMware_IdentityMemberOfCollection to the repository: CIM_ERR_NOT_FOUND: The requested object could not be found: "VMware_Identity"

    Compiling omc-smash-interop-schema.mof into root/PG_Interop

    Compiling identity-schema.mof into root/cimv2

    Compiling omc-smash-ipmi-schema.mof into root/cimv2

    Compiling omc-smash-schema.mof into root/cimv2

    Compiling roleauth-schema.mof into root/cimv2

    Compiling vmware-schema.mof into root/cimv2

    Compiling config_schema.mof into root/config

    Installing Configuration instances.

    MOF Compiling /var/pegasus/vmware/install_queue/1_files/mofs/root/config/config_ipmi.mof

    MOF Compiling /var/pegasus/vmware/install_queue/1_files/mofs/root/config/config_pegasus_instances.mof

    MOF Compiling /var/pegasus/vmware/install_queue/1_files/mofs/root/config/config_pegasus_quals.mof

    MOF Compiling /var/pegasus/vmware/install_queue/1_files/mofs/root/config/config_schema.mof

    MOF Compiling /var/pegasus/vmware/install_queue/1_files/mofs/root/config/config_smbios.mof

    Installing new Providers.

    MOF Compiling /var/pegasus/vmware/install_queue/1_files/regs/adp-interop_PegReg.mof

    MOF Compiling /var/pegasus/vmware/install_queue/1_files/regs/adp_PegReg.mof

    MOF Compiling /var/pegasus/vmware/install_queue/1_files/regs/battery_PegReg.mof

    MOF Compiling /var/pegasus/vmware/install_queue/1_files/regs/bsp_PegReg.mof

    MOF Compiling /var/pegasus/vmware/install_queue/1_files/regs/composite_PegReg.mof

    MOF Compiling /var/pegasus/vmware/install_queue/1_files/regs/cp-interop_PegReg.mof

    MOF Compiling /var/pegasus/vmware/install_queue/1_files/regs/cp_PegReg.mof

    MOF Compiling /var/pegasus/vmware/install_queue/1_files/regs/cs_PegReg.mof

    MOF Compiling /var/pegasus/vmware/install_queue/1_files/regs/fan_PegReg.mof

    MOF Compiling /var/pegasus/vmware/install_queue/1_files/regs/identity_PegReg.mof

    MOF Compiling /var/pegasus/vmware/install_queue/1_files/regs/ipmi_PegReg.mof

    MOF Compiling /var/pegasus/vmware/install_queue/1_files/regs/pap_PegReg.mof

    MOF Compiling /var/pegasus/vmware/install_queue/1_files/regs/prp_PegReg.mof

    MOF Compiling /var/pegasus/vmware/install_queue/1_files/regs/psp_PegReg.mof

    MOF Compiling /var/pegasus/vmware/install_queue/1_files/regs/raw-ipmi_PegReg.mof

    MOF Compiling /var/pegasus/vmware/install_queue/1_files/regs/roleauth_PegReg.mof

    MOF Compiling /var/pegasus/vmware/install_queue/1_files/regs/smbios_PegReg.mof

    MOF Compiling /var/pegasus/vmware/install_queue/1_files/regs/smp-interop_PegReg.mof

    MOF Compiling /var/pegasus/vmware/install_queue/1_files/regs/smp_PegReg.mof

    MOF Compiling /var/pegasus/vmware/install_queue/1_files/regs/sp-interop_PegReg.mof

    MOF Compiling /var/pegasus/vmware/install_queue/1_files/regs/sp_PegReg.mof

    MOF Compiling /var/pegasus/vmware/install_queue/1_files/regs/swid_PegReg.mof

    MOF Compiling /var/pegasus/vmware/install_queue/1_files/regs/vmware_PegReg.mof

    Done.

    DB:2.69:Problem With Cimom Process At Boot Up a7

    I found the fix.. Just note I did do a search on vmware's site but it didn't bring up anything

    Did a google search and it brought me back to.. http://communities.vmware.com/thread/138706?tstart=0start=0

    ..which was the fix.

  • RELEVANCY SCORE 2.69

    DB:2.69:Errors Compiling _Runregion.Java 7d


    I am trying to run an OAF page on JDeveloper 10g using R12. The "runregion.jsp" cannot compile and I get the following error:

    Unable to dispatch JSP Page : oracle.jsp.provider.JspCompileException: H3Errors compiling:/oracle/jdevhome/myclasses/.jsps//_runregion.java

    Can anyone help?

    DB:2.69:Errors Compiling _Runregion.Java 7d

    Donot include runregion.jsp in your project.

  • RELEVANCY SCORE 2.69

    DB:2.69:[Resolved] After Changing The Power Ssavings Mode On Yoga 13, Mouse Constantly Flickers xf


    Prior to today, I never had an issue with the Yoga 13. However, I changed the power savings mode prior to my class to go from Balanced to Power Save and changed the battery life from Life to Longevity. Since then, no matter what I am doing, my mouse pointer constantly appears as if it is trying to run something (IE the little blue loading circle). This occurs approximately every three seconds. However, after looking at the Task Manager, I can't depict anything that would cause this to occur.I have restarted the machine thinking that that might have resolve the issue (as does most cases with Windows), but the issue re-occurs. So I thought, alright, I will set the power settings back to what they were before I changed them. Unfortunately, that didn't resolve the situation either. The mouse cursor still randomly appears with the loading screen.While I am sure it isn't going to harm anything, it is incredibly annoying to see every few seconds. So, I was hoping someone might be able to help me out and assist me with this. I don't think this is being caused by any software I have loaded on (I only have installed four different programs since I got the laptop, all of which are on my desktop and don't experience this same issue), and considering it occured after messing with a Lenovo OEM software, I have a feeling that that might be the cause, but... I don't know.I would appreciate any help you offered.EDIT:Resolved, I found this link:http://forums.lenovo.com/t5/IdeaPad-IdeaTab-Slate-Tablets/I-have-been-compiling-a-list-of-fixes-for-...Thanks







    Solved!
    Go to Solution.

    DB:2.69:[Resolved] After Changing The Power Ssavings Mode On Yoga 13, Mouse Constantly Flickers xf

    Glad you managed to solve your issue, and thanks for coming back with the solution!



    Community Advocate Program Manager English Community Deutsche Community Comunidad en Español Русскоязычное Сообщество

  • RELEVANCY SCORE 2.69

    DB:2.69:Loading External Configuration When Compiling Air pm


    I'm developing an AIR app using Flex Builder 3, but I'm using
    a deployment script (Capistrano) to deploy both the AIR file and
    the backend (Ruby on Rails) to various servers.

    The problem is that the AIR file needs to be able to point to
    different addresses based on which environment it was compiled for:
    development (
    http://localhost:3000 ), staging (

    http://my-staging-server ), and
    production (
    http://my-production-cluster
    ).

    It seems that since there are 3 environments, the best option
    would be to have a constant set to
    http://localhost:3000 when
    developing, and have the deployment script change that constant by
    compiling the AIR file at deployment time using the command-line
    SDK. I think it should be somehow possible to do by using different
    config files as command-line options, but I am completely at a loss
    on how to do this. Any help would be greatly appreciated!

    DB:2.69:Loading External Configuration When Compiling Air pm

    You could do this by having three different configuration
    files, each of which is mapped to one well-known name during the
    packaging step. The "-e" adt command line flag is ideal for this.
    See the documentation at
    http://livedocs.adobe.com/flex/3/html/CommandLineTools_5.html.

    Oliver Goldman | Adobe AIR Engineering

  • RELEVANCY SCORE 2.68

    DB:2.68:Not Able To Run Java Programs z8


    Exception in thread "main" java.lang.NoClassDefFoundError. I have set the path and classpath but in user variables. And defined main in my programs. But programs are only compiling not running.

    Please suggest me.

    What do I do?

    Edited by: Ram-Murthy on Apr 10, 2008 2:23 AM

    DB:2.68:Not Able To Run Java Programs z8

    Make sure your main is static.
    public static void main(String [] args) {}

  • RELEVANCY SCORE 2.68

    DB:2.68:Loading And Using Windows Programs zk



    The only reason to buy one of these is to use a Windows Program for an Antenna Analyzer (AIM -4170C).

    Can you download and install Windows Programs on these ?

    Thanks,

    rs

    DB:2.68:Loading And Using Windows Programs zk


    Hey @w1ksz,

    Welcome to the HP Forums!

    Not sure I fully understand your post other than asking if Windows programs can be installed on a Windows tablet.

    If the tablet has a full version of Windows it functions the same way a notebook or desktop PC would. This includes installing programsbuilt for the Windows operating system.

    Thanks.

  • RELEVANCY SCORE 2.68

    DB:2.68:Help Requests!!!(Please) mj


    2 questions:
    1: Is it possible to have java.sun and Microsoft Java machines on the same computer running successfully(I only wish to use Java SDK 1.4.1 for creating Java programs and Microsoft for browsing the web)
    2: I've installed 1.4.1 on my new XP computer, and when compiling get an error message saying cant find javac.exe. I dont have a clue how to get it working, and i need it to.
    I desperately need help, if anyone could help me here, or email me (gavinhealy@hotmail.com) I would REALLY appreciate it.

    DB:2.68:Help Requests!!!(Please) mj

    i think that u need to know that
    can u use java server development kit with windows
    if question is this than answer is yes
    u just need to set class path of jdk
    u can do it like
    on command prompt
    set path=c:\jdk1.4.1\bin
    it will set class path temperarily on that command prompt and u can use that
    otherwise
    set ur path in ur system variables ... permanently so that when ever u will boot ur system , path would be set and u can use it

  • RELEVANCY SCORE 2.68

    DB:2.68:Compiling Problem sz


    Hello,
    I cannot compile programs at home. I am using j2sdk1.4.2_04 on a fresh windows xp load. By a fresh load I mean the only thing on the machine is the OS drivers and the j2sdk. I am using textPad to write programs. When I compile I get the following error.

    bad class file: .\Math.class
    class file has wrong version 49.0, should be 48.0
    Please remove or make sure it appears in the correct subdirectory of the classpath.
    return Math.pow(radius,2)*Math.PI;

    Any help would be greatly appreciated

    note: the program compiles fine in the lab running the same j2sdk

  • RELEVANCY SCORE 2.68

    DB:2.68:Possibility Of Distributed Icc Compiling? 3j



    Hi,

    Not sure if im posting in the correct section, so appologize if im not.

    Our company develops in house applications on linux. We have been building up a distributed compiling grid to allow for fast builds. This system was built for use with GCC. Our developers have now agreed to start compilling with ICC.

    I would like to know if anyone has setup ICC for distributed compiling and if there are any programs / information on how this can be done.

    Thanks for your help in advanced.

    Cheers.

    DB:2.68:Possibility Of Distributed Icc Compiling? 3j

    Quoting - srimks

    Is your company aware about Distributed system? Your co. also mean that to communicate in parallel with other nodes interconnected, your co. is skipping Message Passing Interface(MPI) calls, is the gcc able to take care of parallel communication, somehow not able to understand..could you or your co. discuss the feasibility of what you people have done?

    If GCC can do, certainly ICC or any current commercial compiler can do.

    Please share the connectivity of distributed computing grid in brief, a block diagram of it's flow is also feasible.

    ~BR

    You may try "distcc" package and setup Intel C++ compiler for distributed compiling. The distcc may be downloaded from http://code.google.com/p/distcc/. You may need additional compiler licenses.

    Om

  • RELEVANCY SCORE 2.68

    DB:2.68:Programs Freezes On Start Up Or Just Crashes 9p



    I just did a clean install os Yosemite on Sunday! Downloaded Adobe CC products today! AI PS take 5-10mins to load up each, they Freeze up before loading. Also I uninstalled re-installed the Programs twice. It Still lags and freezes before Loading. But Adobe Bridge Just Crashes! A Lot of people are having this issue. I need some real help here.

    Message was edited by: red reign

    DB:2.68:Programs Freezes On Start Up Or Just Crashes 9p


    Moving the discussion to Bridge General Discussion.

    Thanks,

    Atul Saini

  • RELEVANCY SCORE 2.68

    DB:2.68:Post-Route Simulation Problem xd



    Hi, all

    I am use ise 10.1, modelsim 6.4a SE, and FX70T.

    I want to simulate the Aurora core generated by the core generator. I use the generated example, but i use my own"frame_gen", and my "frame_gen" is right, because I have simulated the module.

    Unfortunately, when I post-route simulate the aurora,the error like this:

    # Reading D:/modeltech_6.4a/tcl/vsim/pref.tcl # // ModelSim SE 6.4a Aug 28 2008 # //# // Copyright 1991-2008 Mentor Graphics Corporation# // All Rights Reserved.# //# // THIS WORK CONTAINS TRADE SECRET AND # // PROPRIETARY INFORMATION WHICH IS THE PROPERTY# // OF MENTOR GRAPHICS CORPORATION OR ITS LICENSORS# // AND IS SUBJECT TO LICENSE TERMS.# //# do {EXAMPLE_TB.tdo} # ** Warning: (vlib-34) Library already exists at "work".# Model Technology ModelSim SE vcom 6.4a Compiler 2008.08 Aug 28 2008# -- Loading package standard# -- Loading package std_logic_1164# -- Loading package vital_timing# -- Loading package vcomponents# -- Loading package vital_primitives# -- Loading package textio# -- Loading package vpackage# -- Compiling entity aurora_201_aurora_example# -- Compiling architecture structure of aurora_201_aurora_example# Model Technology ModelSim SE vcom 6.4a Compiler 2008.08 Aug 28 2008# -- Loading package standard# -- Loading package std_logic_1164# -- Loading package aurora_pkg# -- Compiling entity example_tb# -- Compiling architecture mapped of example_tb# vsim -lib work -sdfmax /UUT=netgen/par/aurora_201_aurora_example_timesim.sdf -t 1ps EXAMPLE_TB # ** Note: (vsim-3812) Design is being optimized...# ** Warning: [1] example_tb.vhd(277): (vopt-3473) Component instance "aurora_example_1_i : aurora_201_aurora_example" is not bound.# ** Error: example_tb.vhd(277): Bad default binding for component instance "aurora_example_1_i : aurora_201_aurora_example".# (Component generic "sim_gtxreset_speedup" is not on the entity.)# ** Warning: [1] example_tb.vhd(319): (vopt-3473) Component instance "aurora_example_2_i : aurora_201_aurora_example" is not bound.# Optimization failed# Error loading design# Error: Error loading design # Pausing macro execution # MACRO ./EXAMPLE_TB.tdo PAUSED at line 8

    The error shows that "Component generic "sim_gtxreset_speedup" is not on the entity",but I sure the the generic "sim_gtxreset_speedup" is on the entity, I don't know why, anyone who can help me?

    Best regards

    hclbupt

    DB:2.68:Post-Route Simulation Problem xd


    Hi, all

    I am use ise 10.1, modelsim 6.4a SE, and FX70T.

    I want to simulate the Aurora core generated by the core generator. I use the generated example, but i use my own"frame_gen", and my "frame_gen" is right, because I have simulated the module.

    Unfortunately, when I post-route simulate the aurora,the error like this:

    # Reading D:/modeltech_6.4a/tcl/vsim/pref.tcl # // ModelSim SE 6.4a Aug 28 2008 # //# // Copyright 1991-2008 Mentor Graphics Corporation# // All Rights Reserved.# //# // THIS WORK CONTAINS TRADE SECRET AND # // PROPRIETARY INFORMATION WHICH IS THE PROPERTY# // OF MENTOR GRAPHICS CORPORATION OR ITS LICENSORS# // AND IS SUBJECT TO LICENSE TERMS.# //# do {EXAMPLE_TB.tdo} # ** Warning: (vlib-34) Library already exists at "work".# Model Technology ModelSim SE vcom 6.4a Compiler 2008.08 Aug 28 2008# -- Loading package standard# -- Loading package std_logic_1164# -- Loading package vital_timing# -- Loading package vcomponents# -- Loading package vital_primitives# -- Loading package textio# -- Loading package vpackage# -- Compiling entity aurora_201_aurora_example# -- Compiling architecture structure of aurora_201_aurora_example# Model Technology ModelSim SE vcom 6.4a Compiler 2008.08 Aug 28 2008# -- Loading package standard# -- Loading package std_logic_1164# -- Loading package aurora_pkg# -- Compiling entity example_tb# -- Compiling architecture mapped of example_tb# vsim -lib work -sdfmax /UUT=netgen/par/aurora_201_aurora_example_timesim.sdf -t 1ps EXAMPLE_TB # ** Note: (vsim-3812) Design is being optimized...# ** Warning: [1] example_tb.vhd(277): (vopt-3473) Component instance "aurora_example_1_i : aurora_201_aurora_example" is not bound.# ** Error: example_tb.vhd(277): Bad default binding for component instance "aurora_example_1_i : aurora_201_aurora_example".# (Component generic "sim_gtxreset_speedup" is not on the entity.)# ** Warning: [1] example_tb.vhd(319): (vopt-3473) Component instance "aurora_example_2_i : aurora_201_aurora_example" is not bound.# Optimization failed# Error loading design# Error: Error loading design # Pausing macro execution # MACRO ./EXAMPLE_TB.tdo PAUSED at line 8

    The error shows that "Component generic "sim_gtxreset_speedup" is not on the entity",but I sure the the generic "sim_gtxreset_speedup" is on the entity, I don't know why, anyone who can help me?

    Best regards

    hclbupt

  • RELEVANCY SCORE 2.68

    DB:2.68:Problem Compiling Sunstudio11 Project On Fedora Fc5 pz


    When attempting to compile the sample programs for SunStudio 11 I get the following error message:
    "dmake: error while loading shared libraries: libstdc++.so.5: cannot open shared object file: No such file or directory"

    FC5 is installed with libstdc++.so.6

    Does this mean Sun Studio is not compatible with FC5?
    Is there a work around?

    DB:2.68:Problem Compiling Sunstudio11 Project On Fedora Fc5 pz

    A simple and obvious workaround is to install libstdc++.so.5 :-)
    Another workaround is to use GNU make (/bin/make) instead of dmake.
    All makefiles, generated by Sun Studio, should work just fine with any POSIX
    compatible "make" utility. You can look at project properties and change the
    build command.
    Let me know if you did not find how to change dmake to make.

    Thanks,
    Nik