• RELEVANCY SCORE 4.40

    DB:4.40:Error Code: Error 198:4 sc




    I try to activate from Internet but it doesn't work. I get this message

    Error 198:4
    We are unable to activate photoshop cs3 extended bla bla bla.

    DB:4.40:Error Code: Error 198:4 sc

    You can call it "fleebzat" if you want to, doesn't matter.

    Doesn't change anything.

    :)

  • RELEVANCY SCORE 3.49

    DB:3.49:Re: Raise_Application_Error Gets Ora-06502 When Message Is 198 Chars Or More 37




    No error:

    SQL DECLARE
    2 lv_error_msg VARCHAR2(4000) := NULL;
    3 BEGIN
    4 -- 198 char DOES NOT work.
    5 lv_error_msg := LPAD('$',198,'$');
    6 END;
    7 /

    PL/SQL procedure successfully completed.

    SQL

    And so why does the trigger cause the error?

    Thanks,
    Mike

  • RELEVANCY SCORE 3.36

    DB:3.36:Help With Jaas Ldap Authentication In Karaf s3





    I tried to follow the tutorial to enable LDAP authentication, but I am getting errors when I try to connect. The user I am trying to access is valid (uid=dhoyt,ou=employees,dc=example,dc=com). I can see that if I have an invalid password or a non-existent user that I get the expected errors stating such. The problem is that when I try to login to the webconsole using the dhoyt user, I get an error back stating that it can't get the roles for the user (LDAP error code 80). Below is the ldap-module.xml I put in the deploy directory and the error from the servicemix.log file. I am using apache-servicemix-4.3.1-fuse-01-09 on Solaris 10 (JDK 1.6_20). I want to allow logins for anyone in the cn=smxAdmin,ou=roles,dc=example,dc=com role.

    Any help with this would be greatly appreciated.

    ldap-module.xml is:

    Exception is:

    javax.security.auth.login.LoginException: Can't get user dhoyt roles: LDAP: error code 80 - An unexpected error was encountered while processing a search in one of the Directory Server backends: NullPointerException(ConcurrentHashMap.java:768)

    at org.apache.karaf.jaas.modules.ldap.LDAPLoginModule.doLogin(LDAPLoginModule.java:242)

    at org.apache.karaf.jaas.modules.ldap.LDAPLoginModule.login(LDAPLoginModule.java:132)

    at org.apache.karaf.jaas.boot.ProxyLoginModule.login(ProxyLoginModule.java:83)[karaf-jaas-boot.jar:]

    at sun.reflect.NativeMethodAccessorImpl.invoke0(Native Method)[:1.6.0_20]

    at sun.reflect.NativeMethodAccessorImpl.invoke(NativeMethodAccessorImpl.java:39)[:1.6.0_20]

    at sun.reflect.DelegatingMethodAccessorImpl.invoke(DelegatingMethodAccessorImpl.java:25)[:1.6.0_20]

    at java.lang.reflect.Method.invoke(Method.java:597)[:1.6.0_20]

    at javax.security.auth.login.LoginContext.invoke(LoginContext.java:769)[:1.6.0_20]

    at javax.security.auth.login.LoginContext.access$000(LoginContext.java:186)[:1.6.0_20]

    at javax.security.auth.login.LoginContext$4.run(LoginContext.java:683)[:1.6.0_20]

    at java.security.AccessController.doPrivileged(Native Method)[:1.6.0_20]

    at javax.security.auth.login.LoginContext.invokePriv(LoginContext.java:680)[:1.6.0_20]

    at javax.security.auth.login.LoginContext.login(LoginContext.java:579)[:1.6.0_20]

    at org.apache.karaf.webconsole.JaasSecurityProvider.authenticate(JaasSecurityProvider.java:66)[198:org.apache.felix.webconsole:3.1.2]

    at org.apache.felix.webconsole.internal.servlet.OsgiManager$SecurityProvider.authenticate(OsgiManager.java:995)[198:org.apache.felix.webconsole:3.1.2]

    at org.apache.felix.webconsole.internal.servlet.OsgiManagerHttpContext.handleSecurity(OsgiManagerHttpContext.java:123)[198:org.apache.felix.webcons

    DB:3.36:Help With Jaas Ldap Authentication In Karaf s3


    Thanks for the help! It was the role.filter. It has to match the entry in my role exactly. In my case, the correct setting was:

    role.filter = (Member of Group:=uid=%u)

    Thanks for the help!

  • RELEVANCY SCORE 3.32

    DB:3.32:Odpconnection Error 516 9z



    [ERROR] 516:Error: 516 Detail: Error sending request to server Native Error: -2 Source: moClient.cpp 1923./Location:-[ODPConnectionStateChangeListener onConnectionStateChanged:connectionType:error:errorMsg:] + 198

    Can anyone tell me how to solve this ? Thank you.

    DB:3.32:Odpconnection Error 516 9z


    Hi Gray ruan.

    I am also getting the same issues if you get any solutions for this please let me know.

    Thanks.

  • RELEVANCY SCORE 3.21

    DB:3.21:Error In Installation Of 11i Apps 3k


    Hi

    I was trying to install the 11i apps on my Linux server. I got this error

    11.5.10.2 on Linux 4.0

    Error while running adlnkoh.sh. Please check logfile

    Errors while running adlnkoh.sh

    There was an error while running the command - /11i/app/oracle/visdb/9.2.0/temp/VIS_js/adrun9i.sh APPS APPS
    /11i/app/oracle/visdb/9.2.0/appsutil/install/adlnkoh.sh: line 198: /11i/app/oracle/visdb/9.2.0/bin/sqlplus: No such file or directory
    RW-50010: Error: - script has returned an error: 1
    RW-50004: Error code received when running external process. Check log file for details.
    Running Database Install Driver for VIS instance
    Database Availability Check

    Do you have any suggesstion , what is wrong here ?

    Regards,
    Jagjeet Singh

    DB:3.21:Error In Installation Of 11i Apps 3k

    Glad to know that it helped .. You're welcome :)

  • RELEVANCY SCORE 3.08

    DB:3.08:Error Code 0x80072eff 1f


    I tried running 4 different scans found nothing!

    DB:3.08:Error Code 0x80072eff 1f


    See if this thread helps.
    http://social.answers.microsoft.com/Forums/en-US/vistawu/thread/2ad3699b-f9e7-4616-9b70-53068919a4af/#313bf258-8d0b-4476-a1a7-334dd4774e23
    http://social.answers.microsoft.com/Forums/en-US/vistawu/thread/a1746a2e-0213-4610-a45a-3304595a51c1

  • RELEVANCY SCORE 3.05

    DB:3.05:Error Message Coming 1m



    Hi,

    I' am getting the error message 'The personnel number is locked' 5A 198 when I use RH_INSERT_INFTY function module.

    I' am using the function to update P-S relation, so employee is already locked. I create 0001 infotype, then create

    P-S relation for the employee. In certain cases, 5A 198 error message is coming.

    Any idea why it is coming?

    Thanks,

    Aravind

    DB:3.05:Error Message Coming 1m


    Due to PA-PD integration issues, employee was getting locked once again.

    Thanks,

    Aravind

  • RELEVANCY SCORE 3.04

    DB:3.04:Fix For Error Code 4 When Installing? 9p



    I keep getting an error code 4 when installing an HP400. Help please?

    DB:3.04:Fix For Error Code 4 When Installing? 9p


    I keep getting an error code 4 when installing an HP400. Help please?

  • RELEVANCY SCORE 3.02

    DB:3.02:Microsoft Office 2010 Error 4604ee8-16d0fa0a-0000e01c xz


    Hi,
    I have a small problem with an AppV 4.6 package created for MS Office 2010. we have installed alsoOffice 2010 Deployment Kit for App-V with the proper license key.
    But when i try to open the package i have the following error:
    [ 10/12/2013 08:38:47:541 PMGR ERR ] { tid = 9FC }
    Package { 0750D234 - DE6F - 40CA - ************* } could not be loaded in the background ( return code 16D0FA0A - 0000E01C ) .

    [ 10/12/2013 08:39:23:198 TRAY ERR ] { tid = D74 : usr = ***** }
    Application Virtualization Client could not launch Microsoft Word 2010 14.0.4762.1000 .

    Unexpected error. Reports you . The following error code to your system administrator

    Error Code: 4604EE8 - 16D0FA0A - 0000E01C

    Does anyone has any idea about this?
    I have searched over internet and i cannot find any reference to this error code.

    DB:3.02:Microsoft Office 2010 Error 4604ee8-16d0fa0a-0000e01c xz

    Hello,
    See this guide;
    http://www.tmurgent.com/appvirt/FTL/Ftl.aspx
    The 0A (end of the second part of the error-code) relates to the Network Transport Agent, not really sure what the error code (third part of the error code) relates to.
    Nicke Källén | The Knack| Twitter:
    @Znackattack

  • RELEVANCY SCORE 3.02

    DB:3.02:Something Went Wrong Error Code 30175-4 f3


    Error code 30175-4 keeps coming up 50% into install

    DB:3.02:Something Went Wrong Error Code 30175-4 f3

    I get this message after trying to download the free one note download for all devices. Will the fix mentioned above work for this as well or is there a different remedy.

  • RELEVANCY SCORE 2.96

    DB:2.96:Serial Device Driver Doesn't Support Dtr Escape Code fk


    I am using CVI to program my serial com ports on a PCI 485/4
    card. I am using the ports as a 2-wire mode: DTR Controlled.
    However, when I used the ComSetEscape function. I received
    the following error message.

    NON-FATAL RUN-TIME ERROR: "serial.c", line 198, col
    14, thread id 0x00000660: Library function error (return
    value == -1 [0xffffffff]). The operation completed successfully.

    According to the explanation, this meant the following for my com ports.
    ComSetEscape returns Unknown System Error (-1) when
    the device driver does not support a particular escape code

    My question is, does the NI-PCI 485/4 card or the serial driver that I
    have, NI-Serial 1.8, support the DTR control feature? If I can,
    what's the proper way to set it up? Below is a part of my code.

    RS485Error = OpenComConfig (COMPORT3, DEVICENAME3, baudrate, parity,

    databits, stopbits, INPUTQ, OUTPUTQ);

    EnableBreakOnLibraryErrors ();
    if (RS485Error) DisplayRS485Error ();
    if (RS485Error == 0)
    {
    SetXMode (COMPORT3, XMODE);
    SetCTSMode (COMPORT3, LWRS_HWHANDSHAKE_CTS_RTS_DTR);
    SetComTime (COMPORT3, 1);
    }

    // Configure com ports for 2-wire mode communication.
    RS485Error = ComSetEscape (COMPORT3, WIRE_2_ECHO);
    if (RS485Error) DisplayRS485Error ();

    To transmit, I have the following code.
    ierror = ComSetEscape (COMPORT3, SETDTR);
    bytes_sent = ComWrt (COMPORT3, "abcdefg", stringsize);
    ierror = ComSetEscape (COMPORT3, CLRDTR);

    The error message I mentioned stops the program at the very first line above.
    ierror = ComSetEscape (COMPORT3, SETDTR);

    DB:2.96:Serial Device Driver Doesn't Support Dtr Escape Code fk

    Gary,

    I get the same error message when I try to run your code on my
    PCI-8431. I am in contact with RD about why we are getting
    the error and how to fix it. I will let you know as soon as I
    receive a response.

    However, I am hesitant to believe that you will see any improvement
    over using the auto mode. In fact, my guess would be that
    controlling the DTR line in software could potentially slow your
    application down. Each of the driver calls to change the DTR line
    would be controlled and timed by Windows instead of at the hardware
    level. You would be at the mercy of Windows—not an enviable position.

    You are correct that the differential transfer line is supposed to be pulled low when not transmitting.




    Robert MortensenSoftware EngineerNational Instruments

  • RELEVANCY SCORE 2.96

    DB:2.96:Error Code 30089-4 8m


    office 365 stopped working. gave error code above. no information available? any ideas?

    DB:2.96:Error Code 30089-4 8m

    Hello Callahan,

    I would suggest you to run the fixit available in the link below which would remove the Office traces automatically from the Computer.
    http://support.microsoft.com/kb/2739501

    Once done, try to re-install Office 365 and verify the status.

    If the issue still persists then you may follow the general troubleshooting steps provided in the article below for installation failures of Office 365 and check if that helps to resolve the issue:
    http://support.microsoft.com/kb/2822317

    For further queries, reply and we would be happy to assist.
    Thank you.

  • RELEVANCY SCORE 2.95

    DB:2.95:Error When Using Update Sql Command 3z



    Using DB Connectivity Toolkit, I am trying to execute the following SQL command:

    UPDATE ItemTable SET KGU? = 'True' WHERE ProductID = 'S1'

    I get this error: "Conn Execute.viERRIncorrect function. in Conn Execute.vi"

    Attached isa JPEG of the code.

    Any help would be greatly appreciated.

    Thanks,
    Scott










    Attachments:







    UpdateDBValues.jpg ‏198 KB

    DB:2.95:Error When Using Update Sql Command 3z

    No the field in the database was really KGU?. Adding the brackets [KGU?] appears not to "fix" the fact that there is a ? in the field name.

    Scott

  • RELEVANCY SCORE 2.95

    DB:2.95:Crm 7j



    when i logon and click on easy access menu

    i am geting the error

    saplsmtr_navigation_modules

    lsmtr_navigation_modules03

    line 198

    DB:2.95:Crm 7j


    Lakshmi,

    It looks to me that you have recently installed an IDES system and you are getting this message when you are in client 000. Try to check transaction SCC4 to see if you see client 800 and make the necessary settings. Also, you may want to go to SU01 and include CRM_Menu in the start menu of the default tab.

    Hope that helps.

    Bala

  • RELEVANCY SCORE 2.94

    DB:2.94:Cannot Deploy Entity Ejb (Session Ejb Ok) kp


    Hi all.
    I'm trying to deploy empty Entity EJB just generated by wizard and got:

    Generating EJBHome and EJBObject on the server...
    Compilation errors in oracle/aurora/ejb/gen/_test_acct_MyEntityEJB/EjbObject_MyEntityEJB:ORA-29535: source requires recompilation
    javax/ejb/FinderException: Authorization error for referenced class package1/MyentityejbViewPM.
    javax/ejb/FinderException: Authorization error for referenced class package1/MyentityejbViewPM.
    oracle/aurora/ejb/gen/_test_acct_MyEntityEJB/EjbObject_MyEntityEJB:198: Class package1.MyentityejbViewPM not found.
    oracle/aurora/ejb/gen/_test_acct_MyEntityEJB/EjbObject_MyEntityEJB:264: Class package1.MyentityejbViewPM not found.
    Info: 4 errors
    *** Errors occurred while deploying the EJB to 8i JVM ***

    Any ideas?
    Thanks in advance, Andriy

    DB:2.94:Cannot Deploy Entity Ejb (Session Ejb Ok) kp

    If you are using Oracle 8.1.7 on Solaris, please see the following post on OTN: http://technet.oracle.com/docs/products/jdev/workarounds/jdev32/ejb817.html

    -- Brian

  • RELEVANCY SCORE 2.93

    DB:2.93:Error Code 30088-4 zc


    I WAS INSTALLING OFFICE AND RECEIVED ERROR CODE 30088-4. CAN ANYONE HELP ME WORK THROUGH THIS?

    DB:2.93:Error Code 30088-4 zc


    I tried both of these solutions and neither worked :(

    Hi Sarah,

    I need more details to assist you with the issue:

    What is the complete error message?

    Try the steps below and check the result:
    Run the fix it mentioned in the link below to remove the traces of Office completely from the computer and then try to reinstall the Office program, check if it helps:
    http://support.microsoft.com/kb/2739501
    Note: Try to save the fix it tool to the desktop and then run it to remove Office.

    Let us know the result.
    Thank you.

  • RELEVANCY SCORE 2.93

    DB:2.93:Help! Failed To Open Browser... 9s


    Hello...

    How can I open NEW BROWSER WINDOW from my Applet?

    In my development time using JBuilder (JDK1.3.1),
    there was an error while I tried to compile the applet.
    My Applet Extends JApplet (SWING).

    My code:
    this.getAppletContext().showDocument("http://bla..bla..bla...");

    The error reported by JBuilder 4.0:
    "MainApplet.java": Error #: 300 : method showDocument(java.lang.String)
    not found in interface java.applet.AppletContext at line 198, column 20

    Anyone can HELP?

    Thank you.

    DB:2.93:Help! Failed To Open Browser... 9s

    you are passing a string to the showDocument() funtion where as the argument should be URL
    all you have to do is :

    showDodument(new URL("bla..bla"));

    all the best

    arun

  • RELEVANCY SCORE 2.91

    DB:2.91:Where Can I Download The Jbpm Form Builder (Standalone)? m1



    https://github.com/droolsjbpm/jbpm-form-builder/

    I saw a post that pointed to the above git repository as a way to download the form builder that will be used in jBPM 6. I notice that this component has been built in a stand alone fashion so I thought it would be easier to understand how it works by examining it in isolation. I download the code but when I tried to build it in Maven I got the errors listed below - among others:

    tyle (198 KB at 62.1 KB/sec)

    [ERROR] The build could not read 4 projects - [Help 1]

    [ERROR]

    [ERROR] The project org.jbpm:jbpm-gwt-form-api:5.4.0-SNAPSHOT (C:\Users\tmcclu

    re\Documents\dev\jbpm-form-builder-master\jbpm-gwt-form-api\pom.xml) has 1 error

    [ERROR] Non-resolvable parent POM: Could not find artifact org.jbpm:jbpm-for

    m-builder-parent:pom:5.4.0-SNAPSHOT and 'parent.relativePath' points at wrong lo

    cal POM @ line 4, column 11 - [Help 2]

    [ERROR]

    [ERROR] The project org.jbpm:jbpm-gwt-form-exporter-freemarker:5.4.0-SNAPSHOT

    I am thinking that this link is old and I should be using a new one - am I correct?

    Thanks

  • RELEVANCY SCORE 2.91

    DB:2.91:Plan Update Error d3


    Hi all,

    I am trying to update a plan in Design studio i am getting the following error

    IMessageSourceReceiver-messageReceive: javax.naming.NoInitialContextException: Cannot instantiate class: com.evermind.server.rmi.RMIInitialContectFactory. Root exception is java.lang.ClassNotFoundException: com.evermind.server.rmi.RMIInitialContectFactory
    at java.net.URLClassLoader$1.run(URLClassLoader.java:198)
    at java.security.AccessController.doPrivileged(Native Method)
    at java.net.URLClassLoader.findClass(URLClassLoader.java:186)
    at java.lang.ClassLoader.loadClass(ClassLoader.java:299)
    at sun.misc.Launcher$AppClassLoader.loadClass(Launcher.java:265)
    at java.lang.ClassLoader.loadClass(ClassLoader.java:255)
    at java.lang.ClassLoader.loadClassInternal(ClassLoader.java:315)
    at java.lang.Class.forName0(Native Method)
    at java.lang.Class.forName(Class.java:217)
    at com.sun.naming.internal.VersionHelper12.loadClass(VersionHelper12.java:42)
    at javax.naming.spi.NamingManager.getInitialContext(NamingManager.java:649)
    at javax.naming.InitialContext.getDefaultInitCtx(InitialContext.java:243)
    at javax.naming.InitialContext.init(InitialContext.java:219)
    at javax.naming.InitialContext.init(InitialContext.java:195)
    at iteration.enterpriselink.sources.JMSConsumer.start(JMSConsumer.java:70)
    at iteration.enterpriselink.sources.JMSMessageSourceReceiverImpl.jmsConsumerStart(JMSMessageSourceReceiverImpl.java:1001)
    at iteration.enterpriselink.sources.JMSMessageSourceReceiverImpl.messageReceive(JMSMessageSourceReceiverImpl.java:326)

    [Oracle BAM Enterprise Link error code: 0x75 -- 0x1, 0x75 -- 0x3A]

    Error during Message Receive operation.
    [Oracle BAM Enterprise Link error code: 0x75 -- 0x1, 0x75 -- 0x3B]

    Error while processing the data for the step 'Oracle BAM Enterprise Message Receiver'
    [Oracle BAM Enterprise Link error code: DC -- 0x1, DC -- 0x83]

    Error while processing the data for the step 'Oracle BAM Enterprise Message Receiver'
    [Oracle BAM Enterprise Link error code: DC -- 0x1, DC -- 0x83]

    IMessageSourceReceiver-messageReceive: javax.naming.NoInitialContextException: Cannot instantiate class: com.evermind.server.rmi.RMIInitialContectFactory. Root exception is java.lang.ClassNotFoundException: com.evermind.server.rmi.RMIInitialContectFactory
    at java.net.URLClassLoader$1.run(URLClassLoader.java:198)
    at java.security.AccessController.doPrivileged(Native Method)
    at java.net.URLClassLoader.findClass(URLClassLoader.java:186)
    at java.lang.ClassLoader.loadClass(ClassLoader.java:299)
    at sun.misc.Launcher$AppClassLoader.loadClass(Launcher.java:265)
    at java.lang.ClassLoader.loadClass(ClassLoader.java:255)
    at java.lang.ClassLoader.loadClassInternal(ClassLoader.java:315)
    at java.lang.Class.forName0(Native Method)
    at java.lang.Class.forName(Class.java:217)
    at com.sun.naming.internal.VersionHelper12.loadClass(VersionHelper12.java:42)
    at javax.naming.spi.NamingManager.getInitialContext(NamingManager.java:649)
    at javax.naming.InitialContext.getDefaultInitCtx(InitialContext.java:243)
    at javax.naming.InitialContext.init(InitialContext.java:219)
    at javax.naming.InitialContext.init(InitialContext.java:195)
    at iteration.enterpriselink.sources.JMSConsumer.start(JMSConsumer.java:70)
    at iteration.enterpriselink.sources.JMSMessageSourceReceiverImpl.jmsConsumerStart(JMSMessageSourceReceiverImpl.java:1001)
    at iteration.enterpriselink.sources.JMSMessageSourceReceiverImpl.messageReceive(JMSMessageSourceReceiverImpl.java:326)

    [Oracle BAM Enterprise Link error code: 0x75 -- 0x1, 0x75 -- 0x3A]

    Error during Message Receive operation.
    [Oracle BAM Enterprise Link error code: 0x75 -- 0x1, 0x75 -- 0x3B]

    Error while processing the data for the step 'Oracle BAM Enterprise Message Receiver'
    [Oracle BAM Enterprise Link error code: DC -- 0x1, DC -- 0x83]

    Update of Plan "BPELOrderBookingPlan" failed.
    [Oracle BAM Enterprise Link error code: PlanMgr -- 0x1, PlanMgr -- 0xD5]

    Regards
    Ashwini

    DB:2.91:Plan Update Error d3

    Hi,

    OC4J jar files are shipped with BAM and are by default installed in C:\oraclebam\oc4j. However if you choose a non default location for BAM install you have to update the classpath in BAM Administrator in Enterprise Message source types and restart BAM.

    Also see the section "4.5.1 Classpath for Message Queues" in install guide.

    Thanks

  • RELEVANCY SCORE 2.91

    DB:2.91:Error Code 98


    why am I getting the 30089-4 error code when I try to use my office ??

    DB:2.91:Error Code 98

    Warum bekomme ICH das. 30089-4 Fehlercode, WENN ICH Geschichtliche Versuche, mein Büro zu verwenden?

    Warum erscheint Fehler 30089-4 WENN ICH heute Geschichtliche Versuche MS-Outlook oder Word aufzurufen?23.03.2014

  • RELEVANCY SCORE 2.90

    DB:2.90:Error Code -214287038 18



    Error code -214287038 when trying to open captivate 4 project. What can I do?

    DB:2.90:Error Code -214287038 18


    Hello there,

    Yes, the possibility is the file is damaged. BTW, do you have the copy of original project in Captivate 4? If so, can you save it in different name and try to open it again? If that doesn't help, can you share the Cp file with me at viswanat@adobe.com? Will take a look.

    Thanks,

    Vish

  • RELEVANCY SCORE 2.90

    DB:2.90:How To Fix Error Code -4 For Airport Express Mark2 dc


    How to fix error code -4 for airport express mark 2

  • RELEVANCY SCORE 2.89

    DB:2.89:Error Code 12007-4 kx


    GET THIS ERROR

    DB:2.89:Error Code 12007-4 kx

    GET THIS ERROR
    bei instalierung von Office Home ist eine fehlercode 12007-4 ausgeblendet worden was soll ich tuhen?

  • RELEVANCY SCORE 2.89

    DB:2.89:Urgent:Classcircularityerror s9



    Hi All,We have written an application using JBoss- version 3.2.2RC3 with Axis 1.1 and Java version j2sdk1.4.1_02. We are running concurrent tests on this application and we are getting ClassCircularity error in different places in our code. For every run, we get this error in some different place. ( I have provided a trace for one of these instances).I have looked up the forum and understand that there was some bug in the way the class loaders were getting used in Java. (bug #4699981).Has this problem been fixed in Java or a workaround has been introduced in JBoss?This error is posing very serious problem for us, as it prevents the application to run beyond this point.Any help will be highly appreciated.thanks-----------------------Here is the exception:14:15:52,466 ERROR [STDERR] java.lang.ClassCircularityError: boolean_Helper14:15:52,466 ERROR [STDERR] at java.lang.Class.forName0(Native Method)14:15:52,486 ERROR [STDERR] at java.lang.Class.forName(Class.java:219)14:15:52,486 ERROR [STDERR] at org.apache.axis.utils.ClassUtils$2.run(ClassUtils.java:193)14:15:52,486 ERROR [STDERR] at java.security.AccessController.doPrivileged(Native Method)14:15:52,486 ERROR [STDERR] at org.apache.axis.utils.ClassUtils.loadClass(ClassUtils.java:171)14:15:52,486 ERROR [STDERR] at org.apache.axis.utils.ClassUtils.forName(ClassUtils.java:112)14:15:52,486 ERROR [STDERR] at org.apache.axis.encoding.ser.BaseFactory.getMethod(BaseFactory.java:107)14:15:52,506 ERROR [STDERR] at org.apache.axis.encoding.ser.BaseDeserializerFactory.getGetDeserializer(BaseDeserializerFactory.java:264)14:15:52,506 ERROR [STDERR] at org.apache.axis.encoding.ser.BaseDeserializerFactory.getSpecialized(BaseDeserializerFactory.java:173)14:15:52,506 ERROR [STDERR] at org.apache.axis.encoding.ser.BaseDeserializerFactory.getDeserializerAs(BaseDeserializerFactory.java:117)14:15:52,506 ERROR [STDERR] at org.apache.axis.encoding.ser.SimpleDeserializerFactory.getDeserializerAs(SimpleDeserializerFactory.java:107)14:15:52,506 ERROR [STDERR] at org.apache.axis.encoding.DeserializationContextImpl.getDeserializer(DeserializationContextImpl.java:466)14:15:52,536 ERROR [STDERR] at org.apache.axis.encoding.DeserializationContextImpl.getDeserializerForType(DeserializationContextImpl.java:481)14:15:52,536 ERROR [STDERR] at org.apache.axis.encoding.ser.BeanDeserializer.getDeserializer(BeanDeserializer.java:458)14:15:52,536 ERROR [STDERR] at org.apache.axis.encoding.ser.BeanDeserializer.onStartChild(BeanDeserializer.java:278)14:15:52,536 ERROR [STDERR] at org.apache.axis.encoding.DeserializationContextImpl.startElement(DeserializationContextImpl.java:963)14:15:52,536 ERROR [STDERR] at org.apache.axis.message.SAX2EventRecorder.replay(SAX2EventRecorder.java:198)14:15:52,536 ERROR [STDERR] at org.apache.axis.message.MessageElement.publishToHandler(MessageElement.java:722)14:15:52,546 ERROR [STDERR] at org.apache.axis.encoding.DeserializerImpl.startElement(DeserializerImpl.java:404)14:15:52,546 ERROR [STDERR] at org.apache.axis.encoding.ser.BeanDeserializer.startElement(BeanDeserializer.java:165)14:15:52,546 ERROR [STDERR] at org.apache.axis.encoding.DeserializationContextImpl.startElement(DeserializationContextImpl.java:976)14:15:52,546 ERROR [STDERR] at org.apache.axis.message.SAX2EventRecorder.replay(SAX2EventRecorder.java:198)14:15:52,546 ERROR [STDERR] at org.apache.axis.message.MessageElement.publishToHandler(MessageElement.java:722)14:15:52,546 ERROR [STDERR] at org.apache.axis.message.RPCElement.deserialize(RPCElement.java:323)14:15:52,576 ERROR [STDERR] at org.apache.axis.message.RPCElement.getParams(RPCElement.java:347)14:15:52,576 ERROR [STDERR] at org.apache.axis.client.Call.invoke(Call.java:2272)14:15:52,576 ERROR [STDERR] at org.apache.axis.client.Call.invoke(Call.java:2171)14:15:52,576 ERROR [STDERR] at org.apache.axis.client.Call.invoke(Call.java:2196)14:15:52,576 ERROR [STDERR] at com.uniteller.switchcore.isc.impl.Communicator.execute(Communicator.java:255)14:15:52,576 ERROR [STDERR] at com.uniteller.switchcore.isc.impl.Communicator.run(Communicator.java:93)14:15:52,596 ERROR [STDERR] at java.lang.Thread.run(Thread.java:534)

    DB:2.89:Urgent:Classcircularityerror s9


    I am also getting the same error in 3.2.5 and 3.2.8 with JDK 1.4.2_05.

  • RELEVANCY SCORE 2.89

    DB:2.89:Issue With Loading Of Meta Data To Essbase Cube fm


    Hi All ,I am working on the 2.3 version of Hyperion and working on to generate an FSG cube through Essbase Studio accessing the Oracle tables.In a Oracle table there are columns from Hier1_Code to Hier10_Code which will be used as metadata to construct the Account Hierarchy. These 1 to 10 code fields have duplicate code names at different levels for example a code 790 is present in Hier3_Code and also in Hier6_Code at different levels. When are restricted to built BSO cube, as it gave us many meta data record rejection due to duplicates and so, we have tried to allow duplicates when building the Hierarchy. At this point we got the rejection of meta data to 6 errors which are pasted below for reference (Here we have tried to build the meta data only and not data). When cross checked with the error data in the fact table, these records are existing in proper step manner as required. Surprising thing is that the (2) and (3) errors are same which point to different record number. same way for (5) and (6).We are struggling hard to achieve this and could any one through some light on this. Thanks a lot in advance.(1) \\Record #465 - (3345) Error setting ID (#~@12#0#198#0@#~@3#0#393#0@#~610) to member (610) 1070 1070 1050 1050 790 790 620 620 610 610 21310 21310(2) \\Record #352 - (3345) Error setting ID (#~@12#0#198#0@#~@3#0#393#0@#~650) to member (650) 1070 1070 1050 1050 790 790 660 660 650 650 22050 22050(3) \\Record #1026 - (3345) Error setting ID (#~@12#0#198#0@#~@3#0#393#0@#~650) to member (650) 1070 1070 1050 1050 790 790 660 660 650 650 22020 22020(4) \\Record #164 - (3345) Error setting ID (#~@12#0#198#0@#~@3#0#390#0@#~680) to member (680) 1070 1070 1050 1050 790 790 680 680 670 670 22510 22510(5) \\Record #602 - (3345) Error setting ID (#~@12#0#198#0@#~@3#0#393#0@#~570) to member (570) 1400 1400 1007 1007 1002 1002 680 680 570 570 565 565 41050 41050(6) \\Record #869 - (3345) Error setting ID (#~@12#0#198#0@#~@3#0#393#0@#~570) to member (570) 1400 1400 1007 1007 1002 1002 680 680 570 570 565 565 41040 41040

    DB:2.89:Issue With Loading Of Meta Data To Essbase Cube fm

    Hi All ,I am working on the 2.3 version of Hyperion and working on to generate an FSG cube through Essbase Studio accessing the Oracle tables.In a Oracle table there are columns from Hier1_Code to Hier10_Code which will be used as metadata to construct the Account Hierarchy. These 1 to 10 code fields have duplicate code names at different levels for example a code 790 is present in Hier3_Code and also in Hier6_Code at different levels. When are restricted to built BSO cube, as it gave us many meta data record rejection due to duplicates and so, we have tried to allow duplicates when building the Hierarchy. At this point we got the rejection of meta data to 6 errors which are pasted below for reference (Here we have tried to build the meta data only and not data). When cross checked with the error data in the fact table, these records are existing in proper step manner as required. Surprising thing is that the (2) and (3) errors are same which point to different record number. same way for (5) and (6).We are struggling hard to achieve this and could any one through some light on this. Thanks a lot in advance.(1) \\Record #465 - (3345) Error setting ID (#~@12#0#198#0@#~@3#0#393#0@#~610) to member (610) 1070 1070 1050 1050 790 790 620 620 610 610 21310 21310(2) \\Record #352 - (3345) Error setting ID (#~@12#0#198#0@#~@3#0#393#0@#~650) to member (650) 1070 1070 1050 1050 790 790 660 660 650 650 22050 22050(3) \\Record #1026 - (3345) Error setting ID (#~@12#0#198#0@#~@3#0#393#0@#~650) to member (650) 1070 1070 1050 1050 790 790 660 660 650 650 22020 22020(4) \\Record #164 - (3345) Error setting ID (#~@12#0#198#0@#~@3#0#390#0@#~680) to member (680) 1070 1070 1050 1050 790 790 680 680 670 670 22510 22510(5) \\Record #602 - (3345) Error setting ID (#~@12#0#198#0@#~@3#0#393#0@#~570) to member (570) 1400 1400 1007 1007 1002 1002 680 680 570 570 565 565 41050 41050(6) \\Record #869 - (3345) Error setting ID (#~@12#0#198#0@#~@3#0#393#0@#~570) to member (570) 1400 1400 1007 1007 1002 1002 680 680 570 570 565 565 41040 41040

  • RELEVANCY SCORE 2.89

    DB:2.89:11.2.0.1 Standby - No Messages When Primary Is Disconnected pj


    For a test the DBA pulls the network cable between the primary and standby.
    The primary times out per the net_timeout = 30 setting, but the standby doesnt have a message for 90 minutes.
    They are not using Broker.

    The standby is waiting for the sequence 197 in transit. How long should the standby wait before missing the primary?

    Cable is pulled just before 9:32

    Primary alert log:
    ==============
    Wed Jan 25 09:32:08 2012
    ORA-16198: LGWR received timedout error from KSR
    LGWR: Attempting destination LOG_ARCHIVE_DEST_2 network reconnect (16198)
    LGWR: Destination LOG_ARCHIVE_DEST_2 network reconnect abandoned
    Error 16198 for archive log file 3 to 'ora10g_DGb'
    Destination LOG_ARCHIVE_DEST_2 is UNSYNCHRONIZED
    LGWR: Failed to archive log 3 thread 1 sequence 197 (16198)
    Thread 1 advanced to log sequence 198 (LGWR switch)
    Current log# 4 seq# 198 mem# 0: /dev/rora10g_rdo04a
    Current log# 4 seq# 198 mem# 1: /dev/rora10g_rdo04b
    Current log# 4 seq# 198 mem# 2: /dev/rora10g_rdo04c
    Wed Jan 25 09:32:13 2012
    ...
    then it starts getting ORA-12170 which shows it has disconnected from the standby at
    Wed Jan 25 09:40:14 2012

    The standby shows nothing until 11:07
    ==========================================

    Tue Jan 24 14:55:19 2012
    Media Recovery Log /ora04/oradata/ora10g/arch/ora10g764430595_1_196.arc
    Media Recovery Waiting for thread 1 sequence 197 (in transit)
    Wed Jan 25 11:07:40 2012

    ***********************************************************************

    Fatal NI connect error 12170.

    VERSION INFORMATION:
    TNS for IBM/AIX RISC System/6000: Version 11.2.0.2.0 - Production
    TCP/IP NT Protocol Adapter for IBM/AIX RISC System/6000: Version 11.2.0.2.0 - Production
    Oracle Bequeath NT Protocol Adapter for IBM/AIX RISC System/6000: Version 11.2.0.2.0 - Production
    Time: 25-JAN-2012 11:07:40
    Tracing not turned on.
    Tns error struct:
    ns main err code: 12535

    Thanks, Chris

  • RELEVANCY SCORE 2.88

    DB:2.88:Error After Deploying A Workflow In Sharepoint 2007 Site. cx


    Hi,
     
    I have a custom workflow in my Sharepoint 2007 site. I tried to deploy the dll for this in the GAC using a batch file. I have done this before but this time I got a fatal error which is reflected across the whole site collection.
     
    I reverted all the changes to the workflow and redeployed it, I even tried deactivating it but to no luck.
     
    Any help would be appreciated.
     
    Thank you!!
     
     
    Server Error in '/' Application.

    Bad implementation flags.
    Description: An unhandled exception occurred during the execution of the current web request. Please review the stack trace for more information about the error and where it originated in the code. Exception Details: System.TypeLoadException: Bad implementation flags.Source Error:

    An unhandled exception was generated during the execution of the current web request. Information regarding the origin and location of the exception can be identified using the exception stack trace below. Stack Trace:

    [TypeLoadException: Bad implementation flags.]
    Microsoft.SharePoint.WebPartPages.SPWebPartManager.CreatePersonalization() +0
    System.Web.UI.WebControls.WebParts.WebPartManager.OnInit(EventArgs e) +468
    Microsoft.SharePoint.WebPartPages.SPWebPartManager.OnInit(EventArgs e) +365
    System.Web.UI.Control.InitRecursive(Control namingContainer) +321
    System.Web.UI.Control.InitRecursive(Control namingContainer) +198
    System.Web.UI.Control.InitRecursive(Control namingContainer) +198
    System.Web.UI.Control.InitRecursive(Control namingContainer) +198
    System.Web.UI.Control.InitRecursive(Control namingContainer) +198
    System.Web.UI.Page.ProcessRequestMain(Boolean includeStagesBeforeAsyncPoint, Boolean includeStagesAfterAsyncPoint) +834

    DB:2.88:Error After Deploying A Workflow In Sharepoint 2007 Site. cx

     
    Hello,
     
    I pressumed that this error arose because of my workflow deployment. But it was a different issue.
     
    It was because someone had tempered with the site's application pool. It was changed and was using a wrong app pool and due to which I got this error which was co-incidental to the time of my deployment of the workflow. 
     
    Check the app pool in case of the above error.
     
    Piyush.
     

  • RELEVANCY SCORE 2.87

    DB:2.87:Connection Error 93


    Hi,
    I tried creating an infobus in JDeveloper 2.0
    I am getting the following error :
    Connection refused(DESCRIPTION=(TMP=)(VSNNUM=135286784)(ERR=12500)(ERROR_STACK=(ERROR=(CODE=12500)(EMFI=4))(ERROR=(CODE=12560)(EMFI=4))(ERROR=(CODE=530)(EMFI=4))(ERROR=(BUF='32-bit Windows Error: 109: Unknown error'))))

    The Database is Oracle8i. Can anyone help me out ?

    Thanks,
    Sandeep

    DB:2.87:Connection Error 93

    Hi,
    I tried creating an infobus in JDeveloper 2.0
    I am getting the following error :
    Connection refused(DESCRIPTION=(TMP=)(VSNNUM=135286784)(ERR=12500)(ERROR_STACK=(ERROR=(CODE=12500)(EMFI=4))(ERROR=(CODE=12560)(EMFI=4))(ERROR=(CODE=530)(EMFI=4))(ERROR=(BUF='32-bit Windows Error: 109: Unknown error'))))

    The Database is Oracle8i. Can anyone help me out ?

    Thanks,
    Sandeep

  • RELEVANCY SCORE 2.87

    DB:2.87:Ignoring Bad Bytes In Text Strings z3


    I created simple ASMX web service which returns entity list:
    [WebMethod]
    public
    Listobject[] GetData(.... ) { ...
    Its call causes exception in SL application in generated code at line
    AWSilverlightLOB.StockServiceReference.GetDataResponse _result = ((AWSilverlightLOB.StockServiceReference.GetDataResponse)(base.EndInvoke(GetData,
    _args, result)));
    Probably data contains 0x02 code.
    How to fix this so that 0x02 and other similar bytes in strings does not cause exception?

    Andrus.
    System.ServiceModel.CommunicationException was unhandled by user code
    Message=Error in deserializing body of reply message for operation 'GetData'.
    StackTrace:
    at System.ServiceModel.Dispatcher.XmlSerializerOperationFormatter.DeserializeBody(XmlDictionaryReader reader, MessageVersion version, XmlSerializer serializer, MessagePartDescription returnPart, MessagePartDescriptionCollection bodyParts, Object[] parameters,
    Boolean isRequest)
    at System.ServiceModel.Dispatcher.XmlSerializerOperationFormatter.DeserializeBody(XmlDictionaryReader reader, MessageVersion version, String action, MessageDescription messageDescription, Object[] parameters, Boolean isRequest)
    at System.ServiceModel.Dispatcher.OperationFormatter.DeserializeBodyContents(Message message, Object[] parameters, Boolean isRequest)
    at System.ServiceModel.Dispatcher.OperationFormatter.DeserializeReply(Message message, Object[] parameters)
    at System.ServiceModel.Dispatcher.ProxyOperationRuntime.AfterReply(ProxyRpc rpc)
    at System.ServiceModel.Channels.ServiceChannel.HandleReply(ProxyOperationRuntime operation, ProxyRpc rpc)
    at System.ServiceModel.Channels.ServiceChannel.EndCall(String action, Object[] outs, IAsyncResult result)
    at System.ServiceModel.ClientBase`1.ChannelBase`1.EndInvoke(String methodName, Object[] args, IAsyncResult result)
    at AWSilverlightLOB.StockServiceReference.StockServiceSoapClient.StockServiceSoapClientChannel.EndGetData(IAsyncResult result)
    at AWSilverlightLOB.StockServiceReference.StockServiceSoapClient.AWSilverlightLOB.StockServiceReference.StockServiceSoap.EndGetData(IAsyncResult result)
    at AWSilverlightLOB.StockServiceReference.StockServiceSoapClient.EndGetData(IAsyncResult result, UserCredentials header, FormDefinition definition)
    at AWSilverlightLOB.StockServiceReference.StockServiceSoapClient.OnEndGetData(IAsyncResult result)
    at System.ServiceModel.ClientBase`1.OnAsyncCallCompleted(IAsyncResult result)
    InnerException: System.InvalidOperationException
    Message=There is an error in XML document (4, 198).
    StackTrace:
    at System.Xml.Serialization.XmlSerializer.Deserialize(XmlReader xmlReader, String encodingStyle, Object events)
    at System.Xml.Serialization.XmlSerializer.Deserialize(XmlReader xmlReader, String encodingStyle)
    at System.ServiceModel.Dispatcher.XmlSerializerOperationFormatter.DeserializeBody(XmlDictionaryReader reader, MessageVersion version, XmlSerializer serializer, MessagePartDescription returnPart, MessagePartDescriptionCollection bodyParts, Object[]
    parameters, Boolean isRequest)
    InnerException: System.Xml.XmlException
    Message='', hexadecimal value 0x02, is an invalid character. Line 4, position 198.
    LineNumber=4
    LinePosition=198
    SourceUri=
    StackTrace:
    at System.Xml.XmlTextReaderImpl.Throw(Exception e)
    at System.Xml.XmlTextReaderImpl.Throw(String res, String[] args)
    at System.Xml.XmlTextReaderImpl.Throw(Int32 pos, String res, String[] args)
    at System.Xml.XmlTextReaderImpl.ThrowInvalidChar(Int32 pos, Char invChar)
    at System.Xml.XmlTextReaderImpl.ParseNumericCharRefInline(Int32 startPos, Boolean expand, BufferBuilder internalSubsetBuilder, Int32 charCount, EntityType entityType)
    at System.Xml.XmlTextReaderImpl.ParseCharRefInline(Int32 startPos, Int32 charCount, EntityType entityType)
    at System.Xml.XmlTextReaderImpl.ParseText(Int32 startPos, Int32 endPos, Int32 outOrChars)
    at System.Xml.XmlTextReaderImpl.ParseText()
    at System.Xml.XmlTextReaderImpl.ParseElementContent()
    at System.Xml.XmlTextReaderImpl.Read()
    at System.Xml.XmlDictionaryReader.XmlWrappedReader.Read()
    at System.Xml.XmlReader.ReadStartElement()
    at System.Xml.Serialization.XmlSerializationReader.ReadStringValue()
    at System.Xml.Serialization.XmlSerializationReader.ReadTypedPrimitive(XmlQualifiedName type, Boolean elementCanBeType)
    at System.Xml.Serialization.XmlSerializationReader.ReadTypedPrimitive(XmlQualifiedName type)
    at Microsoft.Xml.Serialization.GeneratedAssembly.XmlSerializationReaderStockServiceSoap.Read1_Object(Boolean isNullable, Boolean checkType)
    at Microsoft.Xml.Serialization.GeneratedAssembly.XmlSerializationReaderStockServiceSoap.Read142_GetDataResponse()
    at Microsoft.Xml.Serialization.GeneratedAssembly.ArrayOfObjectSerializer7.Deserialize(XmlSerializationReader reader)
    at System.Xml.Serialization.XmlSerializer.Deserialize(XmlReader xmlReader, String encodingStyle, Object events)
    InnerException:

    DB:2.87:Ignoring Bad Bytes In Text Strings z3

    Interesting, try to use
    string encodedString= Server.HtmlEncode(Your text data);
    to your text data.

  • RELEVANCY SCORE 2.87

    DB:2.87:Sas 9.1.3 Hash Where Option Problem sz



    Hello Everybody!

    The SAS code in the below or attachment will cause error in SAS 9.1.3 but it won't cause error at SAS 9.2.Is there anybody have ever met the same kind problem before? Is there any solution?

    Thanks a lot!

    George

    data Base;

    input id $ amount;

    datalines;

    a 189

    b 160

    b 188

    b 165

    a 145

    a 199

    b 198

    b 345

    c 298

    c 165

    d 235

    d 678

    e 161

    e 285

    f 278

    ;

    data Name;

    input id $ name $ n;

    datalines;

    a Jose 1

    b Hose 2

    c Jerry 3

    d Sara 4

    e Tom 5

    ;

    data test6(drop=rc);

    if 0 then set name;

    if _n_ = 1 then do;

    dcl hash h(dataset: 'name (where=(n 3))');

    h.definekey("id");

    h.definedata("id","name",'n');

    h.definedone();

    end;

    do until(eof);

    set base end=eof;

    name='';

    rc=h.find();

    output;

    end;

    run;

    DB:2.87:Sas 9.1.3 Hash Where Option Problem sz


    Not I am aware of. It is not a bug, it is just not supported. If you are keen on hash, you have to upgrade, the difference is day and night, before 9.2, I don't even bother with hash.

  • RELEVANCY SCORE 2.86

    DB:2.86:Error Code 30029-4 c7


    What doesError Code: 30029-4 mean and what do I do about it?

    DB:2.86:Error Code 30029-4 c7


    I have slightly different issue; my new Sony Vaio laptop came with Office 2013 Windows 8 already loaded. Worked fine until TODAY. Now all Office functions are DEACTIVATED. WHAT'S GOING ON???

    Hi Dawes,

    Generally pre-installed versions of Office that comes on a new computer, would be a trial version of Office 365/2013. You may check if Office is activated by going to File and then Account.

    Also since Office came pre-installed on the computer, to check if you had a valid installation of Office, you would have tocontact the computer manufacturer and see what they have to suggest.

    I hope the above information helps. If you need further assistance, you may reply and I’ll be happy to assist you.

    Thank you

  • RELEVANCY SCORE 2.84

    DB:2.84:Compilation Problem pc


    Hi
    i am running this program and i get the error during euntime

    import java.util.*;

    class settest{
    public static void main(String args[]){
    boolean[] ba = new boolean[5];
    Set s = new TreeSet();
    ba[0] = s.add("a");
    ba[1] = s.add("b");
    ba[2] = s.add("c");
    ba[3] = s.add("d");
    ba[4] = s.add(new Object());
    for( int x=0; xba.length; x++)
    System.out.println(ba[x] + "");
    System.out.println("\n");

    }
    }

    error ---- C:\jdk1.5.0_03\bin\Chapter6java settest
    Exception in thread "main" java.lang.ClassCastException: java.lang.Object
    at java.util.TreeMap.compare(TreeMap.java:1047)
    at java.util.TreeMap.put(TreeMap.java:449)
    at java.util.TreeSet.add(TreeSet.java:198)
    at settest.main(settest.java:11)

    what is the error message mean

    Regards
    Atul

    DB:2.84:Compilation Problem pc

    Read the Javadoc of TreeSet: [http://java.sun.com/javase/6/docs/api/java/util/TreeSet.html]. Escpecially the no-arg constructor part.

  • RELEVANCY SCORE 2.84

    DB:2.84:Error Code30088-4 3a


    HELP WITH ERROR CODE 30088-4 PLEASE .

    DB:2.84:Error Code30088-4 3a

    Hi John,

    that's correct.
    After uninstall I can reinstall Office without any problem, but only the english version.
    And my english is not as good as it used to be to use it as the default language setting for office.

    I'm looking for a possibility to install a german version with my existing key.

    That's my major problem.

    Regards

    Joerg

  • RELEVANCY SCORE 2.83

    DB:2.83:My Iphone 4 Has Error Code 40 xa


    My iphone 4 has error code 40, tried to restore it in itunes but it was error failed. Need help anyone?

    DB:2.83:My Iphone 4 Has Error Code 40 xa

    Then contact Apple Support, as the article directs.

  • RELEVANCY SCORE 2.83

    DB:2.83:Autorefresh Error Missing Session da


    Hello,
    a report fell into error this night. I think the session in ReportServerTempdb Db has been deleted.
    The report is a monitoring report with an autorefresh property set to 30s. We first deploy it yesterday and the error came at least 4 hours after the first rendering...
    here the log :
    webserver!ReportServer_0-198!2be4!03/22/2013-04:21:14:: i INFO: Processed report. Report='/Helpdesk Dashboard/HelpDesk_002_Ticket_Monthly', Stream=''
    library!ReportServer_0-198!33b4!03/22/2013-04:21:44:: i INFO: Call to GetPermissionsAction(/Helpdesk Dashboard/HelpDesk_002_Ticket_Monthly).
    library!ReportServer_0-198!ab0!03/22/2013-04:21:44:: i INFO: Call to GetSystemPropertiesAction().
    library!ReportServer_0-198!ab0!03/22/2013-04:21:44:: i INFO: Call to GetPropertiesAction(/Helpdesk Dashboard/HelpDesk_002_Ticket_Monthly, PathBased).
    library!ReportServer_0-198!33b4!03/22/2013-04:21:44:: i INFO: Call to GetSystemPermissionsAction().
    library!ReportServer_0-198!33b4!03/22/2013-04:21:45:: i INFO: Call to GetSystemPropertiesAction().
    library!ReportServer_0-198!ab0!03/22/2013-04:21:45:: e ERROR: Throwing Microsoft.ReportingServices.Diagnostics.Utilities.ReportServerStorageException: , Une erreur s'est produite dans la base de données du serveur de rapports. Cela peut être dû à un échec de
    connexion, un délai d'attente ou une insuffisance de l'espace disque au sein de la base de données.;
    session!ReportServer_0-198!ab0!03/22/2013-04:21:45:: e ERROR: Error in getting session data: Session vwifrh55nzzw1w55n5txzwye does not belong to AD\svcssrs
    session!ReportServer_0-198!ab0!03/22/2013-04:21:45:: i INFO: LoadSnapshot: Item with session: vwifrh55nzzw1w55n5txzwye, reportPath: /Helpdesk Dashboard/HelpDesk_002_Ticket_Monthly, userName: AD\svcssrs not found in the database
    library!ReportServer_0-198!ab0!03/22/2013-04:21:45:: e ERROR: Throwing Microsoft.ReportingServices.Diagnostics.Utilities.ExecutionNotFoundException: , Microsoft.ReportingServices.Diagnostics.Utilities.ExecutionNotFoundException: L'exécution de rapport 'vwifrh55nzzw1w55n5txzwye'
    a expiré ou est introuvable.;
    webserver!ReportServer_0-198!ab0!03/22/2013-04:21:45:: e ERROR: Reporting Services error Microsoft.ReportingServices.Diagnostics.Utilities.ExecutionNotFoundException: L'exécution de rapport 'vwifrh55nzzw1w55n5txzwye' a expiré ou est introuvable.
    at Microsoft.ReportingServices.Library.SessionfulClientRequest.InitForRequest(CatalogItemContext context, UserContext userCtx)
    at Microsoft.ReportingServices.WebServer.ReportServiceHttpHandler.RenderReport(SessionfulClientRequest sessionManager)
    at Microsoft.ReportingServices.Library.StreamRequestHandler.PerformStreamedOperation(StreamedOperation operation)
    at Microsoft.ReportingServices.Library.StreamRequestHandler.RenderItem(ItemType itemType)
    at Microsoft.ReportingServices.Library.StreamRequestHandler.ExecuteCommand()
    at Microsoft.ReportingServices.WebServer.ReportServiceHttpHandler.RenderPage()

    Thanks for any help :-)
    Stéphane

    DB:2.83:Autorefresh Error Missing Session da

    Hi Stéphane,
    Have you got the issue resolved? If so, please mark the answer if it helps. If not, please feel free to let me know so thatI can make further analysis.
    Regards,
    Mike Yin
    If you have any feedback on our support, please click
    hereMike Yin
    TechNet Community Support

  • RELEVANCY SCORE 2.83

    DB:2.83:Fpga Compile Error: Xflow 198, 11, 38 sx


    Under LV 8.5, when I compile my FPGA VI, sometimes it works and sometimes not. It might fail the first time, but work the second or third time with no changes to the VI. When it fails, I get the following text in the Compilation Failure dialog box.

    Release 9.1.03i Xflow J.33Copyright (c) 1995-2007 Xilinx, Inc. All rights reserved.xflow.exe -p xc2v3000-4-fg676 -synth vhdl_area.opt -implement balanced.opt-config bitgen.opt C:\NIFPGA85\srvrTmp\LOCALH~1\CRIOPR~1\toplevel_gen​.prj ERROR:Xflow:198 - Design C:/NIFPGA85/srvrTmp/LOCALH~1/CRIOPR~1/toplevel_gen​.prj doesn't exist, or design extension is not valid.ERROR:Xflow:11 - 1 error(s) found while processing cmdline arguments.Aborting flow .... ERROR:Xflow:38 - Command Line errors... Aborting!
    I'm working off a network, and keep my project on a server, if that makes any difference.

    -Ron

    DB:2.83:Fpga Compile Error: Xflow 198, 11, 38 sx

    Hi Ron,

    Thanks for the information. I will add it to the report for RD.




    Donovan

  • RELEVANCY SCORE 2.83

    DB:2.83:Internal Error 0_381 ?? 3m



    (0): internal error: 0_381

    compilation aborted for x1.cpp (code 4)

    Has anyone encountered this error
    What does it mean?

    DB:2.83:Internal Error 0_381 ?? 3m


    I've got an example that triggers it, in a nutshell perform the same assignment twice but differently:

    [c]

    #include stdio.h

    #include string.h

    struct test_s {

    int foo;

    };

    static void

    copy_using_memcpy(struct test_s *pto, struct test_s *pfrom)

    {

    memcpy(pto, pfrom, sizeof(struct test_s));

    return;

    }

    static void

    copy_using_deref(struct test_s *pto, struct test_s *pfrom)

    {

    *pto = *pfrom;

    return;

    }

    int

    main(int argc, char *argv[])

    {

    struct test_s a = {1};

    struct test_s b = {0};

    /* do the same assignment twice */

    copy_using_deref(b, a);

    copy_using_memcpy(b, a);

    /* prevent being optimised away */

    return b.foo == a.foo;

    }

    [/c]

  • RELEVANCY SCORE 2.83

    DB:2.83:Issue With The Report Oracle.Apps.Xdo.Xdoexception:Error Creating Lock File ad


    I am getting an error while submitting the XML publisher report in Betsy N0 instance.
    Issue

    Log :- Beginning post-processing of request 145458120 on node BETSYN0DB1 at 22-DEC-2011 05:28:26.
    Post-processing of request 145458120 failed at 22-DEC-2011 05:28:28 with the error message: One or more post-processing actions failed. Consult the OPP service log for details
    Output :- Blank Report
    XML file :- XML file generated without any error
    Output process:-

    [12/23/11 4:28:10 AM] [1213640:RT145480622] Completed post-processing actions for request 145480622.
    [12/23/11 5:16:01 AM] [OPPServiceThread1] Post-processing request 145481427.
    [12/23/11 5:49:30 AM] [OPPServiceThread1] Post-processing request 145481923.
    [12/23/11 5:49:30 AM] [1213640:RT145481923] Executing post-processing actions for request 145481923.
    [12/23/11 5:49:30 AM] [1213640:RT145481923] Starting XML Publisher post-processing action.
    [12/23/11 5:49:30 AM] [1213640:RT145481923]
    Template code: XXWIP_WO_VLVS
    Template app: XXWIP
    Language: en
    Territory: US
    Output type: PDF
    oracle.apps.xdo.XDOException: Error creating lock file
    at oracle.apps.xdo.oa.util.FontCacheManager.getFontFromDB(FontCacheManager.java:320)
    at oracle.apps.xdo.oa.util.FontCacheManager.getFontFilePath(FontCacheManager.java:198)
    at oracle.apps.xdo.oa.util.FontHelper.createFontProperties(FontHelper.java:432)
    at oracle.apps.xdo.oa.util.ConfigHelper.getFontProperties(ConfigHelper.java:166)
    at oracle.apps.xdo.oa.schema.server.TemplateHelper.runProcessTemplate(TemplateHelper.java:5824)
    at oracle.apps.xdo.oa.schema.server.TemplateHelper.processTemplate(TemplateHelper.java:3459)
    at oracle.apps.xdo.oa.schema.server.TemplateHelper.processTemplate(TemplateHelper.java:3548)
    at oracle.apps.fnd.cp.opp.XMLPublisherProcessor.process(XMLPublisherProcessor.java:247)
    at oracle.apps.fnd.cp.opp.OPPRequestThread.run(OPPRequestThread.java:157)
    [12/23/11 5:49:31 AM] [UNEXPECTED] [1213640:RT145481923] oracle.apps.xdo.XDOException: Error creating lock file
    at oracle.apps.xdo.oa.util.FontCacheManager.getFontFromDB(FontCacheManager.java:320)
    at oracle.apps.xdo.oa.util.FontCacheManager.getFontFilePath(FontCacheManager.java:198)
    at oracle.apps.xdo.oa.util.FontHelper.createFontProperties(FontHelper.java:432)
    at oracle.apps.xdo.oa.util.ConfigHelper.getFontProperties(ConfigHelper.java:166)
    at oracle.apps.xdo.oa.schema.server.TemplateHelper.runProcessTemplate(TemplateHelper.java:5824)
    at oracle.apps.xdo.oa.schema.server.TemplateHelper.processTemplate(TemplateHelper.java:3459)
    at oracle.apps.xdo.oa.schema.server.TemplateHelper.processTemplate(TemplateHelper.java:3548)
    at oracle.apps.fnd.cp.opp.XMLPublisherProcessor.process(XMLPublisherProcessor.java:247)
    at oracle.apps.fnd.cp.opp.OPPRequestThread.run(OPPRequestThread.java:157)

    [12/23/11 5:49:31 AM] [1213640:RT145481923] Completed post-processing actions for request 145481923.

    DB:2.83:Issue With The Report Oracle.Apps.Xdo.Xdoexception:Error Creating Lock File ad

    I am getting an error while submitting the XML publisher report in Betsy N0 instance.
    Issue

    Log :- Beginning post-processing of request 145458120 on node BETSYN0DB1 at 22-DEC-2011 05:28:26.
    Post-processing of request 145458120 failed at 22-DEC-2011 05:28:28 with the error message: One or more post-processing actions failed. Consult the OPP service log for details
    Output :- Blank Report
    XML file :- XML file generated without any error
    Output process:-

    [12/23/11 4:28:10 AM] [1213640:RT145480622] Completed post-processing actions for request 145480622.
    [12/23/11 5:16:01 AM] [OPPServiceThread1] Post-processing request 145481427.
    [12/23/11 5:49:30 AM] [OPPServiceThread1] Post-processing request 145481923.
    [12/23/11 5:49:30 AM] [1213640:RT145481923] Executing post-processing actions for request 145481923.
    [12/23/11 5:49:30 AM] [1213640:RT145481923] Starting XML Publisher post-processing action.
    [12/23/11 5:49:30 AM] [1213640:RT145481923]
    Template code: XXWIP_WO_VLVS
    Template app: XXWIP
    Language: en
    Territory: US
    Output type: PDF
    oracle.apps.xdo.XDOException: Error creating lock file
    at oracle.apps.xdo.oa.util.FontCacheManager.getFontFromDB(FontCacheManager.java:320)
    at oracle.apps.xdo.oa.util.FontCacheManager.getFontFilePath(FontCacheManager.java:198)
    at oracle.apps.xdo.oa.util.FontHelper.createFontProperties(FontHelper.java:432)
    at oracle.apps.xdo.oa.util.ConfigHelper.getFontProperties(ConfigHelper.java:166)
    at oracle.apps.xdo.oa.schema.server.TemplateHelper.runProcessTemplate(TemplateHelper.java:5824)
    at oracle.apps.xdo.oa.schema.server.TemplateHelper.processTemplate(TemplateHelper.java:3459)
    at oracle.apps.xdo.oa.schema.server.TemplateHelper.processTemplate(TemplateHelper.java:3548)
    at oracle.apps.fnd.cp.opp.XMLPublisherProcessor.process(XMLPublisherProcessor.java:247)
    at oracle.apps.fnd.cp.opp.OPPRequestThread.run(OPPRequestThread.java:157)
    [12/23/11 5:49:31 AM] [UNEXPECTED] [1213640:RT145481923] oracle.apps.xdo.XDOException: Error creating lock file
    at oracle.apps.xdo.oa.util.FontCacheManager.getFontFromDB(FontCacheManager.java:320)
    at oracle.apps.xdo.oa.util.FontCacheManager.getFontFilePath(FontCacheManager.java:198)
    at oracle.apps.xdo.oa.util.FontHelper.createFontProperties(FontHelper.java:432)
    at oracle.apps.xdo.oa.util.ConfigHelper.getFontProperties(ConfigHelper.java:166)
    at oracle.apps.xdo.oa.schema.server.TemplateHelper.runProcessTemplate(TemplateHelper.java:5824)
    at oracle.apps.xdo.oa.schema.server.TemplateHelper.processTemplate(TemplateHelper.java:3459)
    at oracle.apps.xdo.oa.schema.server.TemplateHelper.processTemplate(TemplateHelper.java:3548)
    at oracle.apps.fnd.cp.opp.XMLPublisherProcessor.process(XMLPublisherProcessor.java:247)
    at oracle.apps.fnd.cp.opp.OPPRequestThread.run(OPPRequestThread.java:157)

    [12/23/11 5:49:31 AM] [1213640:RT145481923] Completed post-processing actions for request 145481923.

  • RELEVANCY SCORE 2.83

    DB:2.83:Error:Xdl:198 mp



    I want to change an XDL file, but it have some problem and error . The error number is 198 and say could not find arc in tile (INT_X2Y2) with connecting wires LOGIC_OUTS20 and IMUX_B18 ......

    I don't know about the root of this error , Is here any body to know about this error and can help me?

    thank you so much




    --xana

    DB:2.83:Error:Xdl:198 mp


    Actually this erroris because of the constraints that have been defined in XDL and the structure of FPGA.The connections between any kind of pin is not possible , and we just couldconnect some of them together.




    --xana

  • RELEVANCY SCORE 2.82

    DB:2.82:Error In Updating Jar File In Windows p7


    Hi...
    I am updating a jar file using Runtime.exec() by passing a batch file in it.
    While updating the jar file I am getting error like this:

    java.io.IOException: Error in writing existing jar file

    at sun.tools.jar.Main.run(Main.java:198)

    at sun.tools.jar.Main.main(Main.java:1022)

    The batch file (upgradejar.bat) is like this:

    echo IQuinox NextGen Upgrade Management
    cd shared/upgrade/upgrade/IQfullversion/classes
    jar uf ../../../../../../jars/ng.jar ./qlc/postmaster/PMStartup.class ./qlc/postmaster/wpm/admin/scheduler/others/OthersScheduleServlet.class

    The java code is like this:

    Process p=Runtime.getRuntime.exec( "cmd /C start "+upgradejar.bat);

    if (p.waitFor() != 0) {
    System.err.println("exit value = " +p.exitValue());
    }

    Thanks.

    DB:2.82:Error In Updating Jar File In Windows p7

    I am using the jar file in my program. the jar file name is " _ng.jar_ " which is mentioned in the batch file.

    The batch file is here :

    echo IQuinox NextGen Upgrade Management
    cd shared/upgrade/upgrade/IQfullversion/classes
    jar uf ../../../../../../jars/ng.jar ./qlc/postmaster/PMStartup.class ./qlc/postmaster/wpm/admin/scheduler/others/OthersScheduleServlet.class

  • RELEVANCY SCORE 2.82

    DB:2.82:Error -4 When Trying To Purchase Movies 9x


    Hello,
    I'm receiving an error -4 (There was an error in the iTunes store) message when trying to buy movies. Is anyone else receiving this same error code?

    Thanks

    DB:2.82:Error -4 When Trying To Purchase Movies 9x

    It just cleared up for me too. They must have been doing maintenance.

  • RELEVANCY SCORE 2.82

    DB:2.82:Java.Lang.Nullpointerexception p8


    hello and a very good day to all :)

    can someone help me with this? i am a new beginner in J2ME and i get this error when i'm trying to run my 1st program:

    java.lang.NullPointerException
    at java.io.DataInputStream.read(+4)
    at java.io.DataInputStream.readUnsignedShort(+4)
    at java.io.DataInputStream.readUTF(+6)
    at java.io.DataInputStream.readUTF(+4)
    at org.qcontinuum.compass.TimeZone.load(+6)
    at org.qcontinuum.compass.TimeZone.init(+9)
    at org.qcontinuum.compass.TimeZone.getZones(+36)
    at org.qcontinuum.compass.LocationTimeZone.init(+89)
    at org.qcontinuum.compass.LocationMap.locationSelected(+22)
    at org.qcontinuum.compass.MapCanvas.moveImage(+282)
    at org.qcontinuum.compass.MapCanvas.keyPressed(+22)
    at javax.microedition.lcdui.Canvas.callKeyPressed(+19)
    at javax.microedition.lcdui.Display$DisplayAccessor.keyEvent(+198)
    at javax.microedition.lcdui.Display$DisplayManagerImpl.keyEvent(+11)
    at com.sun.midp.lcdui.DefaultEventHandler.keyEvent(+127)
    at com.sun.midp.lcdui.AutomatedEventHandler.keyEvent(+210)
    at com.sun.midp.lcdui.DefaultEventHandler$QueuedEventHandler.handleVmEvent(+114)
    at com.sun.midp.lcdui.DefaultEventHandler$QueuedEventHandler.run(+57)

    what the code is mean? can someone help me on how to trace this and correct it? i am using sun wireless toolkit and i don't know in which part the error occur :(

    pls help me ..

    DB:2.82:Java.Lang.Nullpointerexception p8

    hello and a very good day to all :)

    can someone help me with this? i am a new beginner in J2ME and i get this error when i'm trying to run my 1st program:

    java.lang.NullPointerException
    at java.io.DataInputStream.read(+4)
    at java.io.DataInputStream.readUnsignedShort(+4)
    at java.io.DataInputStream.readUTF(+6)
    at java.io.DataInputStream.readUTF(+4)
    at org.qcontinuum.compass.TimeZone.load(+6)
    at org.qcontinuum.compass.TimeZone.init(+9)
    at org.qcontinuum.compass.TimeZone.getZones(+36)
    at org.qcontinuum.compass.LocationTimeZone.init(+89)
    at org.qcontinuum.compass.LocationMap.locationSelected(+22)
    at org.qcontinuum.compass.MapCanvas.moveImage(+282)
    at org.qcontinuum.compass.MapCanvas.keyPressed(+22)
    at javax.microedition.lcdui.Canvas.callKeyPressed(+19)
    at javax.microedition.lcdui.Display$DisplayAccessor.keyEvent(+198)
    at javax.microedition.lcdui.Display$DisplayManagerImpl.keyEvent(+11)
    at com.sun.midp.lcdui.DefaultEventHandler.keyEvent(+127)
    at com.sun.midp.lcdui.AutomatedEventHandler.keyEvent(+210)
    at com.sun.midp.lcdui.DefaultEventHandler$QueuedEventHandler.handleVmEvent(+114)
    at com.sun.midp.lcdui.DefaultEventHandler$QueuedEventHandler.run(+57)

    what the code is mean? can someone help me on how to trace this and correct it? i am using sun wireless toolkit and i don't know in which part the error occur :(

    pls help me ..

  • RELEVANCY SCORE 2.81

    DB:2.81:Error Code 30088-4 3c


    What does error code 30088-4 mean?

    DB:2.81:Error Code 30088-4 3c

    Hello Andrene,

    When do you receive this error message?

    Did you register the purchased edition of Office 2013?

    It is difficult to provide the meaning or the reason for this error code as of now as it’s an emerging issue.

    However, you may follow the steps provided below and check if that helps to resolve the issue.
    You may run the fix it tool from the following article which will remove all the installed components of Office 2013 from the computer.
    http://support.microsoft.com/kb/2739501
    Important This section, method, or task contains steps that tell you how to modify the registry. However, serious problems might occur if you modify the registry incorrectly. Therefore,
    make sure that you follow these steps carefully. For added protection, back up the registry before you modify it. Then, you can restore the registry if a problem occurs.

    Once the uninstallation is completed you may use the installation source file to reinstall Office 2013 on the computer and verify the status.

    You may also refer to the general troubleshooting steps mentioned in the article below while installing Office 2013 on the computer.
    http://support.microsoft.com/kb/2822317

    I hope the above information helps. Let us know if you need further assistance.
    Thank you.

  • RELEVANCY SCORE 2.81

    DB:2.81:My Sky Go As Error Code 4 xs


    My sky go app keeps saying temporary fault code 4 , please try later.

    DB:2.81:My Sky Go As Error Code 4 xs

    Hello JOHN27272727,

    Thanks for getting back to me.

    Did you use the Sky Sports Mobile TV app on an older iPad before you purchased the new iPad?

    Thanks,




    Natasha-B
    Community Coordinator
    Community Welcome, Hints Tips
    Sky Help Centre http://www.sky.com/help

  • RELEVANCY SCORE 2.81

    DB:2.81:Mbp Won't Sleep Automatically. ms


    My Macbook Pro won't go to sleep and it's driving me crazy.

    I have been watching my processes closely and haven't seen anything that would keep it awake. The screen goes off like usual but it won't actually go to sleep on its own.

    I can make it sleep by closing the lid or pressing sleep under the apple logo.

    I deleted com.bjango.istatlocal in my Library launchagents folder

    here are my computers processes

    (com.bjango.istatlocal[193]) posix_spawn("/Library/Application Support/iStat local/iStatLocal", ...): No such file or directory
    9/22/09 4:55:59 PM com.apple.launchd.peruser.501[80] (com.bjango.istatlocal[193]) Exited with exit code: 1
    9/22/09 4:55:59 PM com.apple.launchd.peruser.501[80] (com.bjango.istatlocal) Throttling respawn: Will start in 10 seconds
    9/22/09 4:56:09 PM com.apple.launchd.peruser.501[80] (com.bjango.istatlocal[194]) posix_spawn("/Library/Application Support/iStat local/iStatLocal", ...): No such file or directory
    9/22/09 4:56:09 PM com.apple.launchd.peruser.501[80] (com.bjango.istatlocal[194]) Exited with exit code: 1
    9/22/09 4:56:09 PM com.apple.launchd.peruser.501[80] (com.bjango.istatlocal) Throttling respawn: Will start in 10 seconds
    9/22/09 4:56:19 PM com.apple.launchd.peruser.501[80] (com.bjango.istatlocal[198]) posix_spawn("/Library/Application Support/iStat local/iStatLocal", ...): No such file or directory
    9/22/09 4:56:19 PM com.apple.launchd.peruser.501[80] (com.bjango.istatlocal[198]) Exited with exit code: 1
    9/22/09 4:56:19 PM com.apple.launchd.peruser.501[80] (com.bjango.istatlocal) Throttling respawn: Will start in 10 seconds
    9/22/09 4:56:23 PM com.apple.launchd.peruser.501[80] ([0x0-0x12012].com.apple.Console[124]) Exited: Killed
    9/22/09 4:56:43 PM com.apple.launchd[1] * launchd[1] has started up. *
    9/22/09 4:57:13 PM com.wacom.wacomtablet[72] TabletDriver[72]: Env RUNWITHLAUNCHD is set to 1
    9/22/09 4:57:14 PM com.apple.WindowServer[54] Tue Sep 22 16:57:14 chad-muellers-macbook-pro.local WindowServer[54] Error: kCGErrorFailure: Set a breakpoint @ CGErrorBreakpoint() to catch errors as they are logged.
    9/22/09 4:57:28 PM com.wacom.wacomtablet[81] TabletDriver[81]: Env RUNWITHLAUNCHD is set to 1
    9/22/09 4:57:28 PM com.apple.launchd.peruser.501[82] (com.apple.ReportCrash) Falling back to default Mach exception handler. Could not find: com.apple.ReportCrash.Self
    9/22/09 4:57:28 PM com.wacom.wacomtablet[81] TabletDriver[81]: RunApplication called while eStopping
    9/22/09 4:57:28 PM com.apple.launchd[1] (com.wacom.wacomtablet[81]) Exited with exit code: 255
    9/22/09 4:57:30 PM com.wacom.wacomtablet[107] TabletDriver[107]: Env RUNWITHLAUNCHD is set to 1
    9/22/09 4:57:30 PM com.apple.launchd.peruser.501[82] (com.apple.Kerberos.renew.plist[104]) Exited with exit code: 1
    9/22/09 4:57:31 PM com.apple.launchd.peruser.501[82] (com.apple.CSConfigDotMacCert-slvre39@me.com-SharedServices[109]) Exited with exit code: 1
    9/22/09 5:07:44 PM [0x0-0x1a01a].org.mozilla.firefox[165] Debugger() was called!
    9/22/09 5:08:28 PM iChatAgent[160] [Warning] [AIM] Could not change my visibility to 0
    9/22/09 5:08:31 PM iChatAgent[160] [Warning] AIMBuddyList::OnDownloadError: user=oxygensk8z, error=(code=3, subcode=0, category=7, url="", message="")
    9/22/09 5:08:31 PM iChatAgent[160] [Warning] AIMBuddyList::OnDownloadError: user=unfknstpbl666, error=(code=3, subcode=0, category=7, url="", message="")
    9/22/09 5:08:31 PM iChatAgent[160] [Warning] AIMBuddyList::OnDownloadError: user=drboboh, error=(code=3, subcode=0, category=7, url="", message="")
    9/22/09 5:08:31 PM iChatAgent[160] [Warning] AIMBuddyList::OnDownloadError: user=m3alpine97, error=(code=3, subcode=0, category=7, url="", message="")
    9/22/09 5:08:31 PM iChatAgent[160] [Warning] AIMBuddyList::OnDownloadError: user=shahab323is, error=(code=3, subcode=0, category=7, url="", message="")
    9/22/09 5:08:31 PM iChatAgent[160] [Warning] AIMBuddyList::OnDownloadError: user=myiprelay, error=(code=3, subcode=0, category=7, url="", message="")
    9/22/09 5:08:31 PM iChatAgent[160] [Warning] AIMBuddyList::OnDownloadError: user=santaclaus, error=(code=3, subcode=0, category=7, url="", message="")
    9/22/09 5:08:31 PM iChatAgent[160] [Warning] AIMBuddyList::OnDownloadError: user=santaclaus, error=(code=3, subcode=0, category=7, url="", message="")
    9/22/09 5:08:31 PM iChatAgent[160] [Warning] AIMBuddyList::OnDownloadError: user=woobiee101, error=(code=3, subcode=0, category=7, url="", message="")
    9/22/09 5:18:18 PM [0x0-0x1a01a].org.mozilla.firefox[165] Debugger() was called!
    9/22/09 5:20:49 PM com.apple.launchd[1] * launchd[1] has started up. *
    9/22/09 5:21:18 PM com.wacom.wacomtablet[69] TabletDriver[69]: Env RUNWITHLAUNCHD is set to 1
    9/22/09 5:21:18 PM com.apple.WindowServer[50] Tue Sep 22 17:21:18 chad-muellers-macbook-pro.local WindowServer[50] Error: kCGErrorFailure: Set a breakpoint @ CGErrorBreakpoint() to catch errors as they are logged.
    9/22/09 5:23:52 PM com.wacom.wacomtablet[93] TabletDriver[93]: Env RUNWITHLAUNCHD is set to 1
    9/22/09 5:23:52 PM com.apple.launchd.peruser.501[95] (com.apple.ReportCrash) Falling back to default Mach exception handler. Could not find: com.apple.ReportCrash.Self
    9/22/09 5:23:52 PM com.wacom.wacomtablet[93] TabletDriver[93]: #### GetFrontProcess failed to get front process (-600)
    9/22/09 5:23:52 PM com.wacom.wacomtablet[93] TabletDriver[93]: RunApplication called while eStopping
    9/22/09 5:23:52 PM com.apple.launchd[1] (com.wacom.wacomtablet[93]) Exited with exit code: 255
    9/22/09 5:23:58 PM com.wacom.wacomtablet[117] TabletDriver[117]: Env RUNWITHLAUNCHD is set to 1
    9/22/09 5:23:59 PM com.apple.launchd.peruser.501[95] (com.apple.Kerberos.renew.plist[114]) Exited with exit code: 1
    9/22/09 5:24:00 PM com.apple.launchd.peruser.501[95] (com.apple.CSConfigDotMacCert-slvre39@me.com-SharedServices[119]) Exited with exit code: 1
    9/22/09 5:26:59 PM [0x0-0x17017].backupd-helper[162] Not starting Time Machine backup after wake - failed to resolve alias to backup volume

    PLEASE HELPP!!!!!

    Message was edited by: Slvre39

    DB:2.81:Mbp Won't Sleep Automatically. ms

    I found a solution for my MBP not going into sleep:

    I went into preferences panel, selected PrintFax. I deleted all the printers (and so all the print queues).
    Since then my MBP now goes again into sleep after many months of attempts. I tried basically everything.

    Hope this help you to solve this annoying problem.

  • RELEVANCY SCORE 2.81

    DB:2.81:[Sloved] I Cant Update My System (Conflicting Files).. d9



    I cant update my system, so what i can to do?

    Thats error by pacman -Syu command.
    (198/198) checking for file conflicts [######################] 100%
    error: failed to commit transaction (conflicting files)
    /usr/lib/libglapi.so exists in both mesa-full and libglapi
    /usr/lib/libglapi.so.0 exists in both mesa-full and libglapi
    /usr/lib/libglapi.so.0.0.0 exists in both mesa-full and libglapi
    Errors occurred, no packages were upgraded.

    DB:2.81:[Sloved] I Cant Update My System (Conflicting Files).. d9


    Then I misread the problem: Pacman apparently wanted to update your packages so that one of the updated packages would have had libglapi as a dependency while you also had mesa-full updated.I always thought pacman could be a bit more helpful in these cases with showing why it wants to install the respective package i.e. what depends on them so you can resolve the conflict more easily.

    In case somebody else is reading this: It would have probably worked this way:
    pacman -Rdd mesa-full
    pacman -Su
    pacman -S mesa-full # resolve conflict manually

  • RELEVANCY SCORE 2.81

    DB:2.81:Error Code 80390000 39


    When i try to install dungeon hunter 4 from SD Card, an error code 80390000 appears...What does it mean..?

    DB:2.81:Error Code 80390000 39

    Hi Fabian

    Thank you for getting in touch may you try the steps in this
    thread let me know if you are able to download your

  • RELEVANCY SCORE 2.81

    DB:2.81:Error Code Oxc8000246 c9


    Trying to install net framework 4 and get the above error code. need to install soonest for continuing with school work

    DB:2.81:Error Code Oxc8000246 c9

    QED: Would it help if he was installing KB982670 orKB982671?

  • RELEVANCY SCORE 2.81

    DB:2.81:Unsafefilenameexception ???? kc



    Hi, we use WLS 6.1 sp3 on win NT 4, it throws the following error from time to
    time, What kind of error is it?

    Thanks,

    Andy

    Error HTTP [WebAppServletContext(7582243,DefaultWebApp,/DefaultWebApp)] getRealPath()
    called with unsafe path: "/_mem_bin/..\../..\../..\../winnt/system32/cmd.exe/"
    weblogic.utils.io.FilenameEncoder$UnsafeFilenameException: F:\bea\winnt\system32\cmd.exe\
    not under: F:\bea\wlserver6.1\config\mydomain\applications\DefaultWebApp at weblogic.utils.io.FilenameEncoder.getSafeFile(FilenameEncoder.java:198)
    at weblogic.servlet.internal.WebAppServletContext.getRealPath(WebAppServletCont
    ext.java:544) at weblogic.servlet.internal.WebAppServletContext.findIndexFile(WebAppServletCo
    ntext.java:2931) at weblogic.servlet.internal.WebAppServletContext.resolveRequest(WebAppServletC
    ontext.java:2872) at weblogic.servlet.internal.WebAppServletContext.resolveRequest(WebAppServletC
    ontext.java:2684) at weblogic.servlet.internal.WebAppServletContext.dispatch(WebAppServletContext
    .java:2358) at weblogic.servlet.internal.MuxableSocketHTTP.dispatch(MuxableSocketHTTP.java:
    547) at weblogic.socket.NTSocketMuxer.processSockets(NTSocketMuxer.java:643) at
    weblogic.socket.SocketReaderRequest.execute(SocketReaderRequest.java:24) at weblogic.kernel.ExecuteThread.execute(ExecuteThread.java:139)
    at weblogic.kernel.ExecuteThread.run(ExecuteThread.java:120)

    DB:2.81:Unsafefilenameexception ???? kc

    This is that old NIMDA worm that was going around. It affected IIS servers.

    Search google for NIMDA.

    Regards,

    Eric

    "Andy" andy@katz.com wrote in message
    news:3e5394ef$1@newsgroups.bea.com...

    Hi, we use WLS 6.1 sp3 on win NT 4, it throws the following error fromtime to
    time, What kind of error is it?

    Thanks,

    Andy

    Error HTTP[WebAppServletContext(7582243,DefaultWebApp,/DefaultWebApp)] getRealPath()
    called with unsafe path:"/_mem_bin/..\../..\../..\../winnt/system32/cmd.exe/"
    weblogic.utils.io.FilenameEncoder$UnsafeFilenameException:F:\bea\winnt\system32\cmd.exe\
    not under: F:\bea\wlserver6.1\config\mydomain\applications\DefaultWebAppat weblogic.utils.io.FilenameEncoder.getSafeFile(FilenameEncoder.java:198)
    atweblogic.servlet.internal.WebAppServletContext.getRealPath(WebAppServletCont
    ext.java:544) atweblogic.servlet.internal.WebAppServletContext.findIndexFile(WebAppServletCo
    ntext.java:2931) atweblogic.servlet.internal.WebAppServletContext.resolveRequest(WebAppServletC
    ontext.java:2872) atweblogic.servlet.internal.WebAppServletContext.resolveRequest(WebAppServletC
    ontext.java:2684) atweblogic.servlet.internal.WebAppServletContext.dispatch(WebAppServletContext
    .java:2358) atweblogic.servlet.internal.MuxableSocketHTTP.dispatch(MuxableSocketHTTP.java:
    547) atweblogic.socket.NTSocketMuxer.processSockets(NTSocketMuxer.java:643) at
    weblogic.socket.SocketReaderRequest.execute(SocketReaderRequest.java:24)at weblogic.kernel.ExecuteThread.execute(ExecuteThread.java:139)
    at weblogic.kernel.ExecuteThread.run(ExecuteThread.java:120)

  • RELEVANCY SCORE 2.80

    DB:2.80:Java.Sql.Sqlexception: Refused:Or=(Code=12505)(Emfi=4)))) kc


    Hello,

    I am trying to connect to Oracle 7.3.4 database using jdbc
    driver jdbc73402 for NT. The SQL exception and message I get is
    --------------------------------------------------------
    java.sql.SQLException: Refused:OR=(CODE=12505)(EMFI=4))))

    at oracle.jdbc.dbaccess.DBError.check_error
    (DBError.java:230)
    at oracle.jdbc.driver.OracleConnection.init
    (OracleConnection.java:110)

    at oracle.jdbc.driver.OracleDriver.connect
    (OracleDriver.java:148)
    at java.sql.DriverManager.getConnection(Unknown Source)
    at java.sql.DriverManager.getConnection(Unknown Source)
    at DatabaseManager.connect(DatabaseManager.java:93)
    at FrmMain.refreshTaskList(FrmMain.java:198)
    at FrmMain.main(FrmMain.java:151)
    --------------------------------------------------------

    I have tried an other driver jdbc817jdk12-nt.zip but I got
    similar error message :
    --------------------------------------------------------
    java.sql.SQLException: Io exception: Connection refused
    (DESCRIPTION=(TMP=)(VSNNU
    M=36716544)(ERR=12505)(ERROR_STACK=(ERROR=(CODE=12505)(EMFI=4))))
    at oracle.jdbc.dbaccess.DBError.throwSqlException
    (DBError.java:168)
    at oracle.jdbc.dbaccess.DBError.throwSqlException
    (DBError.java:210)
    at oracle.jdbc.dbaccess.DBError.throwSqlException
    (DBError.java:323)
    at oracle.jdbc.driver.OracleConnection.init
    (OracleConnection.java:260)

    at oracle.jdbc.driver.OracleDriver.getConnectionInstance
    (OracleDriver.ja
    va:365)
    at oracle.jdbc.driver.OracleDriver.connect
    (OracleDriver.java:260)
    at java.sql.DriverManager.getConnection(Unknown Source)
    at java.sql.DriverManager.getConnection(Unknown Source)
    at DatabaseManager.connect(DatabaseManager.java:93)
    at FrmMain.refreshTaskList(FrmMain.java:198)
    at FrmMain.main(FrmMain.java:151)
    --------------------------------------------------------
    I can connect to database using jdbc:odbc bridge.
    thanks.

    DB:2.80:Java.Sql.Sqlexception: Refused:Or=(Code=12505)(Emfi=4)))) kc

    Hello,

    I am trying to connect to Oracle 7.3.4 database using jdbc
    driver jdbc73402 for NT. The SQL exception and message I get is
    --------------------------------------------------------
    java.sql.SQLException: Refused:OR=(CODE=12505)(EMFI=4))))

    at oracle.jdbc.dbaccess.DBError.check_error
    (DBError.java:230)
    at oracle.jdbc.driver.OracleConnection.init
    (OracleConnection.java:110)

    at oracle.jdbc.driver.OracleDriver.connect
    (OracleDriver.java:148)
    at java.sql.DriverManager.getConnection(Unknown Source)
    at java.sql.DriverManager.getConnection(Unknown Source)
    at DatabaseManager.connect(DatabaseManager.java:93)
    at FrmMain.refreshTaskList(FrmMain.java:198)
    at FrmMain.main(FrmMain.java:151)
    --------------------------------------------------------

    I have tried an other driver jdbc817jdk12-nt.zip but I got
    similar error message :
    --------------------------------------------------------
    java.sql.SQLException: Io exception: Connection refused
    (DESCRIPTION=(TMP=)(VSNNU
    M=36716544)(ERR=12505)(ERROR_STACK=(ERROR=(CODE=12505)(EMFI=4))))
    at oracle.jdbc.dbaccess.DBError.throwSqlException
    (DBError.java:168)
    at oracle.jdbc.dbaccess.DBError.throwSqlException
    (DBError.java:210)
    at oracle.jdbc.dbaccess.DBError.throwSqlException
    (DBError.java:323)
    at oracle.jdbc.driver.OracleConnection.init
    (OracleConnection.java:260)

    at oracle.jdbc.driver.OracleDriver.getConnectionInstance
    (OracleDriver.ja
    va:365)
    at oracle.jdbc.driver.OracleDriver.connect
    (OracleDriver.java:260)
    at java.sql.DriverManager.getConnection(Unknown Source)
    at java.sql.DriverManager.getConnection(Unknown Source)
    at DatabaseManager.connect(DatabaseManager.java:93)
    at FrmMain.refreshTaskList(FrmMain.java:198)
    at FrmMain.main(FrmMain.java:151)
    --------------------------------------------------------
    I can connect to database using jdbc:odbc bridge.
    thanks.

  • RELEVANCY SCORE 2.80

    DB:2.80:Windows Update Error Code 66a 91


    Error Code 66A when installing Security Update for Microsoft .NET Framework 4 onWindows Vista

    DB:2.80:Windows Update Error Code 66a 91

    hi
    read below
    http://answers.microsoft.com/en-us/windows/forum/windows_other-windows_update/error-code-66a-net-framework-4/1307e399-8997-41c4-9d3b-24f872425148

  • RELEVANCY SCORE 2.79

    DB:2.79:Error Code "Lightroom.Exe Application Error" mk



    Lightroom 4 crashes when opening. Error Code "Lightroom.exe Application Error"

    Running Windows 7 64

    Is there an easy fix.

    DB:2.79:Error Code "Lightroom.Exe Application Error" mk


    Lightroom 4 crashes when opening. Error Code "Lightroom.exe Application Error"

    Running Windows 7 64

    Is there an easy fix.

  • RELEVANCY SCORE 2.79

    DB:2.79:Ntkrnlmp.Exe Error Code 4 With Twinx2048-3200c2 s7


    Hello all,

  • RELEVANCY SCORE 2.79

    DB:2.79:Jdbc Driver ca


    Hello,

    I'm using Jdbc for some tests, execution of the program raise always this error.

    java.lang.UnsatisfiedLinkError: do_open
    at oracle.jdbc.oci8.OCIDBAccess.logon(OCIDBAccess.java:309)
    at oracle.jdbc.driver.OracleConnection.init(OracleConnection.java:198)
    at Oracle.jdbc.driver.OracleDriver.getConnectionInstance(OracleDriver.java:251)
    at oracle.jdbc.driver.OracleDriver.connect(OracleDriver.java:224)
    at java.sql.DriverManager.getConnection(Compiled Code)
    at java.sql.DriverManager.getConnection(DriverManager.java:126)
    at JdbcCheckup.main(Compiled Code)

    I need help

    Thanks

    Kamel

    DB:2.79:Jdbc Driver ca

    Hi Kamel,

    This error is raised because your java program can't find a shared library (*.so on unix, *.dll on Windows). You are using the OCI-based driver, which depends on having Net*8 installed. If you don't have that installed, you should use the thin driver.

    Regards,

    John

  • RELEVANCY SCORE 2.79

    DB:2.79:Issue With The Report Oracle.Apps.Xdo.Xdoexception:Error Creating Lock File js


    I am getting an error while submitting the XML publisher report in Betsy N0 instance.
    Issue

    Log :- Beginning post-processing of request 145458120 on node BETSYN0DB1 at 22-DEC-2011 05:28:26.
    Post-processing of request 145458120 failed at 22-DEC-2011 05:28:28 with the error message: One or more post-processing actions failed. Consult the OPP service log for details
    Output :- Blank Report
    XML file :- XML file generated without any error
    Output process:-

    [12/23/11 4:28:10 AM] [1213640:RT145480622] Completed post-processing actions for request 145480622.
    [12/23/11 5:16:01 AM] [OPPServiceThread1] Post-processing request 145481427.
    [12/23/11 5:49:30 AM] [OPPServiceThread1] Post-processing request 145481923.
    [12/23/11 5:49:30 AM] [1213640:RT145481923] Executing post-processing actions for request 145481923.
    [12/23/11 5:49:30 AM] [1213640:RT145481923] Starting XML Publisher post-processing action.
    [12/23/11 5:49:30 AM] [1213640:RT145481923]
    Template code: XXWIP_WO_VLVS
    Template app: XXWIP
    Language: en
    Territory: US
    Output type: PDF
    oracle.apps.xdo.XDOException: Error creating lock file
    at oracle.apps.xdo.oa.util.FontCacheManager.getFontFromDB(FontCacheManager.java:320)
    at oracle.apps.xdo.oa.util.FontCacheManager.getFontFilePath(FontCacheManager.java:198)
    at oracle.apps.xdo.oa.util.FontHelper.createFontProperties(FontHelper.java:432)
    at oracle.apps.xdo.oa.util.ConfigHelper.getFontProperties(ConfigHelper.java:166)
    at oracle.apps.xdo.oa.schema.server.TemplateHelper.runProcessTemplate(TemplateHelper.java:5824)
    at oracle.apps.xdo.oa.schema.server.TemplateHelper.processTemplate(TemplateHelper.java:3459)
    at oracle.apps.xdo.oa.schema.server.TemplateHelper.processTemplate(TemplateHelper.java:3548)
    at oracle.apps.fnd.cp.opp.XMLPublisherProcessor.process(XMLPublisherProcessor.java:247)
    at oracle.apps.fnd.cp.opp.OPPRequestThread.run(OPPRequestThread.java:157)
    [12/23/11 5:49:31 AM] [UNEXPECTED] [1213640:RT145481923] oracle.apps.xdo.XDOException: Error creating lock file
    at oracle.apps.xdo.oa.util.FontCacheManager.getFontFromDB(FontCacheManager.java:320)
    at oracle.apps.xdo.oa.util.FontCacheManager.getFontFilePath(FontCacheManager.java:198)
    at oracle.apps.xdo.oa.util.FontHelper.createFontProperties(FontHelper.java:432)
    at oracle.apps.xdo.oa.util.ConfigHelper.getFontProperties(ConfigHelper.java:166)
    at oracle.apps.xdo.oa.schema.server.TemplateHelper.runProcessTemplate(TemplateHelper.java:5824)
    at oracle.apps.xdo.oa.schema.server.TemplateHelper.processTemplate(TemplateHelper.java:3459)
    at oracle.apps.xdo.oa.schema.server.TemplateHelper.processTemplate(TemplateHelper.java:3548)
    at oracle.apps.fnd.cp.opp.XMLPublisherProcessor.process(XMLPublisherProcessor.java:247)
    at oracle.apps.fnd.cp.opp.OPPRequestThread.run(OPPRequestThread.java:157)

    [12/23/11 5:49:31 AM] [1213640:RT145481923] Completed post-processing actions for request 145481923.

    DB:2.79:Issue With The Report Oracle.Apps.Xdo.Xdoexception:Error Creating Lock File js

    I am getting an error while submitting the XML publisher report in Betsy N0 instance.
    Issue

    Log :- Beginning post-processing of request 145458120 on node BETSYN0DB1 at 22-DEC-2011 05:28:26.
    Post-processing of request 145458120 failed at 22-DEC-2011 05:28:28 with the error message: One or more post-processing actions failed. Consult the OPP service log for details
    Output :- Blank Report
    XML file :- XML file generated without any error
    Output process:-

    [12/23/11 4:28:10 AM] [1213640:RT145480622] Completed post-processing actions for request 145480622.
    [12/23/11 5:16:01 AM] [OPPServiceThread1] Post-processing request 145481427.
    [12/23/11 5:49:30 AM] [OPPServiceThread1] Post-processing request 145481923.
    [12/23/11 5:49:30 AM] [1213640:RT145481923] Executing post-processing actions for request 145481923.
    [12/23/11 5:49:30 AM] [1213640:RT145481923] Starting XML Publisher post-processing action.
    [12/23/11 5:49:30 AM] [1213640:RT145481923]
    Template code: XXWIP_WO_VLVS
    Template app: XXWIP
    Language: en
    Territory: US
    Output type: PDF
    oracle.apps.xdo.XDOException: Error creating lock file
    at oracle.apps.xdo.oa.util.FontCacheManager.getFontFromDB(FontCacheManager.java:320)
    at oracle.apps.xdo.oa.util.FontCacheManager.getFontFilePath(FontCacheManager.java:198)
    at oracle.apps.xdo.oa.util.FontHelper.createFontProperties(FontHelper.java:432)
    at oracle.apps.xdo.oa.util.ConfigHelper.getFontProperties(ConfigHelper.java:166)
    at oracle.apps.xdo.oa.schema.server.TemplateHelper.runProcessTemplate(TemplateHelper.java:5824)
    at oracle.apps.xdo.oa.schema.server.TemplateHelper.processTemplate(TemplateHelper.java:3459)
    at oracle.apps.xdo.oa.schema.server.TemplateHelper.processTemplate(TemplateHelper.java:3548)
    at oracle.apps.fnd.cp.opp.XMLPublisherProcessor.process(XMLPublisherProcessor.java:247)
    at oracle.apps.fnd.cp.opp.OPPRequestThread.run(OPPRequestThread.java:157)
    [12/23/11 5:49:31 AM] [UNEXPECTED] [1213640:RT145481923] oracle.apps.xdo.XDOException: Error creating lock file
    at oracle.apps.xdo.oa.util.FontCacheManager.getFontFromDB(FontCacheManager.java:320)
    at oracle.apps.xdo.oa.util.FontCacheManager.getFontFilePath(FontCacheManager.java:198)
    at oracle.apps.xdo.oa.util.FontHelper.createFontProperties(FontHelper.java:432)
    at oracle.apps.xdo.oa.util.ConfigHelper.getFontProperties(ConfigHelper.java:166)
    at oracle.apps.xdo.oa.schema.server.TemplateHelper.runProcessTemplate(TemplateHelper.java:5824)
    at oracle.apps.xdo.oa.schema.server.TemplateHelper.processTemplate(TemplateHelper.java:3459)
    at oracle.apps.xdo.oa.schema.server.TemplateHelper.processTemplate(TemplateHelper.java:3548)
    at oracle.apps.fnd.cp.opp.XMLPublisherProcessor.process(XMLPublisherProcessor.java:247)
    at oracle.apps.fnd.cp.opp.OPPRequestThread.run(OPPRequestThread.java:157)

    [12/23/11 5:49:31 AM] [1213640:RT145481923] Completed post-processing actions for request 145481923.

  • RELEVANCY SCORE 2.78

    DB:2.78:List Of Strings Annotated With @Elementcollection Does Not Work With Jpa Client 8f



    I have an @Entity class (see attached screenshots) that has a ListString property annotated with @ElementCollection. The server side hibernate code is generated correctly but when I try to persist an instance using the entitymanager I get the following error:

    [ERROR] java.lang.RuntimeException: I don't know how JSONify [] (class java.util.ArrayList)
    [ERROR] at org.jboss.errai.jpa.client.local.JsonUtil.basicValueToJson(JsonUtil.java:91)
    [ERROR] at org.jboss.errai.jpa.client.local.ErraiManagedType.makeInlineJson(ErraiManagedType.java:288)
    [ERROR] at org.jboss.errai.jpa.client.local.ErraiManagedType.toJson(ErraiManagedType.java:149)
    [ERROR] at org.jboss.errai.jpa.client.local.backend.WebStorageBackend.put(WebStorageBackend.java:99)
    [ERROR] at org.jboss.errai.jpa.client.local.ErraiEntityManager.applyCascadingOperation(ErraiEntityManager.java:198)
    [ERROR] at org.jboss.errai.jpa.client.local.ErraiEntityManager.persist(ErraiEntityManager.java:581)
    [ERROR] at nl.wisdelft.prototype.client.local.widgets.EnterDBPediaPageWidget$1.callback(EnterDBPediaPageWidget.java:89)
    [ERROR] at nl.wisdelft.prototype.client.local.widgets.EnterDBPediaPageWidget$1.callback(EnterDBPediaPageWidget.java:1)
    [ERROR] at org.jboss.errai.bus.client.api.builder.DefaultRemoteCallBuilder$1$1.callback(DefaultRemoteCallBuilder.java:106)
    [ERROR] at org.jboss.errai.bus.client.framework.ClientMessageBusImpl$10.callback(ClientMessageBusImpl.java:670)
    [ERROR] at org.jboss.errai.bus.client.framework.ClientMessageBusImpl.sendLocal(ClientMessageBusImpl.java:835)
    [ERROR] at org.jboss.errai.bus.client.util.BusToolsCli.decodeToCallback(BusToolsCli.java:54)
    [ERROR] at org.jboss.errai.bus.client.framework.transports.SSEHandler.handleReceived(SSEHandler.java:147)
    [ERROR] at sun.reflect.NativeMethodAccessorImpl.invoke0(Native Method)
    [ERROR] at sun.reflect.NativeMethodAccessorImpl.invoke(NativeMethodAccessorImpl.java:57)
    [ERROR] at sun.reflect.DelegatingMethodAccessorImpl.invoke(DelegatingMethodAccessorImpl.java:43)
    [ERROR] at java.lang.reflect.Method.invoke(Method.java:606)
    [ERROR] at com.google.gwt.dev.shell.MethodAdaptor.invoke(MethodAdaptor.java:103)
    [ERROR] at com.google.gwt.dev.shell.MethodDispatch.invoke(MethodDispatch.java:71)
    [ERROR] at com.google.gwt.dev.shell.OophmSessionHandler.invoke(OophmSessionHandler.java:172)
    [ERROR] at com.google.gwt.dev.shell.BrowserChannelServer.reactToMessages(BrowserChannelServer.java:293)
    [ERROR] at com.google.gwt.dev.shell.BrowserChannelServer.processConnection(BrowserChannelServer.java:547)
    [ERROR] at com.google.gwt.dev.shell.BrowserChannelServer.run(BrowserChannelServer.java:364)
    [ERROR] at java.lang.Thread.run(Thread.java:745)

    DB:2.78:List Of Strings Annotated With @Elementcollection Does Not Work With Jpa Client 8f


    Hello Jasper,

    The @ElementCollection annotation has not yet been implemented in Errai JPA. If you would like to implement it, do send us a pull request and we will be happy to integrate it.

    Cheers,Divya

  • RELEVANCY SCORE 2.78

    DB:2.78:Something Went Wrong. Error Code 3088-4 97


    Original title: error code 3088-4

    something went wrong

    DB:2.78:Something Went Wrong. Error Code 3088-4 97

    Hello Ed,

    I'd like to ask a question before we proceed:

    When do you receive the specified error? Is it while installing or trying to work with the Office application?

    Let's try the following methods and verify the result:

    Method 1

    Repair the Office suite following instructions mentioned in the below article and see if it helps:
    http://office.microsoft.com/en-us/excel-help/repair-office-programs-HA010357402.aspx

    Method 2

    If issue still persists, run 'Fix it' from the following article to remove any remains of Office installation, re-install it and then try working with the Office applications and verify the result:
    http://support.microsoft.com/kb/2739501

    Note: Save the ‘Fix it’ before running it if you’re working on a 64 bit Windows.

    If you face any issues while re-installing the Office suite, you may refer to the following KB article
    which discusses about common Office installation issues and see if it helps:
    http://support.microsoft.com/kb/2822317

    Hope the above information helps. Try the suggestions and let me know the result at your earliest convenience.

    Thank you.

  • RELEVANCY SCORE 2.77

    DB:2.77:Receiving Error When Searching For Update Code 80070005 z3


    unable to search 4 update
    receiving following error code : 80070005
    please advice

    DB:2.77:Receiving Error When Searching For Update Code 80070005 z3


    One of the most common causes of this error code (Access Denied) is the Anti Virus and Anti Spyware software programs running on the computer. You can try turning them off and then try the updates again.
    UTC/GMT is 22:49 on Saturday, November 19, 2011

  • RELEVANCY SCORE 2.76

    DB:2.76:A Question About Jdbc For Oracle jd


    This is The Error Message:
    Opening database: jdbc:oracle:thin:@localhost:1521:rpdb
    java.sql.SQLException: Io exception: Connection
    refused(DESCRIPTION=(TMP=)(VSNNUM=135294976)(ERR=12500)(ERROR_STACK=(ERROR=( CODE=12500)(EMFI=4))(ERROR=(CODE=12560)(EMFI=4))(ERROR=(CODE=530)(EMFI=4))(ERROR= (BUF='32-bit Windows Error: 2: Exec Format Error'))))

    Hope for help!

    DB:2.76:A Question About Jdbc For Oracle jd

    Thanks a lot for your replies#12290;
    Maybe I would said more clearly,the followings is the bewrite of my question:
    First:my webserver and my class for connecting database(base on jdbc for oracle) works well commonly,and it's no wrong with my java jar.Wrong happened since the latest week,it appears once per day.The error Messages are those I said above.
    Second:I'd looked for the answer for my question and found some solved ways.One is about the Params of view V$RESOURCE_LIMIT as I said above,so I checked it ,but found it no wrong.
    Third:rpdb is the SID of my oracle db,and the url string is right,my db server and webserver are all on one server,so the server_ip of url string is localhost.
    Hope your reply.
    Thx.

  • RELEVANCY SCORE 2.76

    DB:2.76:Https Tunneling With Proxy Server/Firewall 9p


    I'm using oc4j version 1.0.2.2.1. The Context.PROVIDER_URL is set to https:ormi://host:443/appname. The code works until I put a http proxy server that requires authentication in the network. The authentication dialog comes up then I get the following exception:

    javax.naming.NamingException: Error reading application-client descriptor: Error communicating with server: Lookup error: java.lang.NegativeArraySizeException; nested exception is:
    java.lang.NegativeArraySizeException; nested exception is:
    javax.naming.NamingException: Lookup error: java.lang.NegativeArraySizeException; nested exception is:
    java.lang.NegativeArraySizeException
    at com.evermind.server.ApplicationClientInitialContextFactory.getInitialContext(ApplicationClientInitialContextFactory.java:184)
    at javax.naming.spi.NamingManager.getInitialContext(NamingManager.java:665)
    at javax.naming.InitialContext.getDefaultInitCtx(InitialContext.java:246)
    at javax.naming.InitialContext.init(InitialContext.java:222)
    at javax.naming.InitialContext.init(InitialContext.java:198)
    at com.platts.dmz.DMZTestingClient.init(DMZTestingClient.java:48)
    at com.platts.dmz.DMZTestingClient.main(DMZTestingClient.java:374)

    Any ideas?

    Thanks

    Frank

    DB:2.76:Https Tunneling With Proxy Server/Firewall 9p

    I'm using oc4j version 1.0.2.2.1. The Context.PROVIDER_URL is set to https:ormi://host:443/appname. The code works until I put a http proxy server that requires authentication in the network. The authentication dialog comes up then I get the following exception:

    javax.naming.NamingException: Error reading application-client descriptor: Error communicating with server: Lookup error: java.lang.NegativeArraySizeException; nested exception is:
    java.lang.NegativeArraySizeException; nested exception is:
    javax.naming.NamingException: Lookup error: java.lang.NegativeArraySizeException; nested exception is:
    java.lang.NegativeArraySizeException
    at com.evermind.server.ApplicationClientInitialContextFactory.getInitialContext(ApplicationClientInitialContextFactory.java:184)
    at javax.naming.spi.NamingManager.getInitialContext(NamingManager.java:665)
    at javax.naming.InitialContext.getDefaultInitCtx(InitialContext.java:246)
    at javax.naming.InitialContext.init(InitialContext.java:222)
    at javax.naming.InitialContext.init(InitialContext.java:198)
    at com.platts.dmz.DMZTestingClient.init(DMZTestingClient.java:48)
    at com.platts.dmz.DMZTestingClient.main(DMZTestingClient.java:374)

    Any ideas?

    Thanks

    Frank

  • RELEVANCY SCORE 2.76

    DB:2.76:Price Comparison Template Error - Access 2010 77


    I recently downloaded the price comparison template for Access 2010. Much to my surprise immediately upon opening the databaseit threw an error.
    The error states:

    An error has occurred in the script on this page.
    Line 1
    Char 198
    Error: Not implemented
    Code 0
    URL:
    http://www.bing.com/sa/8_01_0_1552509/UpdateDefaults.js

    My programming abilities arelimited to basic C++, some VB, and JavaScript.
    Has anyone seen or resolvedthis error?

    If, not any suggestions on how to access the code, I am very new to Access 2010.

    Kind regards,

    Joseph

    DB:2.76:Price Comparison Template Error - Access 2010 77

    No problem... trying to find a place to submit that information. WOuld be nice if it worked error free!

  • RELEVANCY SCORE 2.76

    DB:2.76:Error Code 12002-4 fm


    i try to install office365 but i get this message
    error code 12002-4

    DB:2.76:Error Code 12002-4 fm

    In your firewall / proxy open the ports listed in this articlehttp://technet.microsoft.com/en-us/library/hh852522.aspx and this may fix your problem. It fixed mine.

    Good Luck!

  • RELEVANCY SCORE 2.76

    DB:2.76:Itunes 11.3 Crashes As Soon As I Plug In Iphone 5s am


    Hi, if you dont mind, could you troubleshoot my issue?As soon as I plug my iphone 5s into my macbook, itunes freezes and i have to force close it.7/14/14 10:35:25.108 PM SyncServer[814]: [0x7f8bea4082f0] |SQLite|Error| Detected out-of-space situation: 0 (Undefined error: 0). 120111824896 bytes free in anniekim. 7/14/14 10:35:25.111 PM com.apple.launchd.peruser.501[198]: (com.apple.syncservices.SyncServer[814]) Exited with code: 17/14/14 10:35:25.643 PM AppleMobileDeviceHelper[598]: [0x10020c6d0] |Mingler|Error| failed to connect to the server: NSInvalidReceivePortException connection went invalid while waiting for a reply because a mach port died7/14/14 10:35:25.643 PM AppleMobileDeviceHelper[502]: [0x10020c6b0] |Mingler|Error| failed to connect to the server: NSInvalidReceivePortException connection went invalid while waiting for a reply because a mach port died7/14/14 10:35:25.741 PM AppleMobileDeviceHelper[559]: [0x10020c6b0] |Mingler|Error| failed to connect to the server: NSInvalidReceivePortException connection went invalid while waiting for a reply because a mach port died7/14/14 10:35:25.795 PM com.apple.launchd.peruser.501[198]: (com.apple.syncservices.SyncServer) Throttling respawn: Will start in 9 seconds7/14/14 10:35:34.921 PM SyncServer[815]: [0x7fb481d014b0] |SQLite|Error| Detected out-of-space situation: 0 (Undefined error: 0). 119972921344 bytes free in anniekim. 7/14/14 10:35:34.924 PM com.apple.launchd.peruser.501[198]: (com.apple.syncservices.SyncServer[815]) Exited with code: 17/14/14 10:35:35.804 PM AppleMobileDeviceHelper[598]: [0x10020c6d0] |Mingler|Error| failed to connect to the server: NSInvalidReceivePortException connection went invalid while waiting for a reply because a mach port died7/14/14 10:35:35.804 PM AppleMobileDeviceHelper[502]: [0x10020c6b0] |Mingler|Error| failed to connect to the server: NSInvalidReceivePortException connection went invalid while waiting for a reply because a mach port died7/14/14 10:35:35.905 PM AppleMobileDeviceHelper[559]: [0x10020c6b0] |Mingler|Error| failed to connect to the server: NSInvalidReceivePortException connection went invalid while waiting for a reply because a mach port died7/14/14 10:35:35.956 PM com.apple.launchd.peruser.501[198]: (com.apple.syncservices.SyncServer) Throttling respawn: Will start in 9 seconds7/14/14 10:35:45.033 PM SyncServer[817]: [0x7ff2185069d0] |SQLite|Error| Detected out-of-space situation: 0 (Undefined error: 0). 119820075008 bytes free in anniekim. 7/14/14 10:35:45.036 PM com.apple.launchd.peruser.501[198]: (com.apple.syncservices.SyncServer[817]) Exited with code: 17/14/14 10:35:45.963 PM AppleMobileDeviceHelper[598]: [0x10020c6d0] |Mingler|Error| failed to connect to the server: NSInvalidReceivePortException connection went invalid while waiting for a reply because a mach port died7/14/14 10:35:45.963 PM AppleMobileDeviceHelper[502]: [0x10020c6b0] |Mingler|Error| failed to connect to the server: NSInvalidReceivePortException connection went invalid while waiting for a reply because a mach port died7/14/14 10:35:46.064 PM AppleMobileDeviceHelper[559]: [0x10020c6b0] |Mingler|Error| failed to connect to the server: NSInvalidReceivePortException connection went invalid while waiting for a reply because a mach port died7/14/14 10:35:46.116 PM com.apple.launchd.peruser.501[198]: (com.apple.syncservices.SyncServer) Throttling respawn: Will start in 9 seconds7/14/14 10:35:55.750 PM SyncServer[818]: [0x7faa73d02d30] |SQLite|Error| Detected out-of-space situation: 0 (Undefined error: 0). 119685431296 bytes free in anniekim. 7/14/14 10:35:55.756 PM com.apple.launchd.peruser.501[198]: (com.apple.syncservices.SyncServer[818]) Exited with code: 17/14/14 10:35:56.184 PM AppleMobileDeviceHelper[598]: [0x10020c6d0] |Mingler|Error| failed to connect to the server: NSInvalidReceivePortException connection went invalid while waiting for a reply because a mach port died7/14/14 10:35:56.185 PM AppleMobileDeviceHelper[502]: [0x10020c6b0] |Mingler|Error| failed to connect to the server: NSInvalidReceivePortException connection went invalid while waiting for a reply because a mach port died7/14/14 10:35:56.224 PM AppleMobileDeviceHelper[559]: [0x10020c6b0] |Mingler|Error| failed to connect to the server: NSInvalidReceivePortException connection went invalid while waiting for a reply because a mach port died7/14/14 10:35:56.337 PM com.apple.launchd.peruser.501[198]: (com.apple.syncservices.SyncServer) Throttling respawn: Will start in 9 seconds7/14/14 10:35:57.270 PM iTunes[615]: Entered:_AMMuxedVersion2DeviceConnected, mux-device:87/14/14 10:35:57.287 PM iTunes[615]: tid:1957b - unable to query device capabilities7/14/14 10:36:05.713 PM SyncServer[822]: [0x7fc09a5062e0] |SQLite|Error| Detected out-of-space situation: 0 (Undefined error: 0). 119569461248 bytes free in anniekim. 7/14/14 10:36:05.715 PM com.apple.launchd.peruser.501[198]: (com.apple.syncservices.SyncServer[822]) Exited with code: 17/14/14 10:36:06.346 PM AppleMobileDeviceHelper[502]: [0x10020c6b0] |Mingler|Error| failed to connect to the server: NSInvalidReceivePortException connection went invalid while waiting for a reply because a mach port died7/14/14 10:36:06.346 PM AppleMobileDeviceHelper[598]: [0x10020c6d0] |Mingler|Error| failed to connect to the server: NSInvalidReceivePortException connection went invalid while waiting for a reply because a mach port died7/14/14 10:36:06.384 PM AppleMobileDeviceHelper[559]: [0x10020c6b0] |Mingler|Error| failed to connect to the server: NSInvalidReceivePortException connection went invalid while waiting for a reply because a mach port died7/14/14 10:36:06.499 PM com.apple.launchd.peruser.501[198]: (com.apple.syncservices.SyncServer) Throttling respawn: Will start in 9 seconds7/14/14 10:36:07.042 PM AppleMobileDeviceHelper[657]: [0x10020c6b0] |Mingler|Error| failed to connect to the server: NSInvalidReceivePortException connection went invalid while waiting for a reply because a mach port died7/14/14 10:36:16.996 PM SyncServer[825]: [0x7f8ceb503190] |SQLite|Error| Detected out-of-space situation: 0 (Undefined error: 0). 119431360512 bytes free in anniekim. 7/14/14 10:36:17.002 PM com.apple.launchd.peruser.501[198]: (com.apple.syncservices.SyncServer[825]) Exited with code: 17/14/14 10:36:17.350 PM AppleMobileDeviceHelper[657]: [0x10020c6b0] |Mingler|Error| failed to connect to the server: NSInvalidReceivePortException connection went invalid while waiting for a reply because a mach port died7/14/14 10:36:17.503 PM com.apple.launchd.peruser.501[198]: (com.apple.syncservices.SyncServer) Throttling respawn: Will start in 8 seconds7/14/14 10:36:17.757 PM AppleMobileDeviceHelper[598]: [0x10020c6d0] |Mingler|Error| failed to connect to the server: NSInvalidReceivePortException connection went invalid while waiting for a reply because a mach port died7/14/14 10:36:17.757 PM AppleMobileDeviceHelper[502]: [0x10020c6b0] |Mingler|Error| failed to connect to the server: NSInvalidReceivePortException connection went invalid while waiting for a reply because a mach port died7/14/14 10:36:17.796 PM AppleMobileDeviceHelper[559]: [0x10020c6b0] |Mingler|Error| failed to connect to the server: NSInvalidReceivePortException connection went invalid while waiting for a reply because a mach port died7/14/14 10:36:25.992 PM SyncServer[826]: [0x7fee1340bf50] |SQLite|Error| Detected out-of-space situation: 0 (Undefined error: 0). 119293140992 bytes free in anniekim. 7/14/14 10:36:25.995 PM com.apple.launchd.peruser.501[198]: (com.apple.syncservices.SyncServer[826]) Exited with code: 17/14/14 10:36:26.259 PM AppleMobileDeviceHelper[657]: [0x10020c6b0] |Mingler|Error| failed to connect to the server: NSInvalidReceivePortException connection went invalid while waiting for a reply because a mach port died7/14/14 10:36:26.412 PM com.apple.launchd.peruser.501[198]: (com.apple.syncservices.SyncServer) Throttling respawn: Will start in 10 seconds7/14/14 10:36:26.666 PM AppleMobileDeviceHelper[598]: [0x10020c6d0] |Mingler|Error| failed to connect to the server: NSInvalidReceivePortException connection went invalid while waiting for a reply because a mach port died7/14/14 10:36:26.667 PM AppleMobileDeviceHelper[502]: [0x10020c6b0] |Mingler|Error| failed to connect to the server: NSInvalidReceivePortException connection went invalid while waiting for a reply because a mach port died7/14/14 10:36:26.706 PM AppleMobileDeviceHelper[559]: [0x10020c6b0] |Mingler|Error| failed to connect to the server: NSInvalidReceivePortException connection went invalid while waiting for a reply because a mach port died7/14/14 10:36:34.258 PM com.apple.SecurityServer[14]: Session 100030 created7/14/14 10:36:37.571 PM SyncServer[827]: [0x7fc232d02db0] |SQLite|Error| Detected out-of-space situation: 0 (Undefined error: 0). 119147876352 bytes free in anniekim. 7/14/14 10:36:37.573 PM com.apple.launchd.peruser.501[198]: (com.apple.syncservices.SyncServer[827]) Exited with code: 17/14/14 10:36:37.668 PM AppleMobileDeviceHelper[657]: [0x10020c6b0] |Mingler|Error| failed to connect to the server: NSInvalidReceivePortException connection went invalid while waiting for a reply because a mach port died7/14/14 10:36:37.823 PM com.apple.launchd.peruser.501[198]: (com.apple.syncservices.SyncServer) Throttling respawn: Will start in 9 seconds7/14/14 10:36:38.079 PM AppleMobileDeviceHelper[598]: [0x10020c6d0] |Mingler|Error| failed to connect to the server: NSInvalidReceivePortException connection went invalid while waiting for a reply because a mach port died7/14/14 10:36:38.080 PM AppleMobileDeviceHelper[502]: [0x10020c6b0] |Mingler|Error| failed to connect to the server: NSInvalidReceivePortException connection went invalid while waiting for a reply because a mach port died7/14/14 10:36:38.120 PM AppleMobileDeviceHelper[559]: [0x10020c6b0] |Mingler|Error| failed to connect to the server: NSInvalidReceivePortException connection went invalid while waiting for a reply because a mach port died7/14/14 10:36:47.262 PM SyncServer[828]: [0x7fb818c072c0] |SQLite|Error| Detected out-of-space situation: 0 (Undefined error: 0). 118988492800 bytes free in anniekim. 7/14/14 10:36:47.265 PM com.apple.launchd.peruser.501[198]: (com.apple.syncservices.SyncServer[828]) Exited with code: 17/14/14 10:36:47.830 PM AppleMobileDeviceHelper[657]: [0x10020c6b0] |Mingler|Error| failed to connect to the server: NSInvalidReceivePortException connection went invalid while waiting for a reply because a mach port died7/14/14 10:36:47.982 PM com.apple.launchd.peruser.501[198]: (com.apple.syncservices.SyncServer) Throttling respawn: Will start in 9 seconds7/14/14 10:36:48.531 PM AppleMobileDeviceHelper[598]: [0x10020c6d0] |Mingler|Error| failed to connect to the server: NSInvalidReceivePortException connection went invalid while waiting for a reply because a mach port died7/14/14 10:36:48.532 PM AppleMobileDeviceHelper[559]: [0x10020c6b0] |Mingler|Error| failed to connect to the server: NSInvalidReceivePortException connection went invalid while waiting for a reply because a mach port died7/14/14 10:36:48.532 PM AppleMobileDeviceHelper[502]: [0x10020c6b0] |Mingler|Error| failed to connect to the server: NSInvalidReceivePortException connection went invalid while waiting for a reply because a mach port died7/14/14 10:36:57.131 PM SyncServer[832]: [0x7fb258c065a0] |SQLite|Error| Detected out-of-space situation: 0 (Undefined error: 0). 118879580160 bytes free in anniekim. 7/14/14 10:36:57.138 PM com.apple.launchd.peruser.501[198]: (com.apple.syncservices.SyncServer[832]) Exited with code: 17/14/14 10:36:57.461 PM AppleMobileDeviceHelper[559]: [0x10020c6b0] |Mingler|Error| failed to connect to the server: NSInvalidReceivePortException connection went invalid while waiting for a reply because a mach port died7/14/14 10:36:57.461 PM AppleMobileDeviceHelper[598]: [0x10020c6d0] |Mingler|Error| failed to connect to the server: NSInvalidReceivePortException connection went invalid while waiting for a reply because a mach port died7/14/14 10:36:57.462 PM AppleMobileDeviceHelper[502]: [0x10020c6b0] |Mingler|Error| failed to connect to the server: NSInvalidReceivePortException connection went invalid while waiting for a reply because a mach port died7/14/14 10:36:57.613 PM com.apple.launchd.peruser.501[198]: (com.apple.syncservices.SyncServer) Throttling respawn: Will start in 10 seconds7/14/14 10:36:57.988 PM AppleMobileDeviceHelper[657]: [0x10020c6b0] |Mingler|Error| failed to connect to the server: NSInvalidReceivePortException connection went invalid while waiting for a reply because a mach port died7/14/14 10:37:08.144 PM SyncServer[833]: [0x7f8418c08280] |SQLite|Error| Detected out-of-space situation: 0 (Undefined error: 0). 118783201280 bytes free in anniekim. 7/14/14 10:37:08.146 PM com.apple.launchd.peruser.501[198]: (com.apple.syncservices.SyncServer[833]) Exited with code: 17/14/14 10:37:08.147 PM AppleMobileDeviceHelper[657]: [0x10020c6b0] |Mingler|Error| failed to connect to the server: NSInvalidReceivePortException connection went invalid while waiting for a reply because a mach port died7/14/14 10:37:08.298 PM com.apple.launchd.peruser.501[198]: (com.apple.syncservices.SyncServer) Throttling respawn: Will start in 10 seconds7/14/14 10:37:08.872 PM AppleMobileDeviceHelper[598]: [0x10020c6d0] |Mingler|Error| failed to connect to the server: NSInvalidReceivePortException connection went invalid while waiting for a reply because a mach port died7/14/14 10:37:08.872 PM AppleMobileDeviceHelper[559]: [0x10020c6b0] |Mingler|Error| failed to connect to the server: NSInvalidReceivePortException connection went invalid while waiting for a reply because a mach port died7/14/14 10:37:08.878 PM AppleMobileDeviceHelper[502]: [0x10020c6b0] |Mingler|Error| failed to connect to the server: NSInvalidReceivePortException connection went invalid while waiting for a reply because a mach port died7/14/14 10:37:20.120 PM SyncServer[834]: [0x7fe44240bd30] |SQLite|Error| Detected out-of-space situation: 0 (Undefined error: 0). 118735646720 bytes free in anniekim. 7/14/14 10:37:20.123 PM com.apple.launchd.peruser.501[198]: (com.apple.syncservices.SyncServer[834]) Exited with code: 17/14/14 10:37:20.320 PM AppleMobileDeviceHelper[598]: [0x10020c6d0] |Mingler|Error| failed to connect to the server: NSInvalidReceivePortException connection went invalid while waiting for a reply because a mach port died7/14/14 10:37:20.321 PM AppleMobileDeviceHelper[502]: [0x10020c6b0] |Mingler|Error| failed to connect to the server: NSInvalidReceivePortException connection went invalid while waiting for a reply because a mach port died7/14/14 10:37:20.321 PM AppleMobileDeviceHelper[559]: [0x10020c6b0] |Mingler|Error| failed to connect to the server: NSInvalidReceivePortException connection went invalid while waiting for a reply because a mach port died7/14/14 10:37:20.474 PM com.apple.launchd.peruser.501[198]: (com.apple.syncservices.SyncServer) Throttling respawn: Will start in 8 seconds7/14/14 10:37:20.817 PM AppleMobileDeviceHelper[657]: [0x10020c6b0] |Mingler|Error| failed to connect to the server: NSInvalidReceivePortException connection went invalid while waiting for a reply because a mach port died7/14/14 10:37:28.773 PM SyncServer[838]: [0x7febd1d06720] |SQLite|Error| Detected out-of-space situation: 0 (Undefined error: 0). 118675726336 bytes free in anniekim. 7/14/14 10:37:28.775 PM com.apple.launchd.peruser.501[198]: (com.apple.syncservices.SyncServer[838]) Exited with code: 17/14/14 10:37:29.240 PM AppleMobileDeviceHelper[502]: [0x10020c6b0] |Mingler|Error| failed to connect to the server: NSInvalidReceivePortException connection went invalid while waiting for a reply because a mach port died7/14/14 10:37:29.241 PM AppleMobileDeviceHelper[559]: [0x10020c6b0] |Mingler|Error| failed to connect to the server: NSInvalidReceivePortException connection went invalid while waiting for a reply because a mach port died7/14/14 10:37:29.241 PM AppleMobileDeviceHelper[598]: [0x10020c6d0] |Mingler|Error| failed to connect to the server: NSInvalidReceivePortException connection went invalid while waiting for a reply because a mach port died7/14/14 10:37:29.399 PM com.apple.launchd.peruser.501[198]: (com.apple.syncservices.SyncServer) Throttling respawn: Will start in 10 seconds7/14/14 10:37:29.734 PM AppleMobileDeviceHelper[657]: [0x10020c6b0] |Mingler|Error| failed to connect to the server: NSInvalidReceivePortException connection went invalid while waiting for a reply because a mach port died7/14/14 10:37:40.383 PM SyncServer[840]: [0x7fcfb3c08970] |SQLite|Error| Detected out-of-space situation: 0 (Undefined error: 0). 118587797504 bytes free in anniekim. 7/14/14 10:37:40.390 PM com.apple.launchd.peruser.501[198]: (com.apple.syncservices.SyncServer[840]) Exited with code: 17/14/14 10:37:40.661 PM AppleMobileDeviceHelper[502]: [0x10020c6b0] |Mingler|Error| failed to connect to the server: NSInvalidReceivePortException connection went invalid while waiting for a reply because a mach port died7/14/14 10:37:40.661 PM AppleMobileDeviceHelper[559]: [0x10020c6b0] |Mingler|Error| failed to connect to the server: NSInvalidReceivePortException connection went invalid while waiting for a reply because a mach port died7/14/14 10:37:40.661 PM AppleMobileDeviceHelper[598]: [0x10020c6d0] |Mingler|Error| failed to connect to the server: NSInvalidReceivePortException connection went invalid while waiting for a reply because a mach port died7/14/14 10:37:40.813 PM com.apple.launchd.peruser.501[198]: (com.apple.syncservices.SyncServer) Throttling respawn: Will start in 9 seconds7/14/14 10:37:41.148 PM AppleMobileDeviceHelper[657]: [0x10020c6b0] |Mingler|Error| failed to connect to the server: NSInvalidReceivePortException connection went invalid while waiting for a reply because a mach port died7/14/14 10:37:49.891 PM SyncServer[841]: [0x7faaa9c05600] |SQLite|Error| Detected out-of-space situation: 0 (Undefined error: 0). 118550892544 bytes free in anniekim. 7/14/14 10:37:49.896 PM com.apple.launchd.peruser.501[198]: (com.apple.syncservices.SyncServer[841]) Exited with code: 17/14/14 10:37:50.063 PM AppleMobileDeviceHelper[657]: [0x10020c6b0] |Mingler|Error| failed to connect to the server: NSInvalidReceivePortException connection went invalid while waiting for a reply because a mach port died7/14/14 10:37:50.215 PM com.apple.launchd.peruser.501[198]: (com.apple.syncservices.SyncServer) Throttling respawn: Will start in 10 seconds7/14/14 10:37:50.822 PM AppleMobileDeviceHelper[598]: [0x10020c6d0] |Mingler|Error| failed to connect to the server: NSInvalidReceivePortException connection went invalid while waiting for a reply because a mach port died7/14/14 10:37:50.822 PM AppleMobileDeviceHelper[559]: [0x10020c6b0] |Mingler|Error| failed to connect to the server: NSInvalidReceivePortException connection went invalid while waiting for a reply because a mach port died7/14/14 10:37:50.823 PM AppleMobileDeviceHelper[502]: [0x10020c6b0] |Mingler|Error| failed to connect to the server: NSInvalidReceivePortException connection went invalid while waiting for a reply because a mach port died7/14/14 10:38:00.387 PM SyncServer[843]: [0x7f8880406750] |SQLite|Error| Detected out-of-space situation: 0 (Undefined error: 0). 118457917440 bytes free in anniekim. 7/14/14 10:38:00.389 PM com.apple.launchd.peruser.501[198]: (com.apple.syncservices.SyncServer[843]) Exited with code: 17/14/14 10:38:00.982 PM AppleMobileDeviceHelper[559]: [0x10020c6b0] |Mingler|Error| failed to connect to the server: NSInvalidReceivePortException connection went invalid while waiting for a reply because a mach port died7/14/14 10:38:00.983 PM AppleMobileDeviceHelper[598]: [0x10020c6d0] |Mingler|Error| failed to connect to the server: NSInvalidReceivePortException connection went invalid while waiting for a reply because a mach port died7/14/14 10:38:01.135 PM com.apple.launchd.peruser.501[198]: (com.apple.syncservices.SyncServer) Throttling respawn: Will start in 10 seconds7/14/14 10:38:01.381 PM AppleMobileDeviceHelper[502]: [0x10020c6b0] |Mingler|Error| failed to connect to the server: NSInvalidReceivePortException connection went invalid while waiting for a reply because a mach port died7/14/14 10:38:01.604 PM AppleMobileDeviceHelper[657]: [0x10020c6b0] |Mingler|Error| failed to connect to the server: NSInvalidReceivePortException connection went invalid while waiting for a reply because a mach port died7/14/14 10:38:12.061 PM SyncServer[844]: [0x7fe80940bda0] |SQLite|Error| Detected out-of-space situation: 0 (Undefined error: 0). 118381912064 bytes free in anniekim. 7/14/14 10:38:12.064 PM com.apple.launchd.peruser.501[198]: (com.apple.syncservices.SyncServer[844]) Exited with code: 17/14/14 10:38:12.398 PM AppleMobileDeviceHelper[598]: [0x10020c6d0] |Mingler|Error| failed to connect to the server: NSInvalidReceivePortException connection went invalid while waiting for a reply because a mach port died7/14/14 10:38:12.398 PM AppleMobileDeviceHelper[559]: [0x10020c6b0] |Mingler|Error| failed to connect to the server: NSInvalidReceivePortException connection went invalid while waiting for a reply because a mach port died7/14/14 10:38:12.551 PM com.apple.launchd.peruser.501[198]: (com.apple.syncservices.SyncServer) Throttling respawn: Will start in 9 seconds7/14/14 10:38:12.792 PM AppleMobileDeviceHelper[502]: [0x10020c6b0] |Mingler|Error| failed to connect to the server: NSInvalidReceivePortException connection went invalid while waiting for a reply because a mach port died7/14/14 10:38:13.021 PM AppleMobileDeviceHelper[657]: [0x10020c6b0] |Mingler|Error| failed to connect to the server: NSInvalidReceivePortException connection went invalid while waiting for a reply because a mach port died7/14/14 10:38:13.768 PM iTunes[615]: Entered:_AMMuxedDeviceDisconnected, mux-device:87/14/14 10:38:13.768 PM iTunes[615]: Entered:__thr_AMMuxedDeviceDisconnected, mux-device:87/14/14 10:38:13.768 PM iTunes[615]: tid:14c3 - BootedOS mode device disconnected7/14/14 10:38:22.914 PM SyncServer[845]: [0x7fa478d01a30] |SQLite|Error| Detected out-of-space situation: 0 (Undefined error: 0). 118329421824 bytes free in anniekim. 7/14/14 10:38:22.923 PM com.apple.launchd.peruser.501[198]: (com.apple.syncservices.SyncServer[845]) Exited with code: 17/14/14 10:38:22.953 PM AppleMobileDeviceHelper[502]: [0x10020c6b0] |Mingler|Error| failed to connect to the server: NSInvalidReceivePortException connection went invalid while waiting for a reply because a mach port died7/14/14 10:38:23.105 PM com.apple.launchd.peruser.501[198]: (com.apple.syncservices.SyncServer) Throttling respawn: Will start in 9 seconds7/14/14 10:38:23.208 PM AppleMobileDeviceHelper[657]: [0x10020c6b0] |Mingler|Error| failed to connect to the server: NSInvalidReceivePortException connection went invalid while waiting for a reply because a mach port died7/14/14 10:38:23.814 PM AppleMobileDeviceHelper[559]: [0x10020c6b0] |Mingler|Error| failed to connect to the server: NSInvalidReceivePortException connection went invalid while waiting for a reply because a mach port died7/14/14 10:38:23.814 PM AppleMobileDeviceHelper[598]: [0x10020c6d0] |Mingler|Error| failed to connect to the server: NSInvalidReceivePortException connection went invalid while waiting for a reply because a mach port died7/14/14 10:38:34.131 PM SyncServer[849]: [0x7faa7b5069d0] |SQLite|Error| Detected out-of-space situation: 0 (Undefined error: 0). 118279585792 bytes free in anniekim. 7/14/14 10:38:34.178 PM com.apple.launchd.peruser.501[198]: (com.apple.syncservices.SyncServer[849]) Exited with code: 17/14/14 10:38:34.370 PM AppleMobileDeviceHelper[502]: [0x10020c6b0] |Mingler|Error| failed to connect to the server: NSInvalidReceivePortException connection went invalid while waiting for a reply because a mach port died7/14/14 10:38:34.521 PM com.apple.launchd.peruser.501[198]: (com.apple.syncservices.SyncServer) Throttling respawn: Will start in 8 seconds7/14/14 10:38:34.621 PM AppleMobileDeviceHelper[657]: [0x10020c6b0] |Mingler|Error| failed to connect to the server: NSInvalidReceivePortException connection went invalid while waiting for a reply because a mach port died7/14/14 10:38:35.228 PM AppleMobileDeviceHelper[559]: [0x10020c6b0] |Mingler|Error| failed to connect to the server: NSInvalidReceivePortException connection went invalid while waiting for a reply because a mach port died7/14/14 10:38:35.229 PM AppleMobileDeviceHelper[598]: [0x10020c6d0] |Mingler|Error| failed to connect to the server: NSInvalidReceivePortException connection went invalid while waiting for a reply because a mach port died7/14/14 10:38:43.265 PM SyncServer[850]: [0x7ff523d0b5a0] |SQLite|Error| Detected out-of-space situation: 0 (Undefined error: 0). 118222450688 bytes free in anniekim. 7/14/14 10:38:43.268 PM com.apple.launchd.peruser.501[198]: (com.apple.syncservices.SyncServer[850]) Exited with code: 17/14/14 10:38:43.283 PM AppleMobileDeviceHelper[502]: [0x10020c6b0] |Mingler|Error| failed to connect to the server: NSInvalidReceivePortException connection went invalid while waiting for a reply because a mach port died7/14/14 10:38:43.435 PM com.apple.launchd.peruser.501[198]: (com.apple.syncservices.SyncServer) Throttling respawn: Will start in 10 seconds7/14/14 10:38:43.532 PM AppleMobileDeviceHelper[657]: [0x10020c6b0] |Mingler|Error| failed to connect to the server: NSInvalidReceivePortException connection went invalid while waiting for a reply because a mach port died7/14/14 10:38:44.137 PM AppleMobileDeviceHelper[559]: [0x10020c6b0] |Mingler|Error| failed to connect to the server: NSInvalidReceivePortException connection went invalid while waiting for a reply because a mach port died7/14/14 10:38:44.138 PM AppleMobileDeviceHelper[598]: [0x10020c6d0] |Mingler|Error| failed to connect to the server: NSInvalidReceivePortException connection went invalid while waiting for a reply because a mach port died7/14/14 10:38:44.917 PM Microsoft Word[831]: OTAtomicAdd32 is deprecated and will be removed soon. Please stop using it.7/14/14 10:38:53.573 PM SyncServer[851]: [0x7fcb1040a970] |SQLite|Error| Detected out-of-space situation: 0 (Undefined error: 0). 118169546752 bytes free in anniekim. 7/14/14 10:38:53.576 PM com.apple.launchd.peruser.501[198]: (com.apple.syncservices.SyncServer[851]) Exited with code: 17/14/14 10:38:53.694 PM AppleMobileDeviceHelper[657]: [0x10020c6b0] |Mingler|Error| failed to connect to the server: NSInvalidReceivePortException connection went invalid while waiting for a reply because a mach port died7/14/14 10:38:53.847 PM com.apple.launchd.peruser.501[198]: (com.apple.syncservices.SyncServer) Throttling respawn: Will start in 10 seconds7/14/14 10:38:54.299 PM AppleMobileDeviceHelper[559]: [0x10020c6b0] |Mingler|Error| failed to connect to the server: NSInvalidReceivePortException connection went invalid while waiting for a reply because a mach port died7/14/14 10:38:54.312 PM AppleMobileDeviceHelper[598]: [0x10020c6d0] |Mingler|Error| failed to connect to the server: NSInvalidReceivePortException connection went invalid while waiting for a reply because a mach port died7/14/14 10:38:54.696 PM AppleMobileDeviceHelper[502]: [0x10020c6b0] |Mingler|Error| failed to connect to the server: NSInvalidReceivePortException connection went invalid while waiting for a reply because a mach port died7/14/14 10:39:03.940 PM SyncServer[855]: [0x7fa0f3c0b860] |SQLite|Error| Detected out-of-space situation: 0 (Undefined error: 0). 118116175872 bytes free in anniekim. 7/14/14 10:39:03.943 PM com.apple.launchd.peruser.501[198]: (com.apple.syncservices.SyncServer[855]) Exited with code: 17/14/14 10:39:04.567 PM AppleMobileDeviceHelper[598]: [0x10020c6d0] |Mingler|Error| failed to connect to the server: NSInvalidReceivePortException connection went invalid while waiting for a reply because a mach port died7/14/14 10:39:04.567 PM AppleMobileDeviceHelper[559]: [0x10020c6b0] |Mingler|Error| failed to connect to the server: NSInvalidReceivePortException connection went invalid while waiting for a reply because a mach port died7/14/14 10:39:04.721 PM com.apple.launchd.peruser.501[198]: (com.apple.syncservices.SyncServer) Throttling respawn: Will start in 10 seconds7/14/14 10:39:04.854 PM AppleMobileDeviceHelper[502]: [0x10020c6b0] |Mingler|Error| failed to connect to the server: NSInvalidReceivePortException connection went invalid while waiting for a reply because a mach port died7/14/14 10:39:05.113 PM AppleMobileDeviceHelper[657]: [0x10020c6b0] |Mingler|Error| failed to connect to the server: NSInvalidReceivePortException connection went invalid while waiting for a reply because a mach port died7/14/14 10:39:14.805 PM SyncServer[857]: [0x7fd1f8d069d0] |SQLite|Error| Detected out-of-space situation: 0 (Undefined error: 0). 118048468992 bytes free in anniekim. 7/14/14 10:39:14.808 PM com.apple.launchd.peruser.501[198]: (com.apple.syncservices.SyncServer[857]) Exited with code: 17/14/14 10:39:15.011 PM AppleMobileDeviceHelper[502]: [0x10020c6b0] |Mingler|Error| failed to connect to the server: NSInvalidReceivePortException connection went invalid while waiting for a reply because a mach port died7/14/14 10:39:15.164 PM com.apple.launchd.peruser.501[198]: (com.apple.syncservices.SyncServer) Throttling respawn: Will start in 10 seconds7/14/14 10:39:15.272 PM AppleMobileDeviceHelper[657]: [0x10020c6b0] |Mingler|Error| failed to connect to the server: NSInvalidReceivePortException connection went invalid while waiting for a reply because a mach port died7/14/14 10:39:15.982 PM AppleMobileDeviceHelper[559]: [0x10020c6b0] |Mingler|Error| failed to connect to the server: NSInvalidReceivePortException connection went invalid while waiting for a reply because a mach port died7/14/14 10:39:15.982 PM AppleMobileDeviceHelper[598]: [0x10020c6d0] |Mingler|Error| failed to connect to the server: NSInvalidReceivePortException connection went invalid while waiting for a reply because a mach port died7/14/14 10:39:20.359 PM Microsoft Word[831]: GetScaledBatteryInfo is unimplemented and will be removed soon. Please stop using it.7/14/14 10:39:25.493 PM SyncServer[858]: [0x7fa008508220] |SQLite|Error| Detected out-of-space situation: 0 (Undefined error: 0). 117962227712 bytes free in anniekim. 7/14/14 10:39:25.498 PM com.apple.launchd.peruser.501[198]: (com.apple.syncservices.SyncServer[858]) Exited with code: 17/14/14 10:39:26.154 PM AppleMobileDeviceHelper[559]: [0x10020c6b0] |Mingler|Error| failed to connect to the server: NSInvalidReceivePortException connection went invalid while waiting for a reply because a mach port died7/14/14 10:39:26.155 PM AppleMobileDeviceHelper[598]: [0x10020c6d0] |Mingler|Error| failed to connect to the server: NSInvalidReceivePortException connection went invalid while waiting for a reply because a mach port died7/14/14 10:39:26.307 PM com.apple.launchd.peruser.501[198]: (com.apple.syncservices.SyncServer) Throttling respawn: Will start in 9 seconds7/14/14 10:39:26.423 PM AppleMobileDeviceHelper[502]: [0x10020c6b0] |Mingler|Error| failed to connect to the server: NSInvalidReceivePortException connection went invalid while waiting for a reply because a mach port died7/14/14 10:39:26.681 PM AppleMobileDeviceHelper[657]: [0x10020c6b0] |Mingler|Error| failed to connect to the server: NSInvalidReceivePortException connection went invalid while waiting for a reply because a mach port died7/14/14 10:39:35.962 PM SyncServer[859]: [0x7f927ad0b5a0] |SQLite|Error| Detected out-of-space situation: 0 (Undefined error: 0). 117867716608 bytes free in anniekim. 7/14/14 10:39:35.967 PM com.apple.launchd.peruser.501[198]: (com.apple.syncservices.SyncServer[859]) Exited with code: 17/14/14 10:39:36.316 PM AppleMobileDeviceHelper[559]: [0x10020c6b0] |Mingler|Error| failed to connect to the server: NSInvalidReceivePortException connection went invalid while waiting for a reply because a mach port died7/14/14 10:39:36.316 PM AppleMobileDeviceHelper[598]: [0x10020c6d0] |Mingler|Error| failed to connect to the server: NSInvalidReceivePortException connection went invalid while waiting for a reply because a mach port died7/14/14 10:39:36.471 PM com.apple.launchd.peruser.501[198]: (com.apple.syncservices.SyncServer) Throttling respawn: Will start in 9 seconds7/14/14 10:39:36.582 PM AppleMobileDeviceHelper[502]: [0x10020c6b0] |Mingler|Error| failed to connect to the server: NSInvalidReceivePortException connection went invalid while waiting for a reply because a mach port died7/14/14 10:39:36.840 PM AppleMobileDeviceHelper[657]: [0x10020c6b0] |Mingler|Error| failed to connect to the server: NSInvalidReceivePortException connection went invalid while waiting for a reply because a mach port died7/14/14 10:39:45.594 PM SyncServer[861]: [0x7fa9b0c08780] |SQLite|Error| Detected out-of-space situation: 0 (Undefined error: 0). 117822390272 bytes free in anniekim. 7/14/14 10:39:45.597 PM com.apple.launchd.peruser.501[198]: (com.apple.syncservices.SyncServer[861]) Exited with code: 17/14/14 10:39:45.749 PM AppleMobileDeviceHelper[657]: [0x10020c6b0] |Mingler|Error| failed to connect to the server: NSInvalidReceivePortException connection went invalid while waiting for a reply because a mach port died7/14/14 10:39:45.902 PM com.apple.launchd.peruser.501[198]: (com.apple.syncservices.SyncServer) Throttling respawn: Will start in 10 seconds7/14/14 10:39:46.477 PM AppleMobileDeviceHelper[598]: [0x10020c6d0] |Mingler|Error| failed to connect to the server: NSInvalidReceivePortException connection went invalid while waiting for a reply because a mach port died

    DB:2.76:Itunes 11.3 Crashes As Soon As I Plug In Iphone 5s am

    Thank you! That finally worked. It shouldn't be this hard to find so simple an answer but it's taken me several attempts over a few weeks (because I can't spend a lot of time googling for something that's, ultimately, not THAT big a deal )Barry

  • RELEVANCY SCORE 2.76

    DB:2.76:Mdb Transaction Exception On Oc4j 9.0.4 39


    We've got a MDB with CMT consuming messages from a Queue.

    The onMessage() method seems to work properly, but when OC4J tries later to manage the transaction, the following exception is thrown by the container:

    java.lang.Exception
    at com.evermind.sql.OracleXAPoolConnection.forget(OracleXAPoolConnection.java:317)
    at com.evermind.server.OrionTwoPhaseCommitDriver.forgetAndRollbackResource(OrionTwoPhaseCommitDriver.java:219)
    at com.evermind.server.OrionTwoPhaseCommitDriver.commit(OrionTwoPhaseCommitDriver.java:119)
    at com.evermind.server.ApplicationServerTransaction.twoPhaseCommit(ApplicationServerTransaction.java:885)
    at com.evermind.server.ApplicationServerTransaction.commit(ApplicationServerTransaction.java:696)
    at com.evermind.server.ApplicationServerTransaction.end(ApplicationServerTransaction.java:1033)
    at com.evermind.server.ejb.MessageDrivenBeanInvocation.run(MessageDrivenBeanInvocation.java:198)
    at com.evermind.server.ejb.MessageDrivenHome.onMessage(MessageDrivenHome.java:740)
    at com.evermind.server.ejb.MessageDrivenHome.run(MessageDrivenHome.java:904)
    at com.evermind.util.ReleasableResourcePooledExecutor$MyWorker.run(ReleasableResourcePooledExecutor.java:192)
    at java.lang.Thread.run(Unknown Source)
    XAException in errorRollback rollback(c0:7:3:8d:6d:67:0:0:3:0:0:0:0:0:0:0:0:4:0:
    f4:fe:3c:bf:32):
    Thread 4: Error code = -4
    XAException in errorRollback rollback failednull

    Any idea?
    I found MessageDrivenContext is an instance of class com.evermind.server.ejb.MessageDrivenHome. Should it be so?

    Thanks,
    Modulab

    DB:2.76:Mdb Transaction Exception On Oc4j 9.0.4 39

    We haven't time to test, so far we are installing and debugging on customers site - i. e. we have to resolve other issues...

    For anybody interested, Debu mentioned a bug #2668460. It concerns usage of 9i database as a commit coordinator. In short, it doesn't work from 9.2 databases, as in those versions there is a mismatch of Java class names. It should work from older versions, however, we haven't test it yet.

    Myrra

  • RELEVANCY SCORE 2.76

    DB:2.76:Error:Manifest Validation Fails: Error Code: Validationschemavalidation sz


    Error 4
    Manifest validation fails: Error code: ValidationSchemaValidation
    TravelMarg

    DB:2.76:Error:Manifest Validation Fails: Error Code: Validationschemavalidation sz

    Hello,
    Look in the WMAppManifest.xml file. If the file was created in pre-RTM versions of VS you might find Silverlight spelled incorrectly, like this (RuntimeType=SilverLight)
    Best,
    ---bjorn
    www.BackSpinSoftware.com - the home of 1-2-3-XAML, help engine and help authoring for WP7, SL and WP7

  • RELEVANCY SCORE 2.75

    DB:2.75:Error Code 30088-4 m7


    How can I fix problem?

    DB:2.75:Error Code 30088-4 m7

    Hello Lois,

    To help you better, provide the complete error message you receive.

    When do you face the issue, while installing or accessing the Office 2013 program?

    Follow the steps provided in the thread links given below and check if that helps to resolve the issue:

    http://answers.microsoft.com/en-us/office/forum/office_2013_release-office_install/error-code-30088-4/eabd293f-5544-4d0e-b27c-a942c729c3b5

    http://answers.microsoft.com/en-us/office/forum/office_365hp-office_install/error-code-30088-4-unable-to-install-office/2898b58c-c7eb-4dc0-bd09-f646a7141372

    For further queries, reply and we would be happy to assist.
    Thank you.

  • RELEVANCY SCORE 2.75

    DB:2.75:Unable To Install Office 2013. Error Code 30126-4 ax


    Original Title: error code 30126-4

    I am installing office Home Business 2013 on a new PC with Windows 8.1 and it will not install, citing this error code

    DB:2.75:Unable To Install Office 2013. Error Code 30126-4 ax

    Hi Hugh,

    Let me help you to download/install Office 2013 suite.
    Before we proceed with the troubleshooting I need more information:
    What is the complete error message that you receive when you try to download/install Office 2013 suite?
    Which browser are you using to download/install Office 2013 suite?
    Is the computer connected with a with a wired internet connection or a wireless internet connection?
    Change the network to a wired connection and check if you are able to download/install Office 2013 suite.

    Let us try to download/install Office 2013 suite using a different browser.
    Ensure there are no proxy server enabled on the system.

    If the issue persists, then remove Office 2013 by running the troubleshooter from the following article:
    http://support.microsoft.com/kb/2739501

    Restart the computer in Windows Clean boot following the steps from the link below and check if the issue occurs:
    http://support.microsoft.com/kb/929135/en-us
    Note: After you have finished troubleshooting in clean boot, ensure you restart the computer in normal mode.
    Now download and install Office 2013 suite by logging into
    www.office.com/myaccount
    with the registered email address and click Install Office.

    Let us know the details and hope the suggestions provided are helpful to download/install Office 2013 suite.
    Thank you.

  • RELEVANCY SCORE 2.75

    DB:2.75:I Get Error Code 300-4 Trying To Use Abc Player 3k


    Error code 300-4 How to fix with abc player

  • RELEVANCY SCORE 2.75

    DB:2.75:Rw-50004 Warning While Installation Using Rapidwiz 9a


    Hi all,

    I am installing the 11i 11.5.10.2 into a single box linux system

    I am getting the RW-50004 Warning

    and the following details:

    Error Code received while running the external process. Check log for details
    Running database driver for VIS database.

    ---------------------------------

    The log file details is as follows:

    Error while running adlnkoh.sh. Please check logfile

    Errors while running adlnkoh.sh

    There was an error while running the command - /d01/oracle/visdb/9.2.0/temp/VIS_vision/adrun9i.sh APPS APPS
    /d01/oracle/visdb/9.2.0/appsutil/install/adlnkoh.sh: line 198: /d01/oracle/visdb/9.2.0/bin/sqlplus: No such file or directory
    RW-50010: Error: - script has returned an error: 1
    RW-50004: Error code received when running external process. Check log file for details.
    Running Database Install Driver for VIS instance
    ---------------------------------

    i can find the

    /d01/oracle/visdb/9.2.0/install/make.log
    collect2: ld returned 1 exit status

    Please update...
    Many thanks in advance...

    DB:2.75:Rw-50004 Warning While Installation Using Rapidwiz 9a

    it seems a kernal parameters problme plz double check them

    fadi
    http://oracle-magic.blogspot.com

  • RELEVANCY SCORE 2.75

    DB:2.75:Installation As Restore From Backup Fails pa


    Dear all,after changing my harddisk in my iMac I want to reinstall Mac OS X using my TimeMachine Backup.I'm starting installation process from my original OS X CD's (Version 10.6.3)My Backup is from current Mountain Lion Version.After a short time installation fails with below stated report, see 10:37:35 marked bold. Does anyone knows anything what to do now?Many thanks in advance.Kind regards,RainerNov 15 10:34:16 localhost Unknown[81]: Launching the Language Chooser for an OS InstallNov 15 10:35:12 localhost configd[65]: subnet_route_if_index: can't get interface nameNov 15 10:35:13 localhost LCA[85]: Folder Manager is being asked to create a folder (cach) while running as uid 0Nov 15 10:35:19 localhost LCA[85]: Using keyboard layout 3Nov 15 10:35:24 localhost LCA[85]: Found primary language hint "de"Nov 15 10:35:30 localhost LCA[85]: Launching the Installer using language code "German"Nov 15 10:35:31 localhost OSInstaller[146]: Mac OS X Installer application startedNov 15 10:35:31 localhost OSInstaller[146]: 1 display(s) found.Nov 15 10:35:31 localhost OSInstaller[146]: Display[1] is using OpenGL acceleration.Nov 15 10:35:31 localhost OSInstaller[146]: @(#)PROGRAM:Install PROJECT:Install-580Nov 15 10:35:31 localhost OSInstaller[146]: @(#)PROGRAM:Mac OS X Installer PROJECT:OSInstaller-262Nov 15 10:35:31 localhost OSInstaller[146]: Hardware: iMac11,3 @ 2.80 GHz (x 4), 4096 MB RAMNov 15 10:35:31 localhost OSInstaller[146]: Running OS Build: Mac OS X 10.6.3 (10D2322a)Nov 15 10:35:31 localhost OSInstaller[146]: Env: DYLD_NO_FIX_PREBINDING=1Nov 15 10:35:31 localhost OSInstaller[146]: Env: PATH=/usr/bin:/bin:/usr/sbin:/sbinNov 15 10:35:31 localhost OSInstaller[146]: Env: PWD=/Nov 15 10:35:31 localhost OSInstaller[146]: Env: SHLVL=1Nov 15 10:35:31 localhost OSInstaller[146]: Env: OS_INSTALL=1Nov 15 10:35:31 localhost OSInstaller[146]: Env: _=/System/Installation/CDIS/LCA.app/Contents/MacOS/LCANov 15 10:35:34 localhost OSInstaller[146]: Using install media product at /System/Installation/PackagesNov 15 10:35:34 localhost OSInstaller[146]: Opening OSInstall package '/System/Installation/Packages/OSInstall.mpkg'.Nov 15 10:35:41 localhost OSInstaller[146]: Memory statistics for 'Mac OS X Installation' pane:Nov 15 10:35:41 localhost OSInstaller[146]: Physical Memory Allocation: 545 MB wired, 3 MB trapped, 75 MB active, 64 MB inactive, 3409 MB free, 3548 MB usable, 4096 MB totalNov 15 10:36:08 localhost OSInstaller[146]: Memory statistics for 'Backup-Quelle auswhlen' pane:Nov 15 10:36:08 localhost OSInstaller[146]: Physical Memory Allocation: 534 MB wired, 4 MB trapped, 84 MB active, 73 MB inactive, 3401 MB free, 3558 MB usable, 4096 MB totalNov 15 10:36:18 localhost OSInstaller[146]: Memory statistics for 'Backup auswhlen' pane:Nov 15 10:36:18 localhost OSInstaller[146]: Physical Memory Allocation: 535 MB wired, 5 MB trapped, 85 MB active, 75 MB inactive, 3396 MB free, 3556 MB usable, 4096 MB totalNov 15 10:36:42 localhost OSInstaller[146]: Using cached backup size 245265096704Nov 15 10:36:43 localhost OSInstaller[146]: Memory statistics for 'Zielvolume auswhlen' pane:Nov 15 10:36:43 localhost OSInstaller[146]: Physical Memory Allocation: 565 MB wired, 3 MB trapped, 88 MB active, 92 MB inactive, 3348 MB free, 3528 MB usable, 4096 MB totalNov 15 10:36:53 localhost OSInstaller[146]: Memory statistics for 'Wiederherstellen' pane:Nov 15 10:36:53 localhost OSInstaller[146]: Physical Memory Allocation: 591 MB wired, 2 MB trapped, 89 MB active, 95 MB inactive, 3319 MB free, 3503 MB usable, 4096 MB totalNov 15 10:36:53 localhost OSInstaller[146]: [RESTORE] erasing disk 'Macintosh HD'Nov 15 10:36:53 localhost OSInstaller[146]: [RESTORE] erase startedNov 15 10:37:11 localhost OSInstaller[146]: [RESTORE] erase completedNov 15 10:37:11 localhost OSInstaller[146]: Physical memory statistics immediately before turning on virtual memory backing store:Nov 15 10:37:11 localhost OSInstaller[146]: Physical Memory Allocation: 554 MB wired, 3 MB trapped, 86 MB active, 91 MB inactive, 3362 MB free, 3539 MB usable, 4096 MB totalNov 15 10:37:11 localhost OSInstaller[146]: Activated virtual memory backing store at mount point '/Volumes/Macintosh HD'Nov 15 10:37:11 localhost OSInstaller[146]: [RESTORE] started vm on target disk.Nov 15 10:37:11 localhost OSInstaller[146]: [RESTORE] ensuring permissions on /Volumes/Macintosh HDNov 15 10:37:11 localhost OSInstaller[146]: [RESTORE] restoring from: /Volumes/iMac/Backups.backupdb/iMac/2012-11-12-183717/Macintosh HDNov 15 10:37:11 localhost OSInstaller[146]: [RESTORE] restoring to: /Volumes/Macintosh HDNov 15 10:37:11 localhost OSInstaller[146]: [RESTORE] filelist: (\n ".com.apple.backupd.mvlist.plist",\n ".com.apple.timemachine.supported (vom alten Mac)",\n ".DocumentRevisions-V100",\n ".DS_Store",\n ".file",\n ".vol",\n Applications,\n bin,\n cores,\n etc,\n "Handbu\U0308cher Informationen",\n "iPodless.log",\n Library,\n "mach_kernel",\n Network,\n opt,\n sbin,\n System,\n tmp,\n Users,\n usr,\n var,\n Volumes,\n "~",\n "private/etc",\n "private/tftpboot",\n "private/tmp",\n "private/var"\n)Nov 15 10:37:12 localhost OSInstaller[146]: Constructing critical restore pathsNov 15 10:37:12 localhost OSInstaller[146]: [RESTORE] 1: restoring .com.apple.backupd.mvlist.plistNov 15 10:37:12 localhost OSInstaller[146]: from source path: /Volumes/iMac/Backups.backupdb/iMac/2012-11-12-183717/Macintosh HD/.com.apple.backupd.mvlist.plistNov 15 10:37:12 localhost OSInstaller[146]: to destination path: /Volumes/Macintosh HDNov 15 10:37:13 localhost OSInstaller[146]: [RESTORE] 2: restoring .com.apple.timemachine.supported (vom alten Mac)Nov 15 10:37:13 localhost OSInstaller[146]: from source path: /Volumes/iMac/Backups.backupdb/iMac/2012-11-12-183717/Macintosh HD/.com.apple.timemachine.supported (vom alten Mac)Nov 15 10:37:13 localhost OSInstaller[146]: to destination path: /Volumes/Macintosh HDNov 15 10:37:13 localhost OSInstaller[146]: [RESTORE] 3: restoring .DocumentRevisions-V100Nov 15 10:37:13 localhost OSInstaller[146]: from source path: /Volumes/iMac/Backups.backupdb/iMac/2012-11-12-183717/Macintosh HD/.DocumentRevisions-V100Nov 15 10:37:13 localhost OSInstaller[146]: to destination path: /Volumes/Macintosh HDNov 15 10:37:14 localhost OSInstaller[146]: [RESTORE] Error -36 while restoring /Volumes/iMac/Backups.backupdb/iMac/2012-11-12-183717/Macintosh HD/.DocumentRevisions-V100/PerUID/501/5/com.apple.documentVersions/BA945D81-E06 F-4BCD-B189-F64089A3D97F.pdf to (null)Nov 15 10:37:14 localhost OSInstaller[146]: [RESTORE] Error -36 while restoring /Volumes/iMac/Backups.backupdb/iMac/2012-11-12-183717/Macintosh HD/.DocumentRevisions-V100/PerUID/501/5/com.apple.documentVersions/DD403257-35A C-469F-B4E4-C0B7915D4D85.pdf to (null)Nov 15 10:37:14 localhost OSInstaller[146]: [RESTORE] Error -36 while restoring /Volumes/iMac/Backups.backupdb/iMac/2012-11-12-183717/Macintosh HD/.DocumentRevisions-V100/PerUID/501/6/com.apple.documentVersions/385B9FB6-FA0 0-4DE4-B279-033627796C6C.pdf to (null)Nov 15 10:37:14 localhost OSInstaller[146]: [RESTORE] Error -36 while restoring /Volumes/iMac/Backups.backupdb/iMac/2012-11-12-183717/Macintosh HD/.DocumentRevisions-V100/PerUID/501/6/com.apple.documentVersions/D4FEACB2-D2A D-4656-AA58-4D7160575D45.pdf to (null)Nov 15 10:37:14 localhost OSInstaller[146]: [RESTORE] Error -36 while restoring /Volumes/iMac/Backups.backupdb/iMac/2012-11-12-183717/Macintosh HD/.DocumentRevisions-V100/PerUID/501/7/com.apple.documentVersions/0337BF11-043 8-4132-A301-25518B387A8A.pdf to (null)Nov 15 10:37:14 localhost OSInstaller[146]: [RESTORE] 4: restoring .DS_StoreNov 15 10:37:14 localhost OSInstaller[146]: from source path: /Volumes/iMac/Backups.backupdb/iMac/2012-11-12-183717/Macintosh HD/.DS_StoreNov 15 10:37:14 localhost OSInstaller[146]: to destination path: /Volumes/Macintosh HDNov 15 10:37:14 localhost OSInstaller[146]: [RESTORE] 5: restoring .fileNov 15 10:37:14 localhost OSInstaller[146]: from source path: /Volumes/iMac/Backups.backupdb/iMac/2012-11-12-183717/Macintosh HD/.fileNov 15 10:37:14 localhost OSInstaller[146]: to destination path: /Volumes/Macintosh HDNov 15 10:37:14 localhost OSInstaller[146]: [RESTORE] 6: restoring .volNov 15 10:37:14 localhost OSInstaller[146]: from source path: /Volumes/iMac/Backups.backupdb/iMac/2012-11-12-183717/Macintosh HD/.volNov 15 10:37:14 localhost OSInstaller[146]: to destination path: /Volumes/Macintosh HDNov 15 10:37:14 localhost OSInstaller[146]: [RESTORE] 7: restoring ApplicationsNov 15 10:37:14 localhost OSInstaller[146]: from source path: /Volumes/iMac/Backups.backupdb/iMac/2012-11-12-183717/Macintosh HD/ApplicationsNov 15 10:37:14 localhost OSInstaller[146]: to destination path: /Volumes/Macintosh HDNov 15 10:37:35 localhost Unknown[87]: 2012-11-15 10:37:35.556 Mac OS X Installer[146:9f47] CFPropertyListCreateFromXMLData(): Old-style plist parser: missing semicolon in dictionary.Nov 15 10:47:44 localhost LCA[85]: Child exited with status 11Nov 15 10:47:45 localhost Unknown[199]: Launching the Installer Crash Log ViewerNov 15 10:48:26 localhost ReportCrash[198]: Process: Mac OS X Installer [146]Nov 15 10:48:26 localhost ReportCrash[198]: Path: /System/Installation/CDIS/Mac OS X Installer.app/Contents/MacOS/Mac OS X InstallerNov 15 10:48:26 localhost ReportCrash[198]: Identifier: Mac OS X InstallerNov 15 10:48:26 localhost ReportCrash[198]: Version: ??? (???)Nov 15 10:48:26 localhost ReportCrash[198]: Code Type: X86-64 (Native)Nov 15 10:48:26 localhost ReportCrash[198]: Parent Process: LCA [85]Nov 15 10:48:26 localhost ReportCrash[198]: Nov 15 10:48:26 localhost ReportCrash[198]: Date/Time: 2012-11-15 10:47:15.029 -0800Nov 15 10:48:26 localhost ReportCrash[198]: OS Version: Mac OS X 10.6.3 (10D2322a)Nov 15 10:48:26 localhost ReportCrash[198]: Report Version: 6Nov 15 10:48:26 localhost ReportCrash[198]: Nov 15 10:48:26 localhost ReportCrash[198]: Exception Type: EXC_BAD_ACCESS (SIGSEGV)Nov 15 10:48:26 localhost ReportCrash[198]: Exception Codes: KERN_INVALID_ADDRESS at 0x0000000000000000Nov 15 10:48:26 localhost ReportCrash[198]: Crashed Thread: 0 Dispatch queue: com.apple.main-threadNov 15 10:48:26 localhost ReportCrash[198]: Nov 15 10:48:26 localhost ReportCrash[198]: Application Specific Information:Nov 15 10:48:26 localhost ReportCrash[198]: objc_msgSend() selector name: releaseNov 15 10:48:26 localhost ReportCrash[198]: Nov 15 10:48:26 localhost ReportCrash[198]: Nov 15 10:48:26 localhost ReportCrash[198]: Thread 0 Crashed: Dispatch queue: com.apple.main-threadNov 15 10:48:26 localhost ReportCrash[198]: 0 libobjc.A.dylib 0x0000000100583120 objc_msgSend + 44Nov 15 10:48:26 localhost ReportCrash[198]: 1 com.apple.CoreFoundation 0x000000010067cd56 _CFAutoreleasePoolPop + 230Nov 15 10:48:26 localhost ReportCrash[198]: 2 com.apple.Foundation 0x00000001008ff308 -[NSAutoreleasePool drain] + 158Nov 15 10:48:26 localhost ReportCrash[198]: 3 com.apple.AppKit 0x0000000100cdb187 -[NSApplication run] + 543Nov 15 10:48:26 localhost ReportCrash[198]: 4 com.apple.AppKit 0x0000000100cd3e14 NSApplicationMain + 364Nov 15 10:48:26 localhost ReportCrash[198]: 5 com.apple.MacOSXInstaller 0x00000001000048de 0x100000000 + 18654Nov 15 10:48:26 localhost ReportCrash[198]: 6 com.apple.MacOSXInstaller 0x0000000100001540 0x100000000 + 5440Nov 15 10:48:26 localhost ReportCrash[198]: Nov 15 10:48:26 localhost ReportCrash[198]: Thread 1:Nov 15 10:48:26 localhost ReportCrash[198]: 0 libSystem.B.dylib 0x0000000100368eb6 __semwait_signal + 10Nov 15 10:48:26 localhost ReportCrash[198]: 1 libSystem.B.dylib 0x0000000100368d45 nanosleep + 148Nov 15 10:48:26 localhost ReportCrash[198]: 2 libSystem.B.dylib 0x00000001003b5b14 sleep + 61Nov 15 10:48:26 localhost ReportCrash[198]: 3 com.apple.installframework 0x00000001000b8413 do_log_watch + 53Nov 15 10:48:26 localhost ReportCrash[198]: 4 libSystem.B.dylib 0x0000000100367456 _pthread_start + 331Nov 15 10:48:26 localhost ReportCrash[198]: 5 libSystem.B.dylib 0x0000000100367309 thread_start + 13Nov 15 10:48:26 localhost ReportCrash[198]: Nov 15 10:48:26 localhost ReportCrash[198]: Thread 2: Dispatch queue: com.apple.libdispatch-managerNov 15 10:48:26 localhost ReportCrash[198]: 0 libSystem.B.dylib 0x000000010034708a kevent + 10Nov 15 10:48:26 localhost ReportCrash[198]: 1 libSystem.B.dylib 0x0000000100348f5d _dispatch_mgr_invoke + 154Nov 15 10:48:26 localhost ReportCrash[198]: 2 libSystem.B.dylib 0x0000000100348c34 _dispatch_queue_invoke + 185Nov 15 10:48:26 localhost ReportCrash[198]: 3 libSystem.B.dylib 0x000000010034875e _dispatch_worker_thread2 + 252Nov 15 10:48:26 localhost ReportCrash[198]: 4 libSystem.B.dylib 0x0000000100348088 _pthread_wqthread + 353Nov 15 10:48:26 localhost ReportCrash[198]: 5 libSystem.B.dylib 0x0000000100347f25 start_wqthread + 13Nov 15 10:48:26 localhost ReportCrash[198]: Nov 15 10:48:26 localhost ReportCrash[198]: Thread 3:Nov 15 10:48:26 localhost ReportCrash[198]: 0 libSystem.B.dylib 0x000000010032e2fa mach_msg_trap + 10Nov 15 10:48:26 localhost ReportCrash[198]: 1 libSystem.B.dylib 0x000000010032e96d mach_msg + 59Nov 15 10:48:26 localhost ReportCrash[198]: 2 com.apple.CoreFoundation 0x0000000100694452 __CFRunLoopRun + 1698Nov 15 10:48:26 localhost ReportCrash[198]: 3 com.apple.CoreFoundation 0x00000001006938df CFRunLoopRunSpecific + 575Nov 15 10:48:26 localhost ReportCrash[198]: 4 com.apple.Foundation 0x00000001009694df +[NSURLConnection(NSURLConnectionReallyInternal) _resourceLoadLoop:] + 297Nov 15 10:48:26 localhost ReportCrash[198]: 5 com.apple.Foundation 0x00000001008e9ea9 __NSThread__main__ + 1429Nov 15 10:48:26 localhost ReportCrash[198]: 6 libSystem.B.dylib 0x0000000100367456 _pthread_start + 331Nov 15 10:48:26 localhost ReportCrash[198]: 7 libSystem.B.dylib 0x0000000100367309 thread_start + 13Nov 15 10:48:26 localhost ReportCrash[198]: Nov 15 10:48:26 localhost ReportCrash[198]: Thread 4:Nov 15 10:48:26 localhost ReportCrash[198]: 0 libSystem.B.dylib 0x000000010032e35a semaphore_timedwait_signal_trap + 10Nov 15 10:48:26 localhost ReportCrash[198]: 1 libSystem.B.dylib 0x000000010036cbc2 _pthread_cond_wait + 1015Nov 15 10:48:26 localhost ReportCrash[198]: 2 com.apple.Foundation 0x0000000100923d73 -[NSCondition waitUntilDate:] + 399Nov 15 10:48:26 localhost ReportCrash[198]: 3 com.apple.Foundation 0x00000001009170c2 -[NSConditionLock lockWhenCondition:beforeDate:] + 238Nov 15 10:48:26 localhost ReportCrash[198]: 4 com.apple.installframework 0x000000010008ce71 -[IFSession(Jobs) _runMetaQueueEngine] + 88Nov 15 10:48:26 localhost ReportCrash[198]: 5 com.apple.Foundation 0x00000001008e9ea9 __NSThread__main__ + 1429Nov 15 10:48:26 localhost ReportCrash[198]: 6 libSystem.B.dylib 0x0000000100367456 _pthread_start + 331Nov 15 10:48:26 localhost ReportCrash[198]: 7 libSystem.B.dylib 0x0000000100367309 thread_start + 13Nov 15 10:48:26 localhost ReportCrash[198]: Nov 15 10:48:26 localhost ReportCrash[198]: Thread 5: JavaScriptCore: FastMalloc scavengerNov 15 10:48:26 localhost ReportCrash[198]: 0 libSystem.B.dylib 0x0000000100368eb6 __semwait_signal + 10Nov 15 10:48:26 localhost ReportCrash[198]: 1 libSystem.B.dylib 0x0000000100368d45 nanosleep + 148Nov 15 10:48:26 localhost ReportCrash[198]: 2 libSystem.B.dylib 0x00000001003b5b14 sleep + 61Nov 15 10:48:26 localhost ReportCrash[198]: 3 com.apple.JavaScriptCore 0x0000000103573380 ***::TCMalloc_PageHeap::scavengerThread() + 96Nov 15 10:48:26 localhost ReportCrash[198]: 4 com.apple.JavaScriptCore 0x0000000103573569 ***::TCMalloc_PageHeap::runScavengerThread(void*) + 9Nov 15 10:48:26 localhost ReportCrash[198]: 5 libSystem.B.dylib 0x0000000100367456 _pthread_start + 331Nov 15 10:48:26 localhost ReportCrash[198]: 6 libSystem.B.dylib 0x0000000100367309 thread_start + 13Nov 15 10:48:26 localhost ReportCrash[198]: Nov 15 10:48:26 localhost ReportCrash[198]: Thread 6:Nov 15 10:48:26 localhost ReportCrash[198]: 0 libSystem.B.dylib 0x000000010032e35a semaphore_timedwait_signal_trap + 10Nov 15 10:48:26 localhost ReportCrash[198]: 1 libSystem.B.dylib 0x000000010036cbc2 _pthread_cond_wait + 1015Nov 15 10:48:26 localhost ReportCrash[198]: 2 com.apple.Foundation 0x0000000100923d73 -[NSCondition waitUntilDate:] + 399Nov 15 10:48:26 localhost ReportCrash[198]: 3 com.apple.Foundation 0x00000001009170c2 -[NSConditionLock lockWhenCondition:beforeDate:] + 238Nov 15 10:48:26 localhost ReportCrash[198]: 4 com.apple.installframework 0x000000010007de77 +[IFDTargetController(WorkerThread) _handleTargetRequests] + 774Nov 15 10:48:26 localhost ReportCrash[198]: 5 com.apple.Foundation 0x00000001008e9ea9 __NSThread__main__ + 1429Nov 15 10:48:26 localhost ReportCrash[198]: 6 libSystem.B.dylib 0x0000000100367456 _pthread_start + 331Nov 15 10:48:26 localhost ReportCrash[198]: 7 libSystem.B.dylib 0x0000000100367309 thread_start + 13Nov 15 10:48:26 localhost ReportCrash[198]: Nov 15 10:48:26 localhost ReportCrash[198]: Thread 7:Nov 15 10:48:26 localhost ReportCrash[198]: 0 libSystem.B.dylib 0x0000000100368eb6 __semwait_signal + 10Nov 15 10:48:26 localhost ReportCrash[198]: 1 libSystem.B.dylib 0x0000000100368d45 nanosleep + 148Nov 15 10:48:26 localhost ReportCrash[198]: 2 com.apple.Foundation 0x000000010096ef4c +[NSThread sleepForTimeInterval:] + 101Nov 15 10:48:26 localhost ReportCrash[198]: 3 com.apple.SystemMigration 0x0000000101dd9750 -[SMManager _suppressSpotlightThread:] + 104Nov 15 10:48:26 localhost ReportCrash[198]: 4 com.apple.Foundation 0x00000001008e9ea9 __NSThread__main__ + 1429Nov 15 10:48:26 localhost ReportCrash[198]: 5 libSystem.B.dylib 0x0000000100367456 _pthread_start + 331Nov 15 10:48:26 localhost ReportCrash[198]: 6 libSystem.B.dylib 0x0000000100367309 thread_start + 13Nov 15 10:48:26 localhost ReportCrash[198]: Nov 15 10:48:26 localhost ReportCrash[198]: Thread 8:Nov 15 10:48:26 localhost ReportCrash[198]: 0 libSystem.B.dylib 0x0000000100371dce select$DARWIN_EXTSN + 10Nov 15 10:48:26 localhost ReportCrash[198]: 1 com.apple.CoreFoundation 0x00000001006b5ef2 __CFSocketManager + 818Nov 15 10:48:26 localhost ReportCrash[198]: 2 libSystem.B.dylib 0x0000000100367456 _pthread_start + 331Nov 15 10:48:26 localhost ReportCrash[198]: 3 libSystem.B.dylib 0x0000000100367309 thread_start + 13Nov 15 10:48:26 localhost ReportCrash[198]: Nov 15 10:48:26 localhost ReportCrash[198]: Thread 9:Nov 15 10:48:26 localhost ReportCrash[198]: 0 libSystem.B.dylib 0x000000010036ff3a pread + 10Nov 15 10:48:26 localhost ReportCrash[198]: 1 com.apple.DesktopServices 0x0000000105c48bf9 TCopyReader::ReadDataFork() + 187Nov 15 10:48:26 localhost ReportCrash[198]: 2 com.apple.DesktopServices 0x0000000105c49df5 TCopyReader::Read(unsigned long long, TCountedPtrTCFURLInfo const, TCountedPtrTCFURLInfo const) + 161Nov 15 10:48:26 localhost ReportCrash[198]: 3 com.apple.DesktopServices 0x0000000105c34b13 TFSCopyOperation::CopyToTarget() + 607Nov 15 10:48:26 localhost ReportCrash[198]: 4 com.apple.DesktopServices 0x0000000105c3698b TFSCopyOperation::DoCopy(TCountedPtrTCFURLInfo const) + 595Nov 15 10:48:26 localhost ReportCrash[198]: 5 com.apple.DesktopServices 0x0000000105c2c706 _NodeOperation + 469Nov 15 10:48:26 localhost ReportCrash[198]: 6 ...ple.CoreServices.CarbonCore 0x0000000102b7f5db _FSFileOperationOperate + 438Nov 15 10:48:26 localhost ReportCrash[198]: 7 libSystem.B.dylib 0x0000000100367456 _pthread_start + 331Nov 15 10:48:26 localhost ReportCrash[198]: 8 libSystem.B.dylib 0x0000000100367309 thread_start + 13Nov 15 10:48:26 localhost ReportCrash[198]: Nov 15 10:48:26 localhost ReportCrash[198]: Thread 10:Nov 15 10:48:26 localhost ReportCrash[198]: 0 libSystem.B.dylib 0x0000000100368eb6 __semwait_signal + 10Nov 15 10:48:26 localhost ReportCrash[198]: 1 libSystem.B.dylib 0x000000010036ccd1 _pthread_cond_wait + 1286Nov 15 10:48:26 localhost ReportCrash[198]: 2 ...ple.CoreServices.CarbonCore 0x0000000102bc860f TSWaitOnCondition + 118Nov 15 10:48:26 localhost ReportCrash[198]: 3 ...ple.CoreServices.CarbonCore 0x0000000102b37e0c TSWaitOnConditionTimedRelative + 177Nov 15 10:48:26 localhost ReportCrash[198]: 4 ...ple.CoreServices.CarbonCore 0x0000000102b31d17 MPWaitOnQueue + 215Nov 15 10:48:26 localhost ReportCrash[198]: 5 com.apple.DesktopServices 0x0000000105c46f2e TCopyQueue::Dequeue() + 54Nov 15 10:48:26 localhost ReportCrash[198]: 6 com.apple.DesktopServices 0x0000000105c4c668 TCopyWriter::WriteDataFork() + 250Nov 15 10:48:26 localhost ReportCrash[198]: 7 com.apple.DesktopServices 0x0000000105c4d520 TCopyWriter::Write() + 158Nov 15 10:48:26 localhost ReportCrash[198]: 8 com.apple.DesktopServices 0x0000000105c4d79e TCopyWriter::WriteTaskProc(void*) + 72Nov 15 10:48:26 localhost ReportCrash[198]: 9 ...ple.CoreServices.CarbonCore 0x0000000102b0a009 PrivateMPEntryPoint + 63Nov 15 10:48:26 localhost ReportCrash[198]: 10 libSystem.B.dylib 0x0000000100367456 _pthread_start + 331Nov 15 10:48:26 localhost ReportCrash[198]: 11 libSystem.B.dylib 0x0000000100367309 thread_start + 13Nov 15 10:48:26 localhost ReportCrash[198]: Nov 15 10:48:26 localhost ReportCrash[198]: Thread 0 crashed with X86 Thread State (64-bit):Nov 15 10:48:26 localhost ReportCrash[198]: rax: 0x000000010783ce00 rbx: 0x000000011e6fbb00 rcx: 0x000000011e6fbab0 rdx: 0x0000000000000000Nov 15 10:48:26 localhost ReportCrash[198]: rdi: 0x000000011e6fbb00 rsi: 0x00000001005997e2 rbp: 0x00007fff5fbffa70 rsp: 0x00007fff5fbffa38Nov 15 10:48:26 localhost ReportCrash[198]: r8: 0x0000000000000000 r9: 0x000000012072cd40 r10: 0x00000001206c9d80 r11: 0x000000011e6fbab0Nov 15 10:48:26 localhost ReportCrash[198]: r12: 0x0000000107852a00 r13: 0x0000000107852a00 r14: 0x00000001007f43a0 r15: 0x0000000000000000Nov 15 10:48:26 localhost ReportCrash[198]: rip: 0x0000000100583120 rfl: 0x0000000000010206 cr2: 0x0000000000000000Nov 15 10:48:26 localhost ReportCrash[198]: Nov 15 10:48:26 localhost ReportCrash[198]: Binary Images:Nov 15 10:48:26 localhost ReportCrash[198]: 0x100000000 - 0x10000efff com.apple.MacOSXInstaller 230.1.1 (262) 990CB5E5-76A8-EC2B-E004-5F566553000C /System/Installation/CDIS/Mac OS X Installer.app/Contents/MacOS/Mac OS X InstallerNov 15 10:48:26 localhost ReportCrash[198]: 0x100018000 - 0x10003cfff com.apple.osinstallframework 518.1.2 (580) F9DA8A6F-26B0-41CC-9290-7F2CC0C278AC /System/Library/PrivateFrameworks/Install.framework/Frameworks/OSInstall.framew ork/Versions/A/OSInstallNov 15 10:48:26 localhost ReportCrash[198]: 0x10005a000 - 0x10005aff7 com.apple.Cocoa 6.6 (???) C69E895A-1C66-3DA9-5F63-8BE85DB9C4E1 /System/Library/Frameworks/Cocoa.framework/Versions/A/CocoaNov 15 10:48:26 localhost ReportCrash[198]: 0x10005d000 - 0x100068ff7 com.apple.framework.Assistant 1.6.0 (14) 123B4B11-5010-E6CB-1A30-F1682ADC9D7D /System/Library/PrivateFrameworks/Assistant.framework/Versions/A/AssistantNov 15 10:48:26 localhost ReportCrash[198]: 0x100075000 - 0x100139fff com.apple.installframework 518.1.2 (580) 7E077B14-EE5C-5EC1-C22C-3B82DDD1A312 /System/Library/PrivateFrameworks/Install.framework/Versions/A/InstallNov 15 10:48:26 localhost ReportCrash[198]: 0x1001ba000 - 0x1001d2ff7 com.apple.InstallerPlugins 4.0 (430.1) 36397131-FA5D-211E-570F-2C8E93E1A845 /System/Library/Frameworks/InstallerPlugins.framework/Versions/A/InstallerPlugi nsNov 15 10:48:26 localhost ReportCrash[198]: 0x1001e8000 - 0x100229fff com.apple.SystemConfiguration 1.10.2 (1.10.2) C86D8BD3-B4C7-2C15-05EB-E8B7F8FA7F14 /System/Library/Frameworks/SystemConfiguration.framework/Versions/A/SystemConfi gurationNov 15 10:48:26 localhost ReportCrash[198]: 0x10024d000 - 0x1002abff7 com.apple.framework.IOKit 2.0 (???) A5C63ACA-8159-36EC-384B-49047CB6940C /System/Library/Frameworks/IOKit.framework/Versions/A/IOKitNov 15 10:48:26 localhost ReportCrash[198]: 0x1002cd000 - 0x1002d3ff7 com.apple.DiskArbitration 2.3 (2.3) AAB5CC56-334A-3C60-3C27-54E8F34D754E /System/Library/Frameworks/DiskArbitration.framework/Versions/A/DiskArbitrationNov 15 10:48:26 localhost ReportCrash[198]: 0x1002dc000 - 0x100311ff7 com.apple.DiskManagement 3.3 (354) B5FFE5D8-EDC2-FB4D-5E25-8D4027AC1B00 /System/Library/PrivateFrameworks/DiskManagement.framework/Versions/A/DiskManag ementNov 15 10:48:26 localhost ReportCrash[198]: 0x10032d000 - 0x1004edfef libSystem.B.dylib 125.2.0 (compatibility 1.0.0) 39D14F74-5D42-5807-1DBD-18DBEF1F9E46 /usr/lib/libSystem.B.dylibNov 15 10:48:26 localhost ReportCrash[198]: 0x10057e000 - 0x100634fff libobjc.A.dylib 227.0.0 (compatibility 1.0.0) 1960E662-D35C-5D98-EB16-D43166AE6A22 /usr/lib/libobjc.A.dylibNov 15 10:48:26 localhost ReportCrash[198]: 0x100648000 - 0x1007bdfef com.apple.CoreFoundation 6.6.1 (550.19) 47D9567E-1D29-80CD-C9B4-761BCD7261FB /System/Library/Frameworks/CoreFoundation.framework/Versions/A/CoreFoundationNov 15 10:48:26 localhost ReportCrash[198]: 0x1008d6000 - 0x1008d6ff7 com.apple.ApplicationServices 38 (38) 0E2FC75E-2BE2-D04D-CA78-76E38A89DD30 /System/Library/Frameworks/ApplicationServices.framework/Versions/A/Application ServicesNov 15 10:48:26 localhost ReportCrash[198]: 0x1008d9000 - 0x100b5afe7 com.apple.Foundation 6.6.2 (751.21) 56F582C4-EDF6-F6E6-B03D-1E306A9B5110 /System/Library/Frameworks/Foundation.framework/Versions/C/FoundationNov 15 10:48:26 localhost ReportCrash[198]: 0x100cd2000 - 0x1016c7fe7 com.apple.AppKit 6.6.5 (1038.29) AFE260A6-8FA6-030C-2BC9-E2A468999D71 /System/Library/Frameworks/AppKit.framework/Versions/C/AppKitNov 15 10:48:26 localhost ReportCrash[198]: 0x101cbc000 - 0x101cf1fef com.apple.framework.Apple80211 6.2.3 (623.1) F84FD70E-E432-1B1F-532C-79303ADE76C9 /System/Library/PrivateFrameworks/Apple80211.framework/Versions/A/Apple80211Nov 15 10:48:26 localhost ReportCrash[198]: 0x101d05000 - 0x101d3ffff com.apple.bom 10.0 (164) 316D9EB3-6D33-6E57-F63A-BA4DCFCE9941 /System/Library/PrivateFrameworks/Bom.framework/Versions/A/BomNov 15 10:48:26 localhost ReportCrash[198]: 0x101d4f000 - 0x101d9dfe7 com.apple.PackageKit 1.0.2 (73) FFCC5D88-BED9-A1F2-7364-2C5F5E6FCDAF /System/Library/PrivateFrameworks/PackageKit.framework/Versions/A/PackageKitNov 15 10:48:26 localhost ReportCrash[198]: 0x101dd3000 - 0x101e7bfe7 com.apple.SystemMigration 300.3 (373) E823F09F-943A-D3F5-3A93-8AB42645C23F /System/Library/PrivateFrameworks/SystemMigration.framework/Versions/A/SystemMi grationNov 15 10:48:26 localhost ReportCrash[198]: 0x102069000 - 0x102069ff7 com.apple.CoreServices 44 (44) 616722B1-5E79-DCCF-BF5E-0DD5802CCBD9 /System/Library/Frameworks/CoreServices.framework/Versions/A/CoreServicesNov 15 10:48:26 localhost ReportCrash[198]: 0x10206c000 - 0x10207bfff libxar.1.dylib ??? (???) B0FB9448-F310-C656-215D-2F5FB993B61A /usr/lib/libxar.1.dylibNov 15 10:48:26 localhost ReportCrash[198]: 0x102083000 - 0x102308fef com.apple.security 6.1.1 (37594) 9E77A468-2140-9C5D-B5EF-76C51C857D4A /System/Library/Frameworks/Security.framework/Versions/A/SecurityNov 15 10:48:26 localhost ReportCrash[198]: 0x1023fe000 - 0x10240fff7 libz.1.dylib 1.2.3 (compatibility 1.0.0) 5BAFAE5C-2307-C27B-464D-582A10A6990B /usr/lib/libz.1.dylibNov 15 10:48:26 localhost ReportCrash[198]: 0x102414000 - 0x102422ff7 libkxld.dylib ??? (???) 7E91FA6A-6E0C-F595-FF31-80D0BD5804FC /usr/lib/system/libkxld.dylibNov 15 10:48:26 localhost ReportCrash[198]: 0x102426000 - 0x102472fff libauto.dylib ??? (???) 9B1DB6E8-4D79-B79C-D9EC-85592478F632 /usr/lib/libauto.dylibNov 15 10:48:26 localhost ReportCrash[198]: 0x10247f000 - 0x10263dfff libicucore.A.dylib 40.0.0 (compatibility 1.0.0) 3D9313BF-97A4-6B65-E583-F6173E64C3C2 /usr/lib/libicucore.A.dylibNov 15 10:48:26 localhost ReportCrash[198]: 0x1026ac000 - 0x102729fef libstdc++.6.dylib 7.9.0 (compatibility 7.0.0) 35ECA411-2C08-FD7D-11B1-1B7A04921A5C /usr/lib/libstdc++.6.dylibNov 15 10:48:26 localhost ReportCrash[198]: 0x10278a000 - 0x10278eff7 libmathCommon.A.dylib 315.0.0 (compatibility 1.0.0) 95718673-FEEE-B6ED-B127-BCDBDB60D4E5 /usr/lib/system/libmathCommon.A.dylibNov 15 10:48:26 localhost ReportCrash[198]: 0x102791000 - 0x10284afff libsqlite3.dylib 9.6.0 (compatibility 9.0.0) 73E3FA58-51C0-ED7B-C5EB-E8F62AED386B /usr/lib/libsqlite3.dylibNov 15 10:48:26 localhost ReportCrash[198]: 0x10285a000 - 0x102867ff7 com.apple.AppleFSCompression 24.3 (1.0) B1FFA9F9-9473-9EEB-D446-44330652D6A8 /System/Library/PrivateFrameworks/AppleFSCompression.framework/Versions/A/Apple FSCompressionNov 15 10:48:26 localhost ReportCrash[198]: 0x10286f000 - 0x10287bfff libbz2.1.0.dylib 1.0.5 (compatibility 1.0.0) ECA200F9-9C46-579A-6447-16B8BFB93D96 /usr/lib/libbz2.1.0.dylibNov 15 10:48:26 localhost ReportCrash[198]: 0x102880000 - 0x102997fef libxml2.2.dylib 10.3.0 (compatibility 10.0.0) AFE91118-DBF3-6313-37B8-8A2002C6A46B /usr/lib/libxml2.2.dylibNov 15 10:48:26 localhost ReportCrash[198]: 0x1029c0000 - 0x102a90fff com.apple.CFNetwork 454.9.4 (454.9.4) D872444D-8A84-1583-4633-767CE10DB4BA /System/Library/Frameworks/CoreServices.framework/Versions/A/Frameworks/CFNetwo rk.framework/Versions/A/CFNetworkNov 15 10:48:26 localhost ReportCrash[198]: 0x102b03000 - 0x102e36fef com.apple.CoreServices.CarbonCore 861.6 (861.8) 8622D612-E3BE-C4E9-3253-129790E77F2E /System/Library/Frameworks/CoreServices.framework/Versions/A/Frameworks/CarbonC ore.framework/Versions/A/CarbonCoreNov 15 10:48:26 localhost ReportCrash[198]: 0x102eaf000 - 0x102ef9ff7 com.apple.Metadata 10.6.3 (507.8) CABBB8CF-AB18-1C01-DBF7-ADE002967249 /System/Library/Frameworks/CoreServices.framework/Versions/A/Frameworks/Metadat a.framework/Versions/A/MetadataNov 15 10:48:26 localhost ReportCrash[198]: 0x102f23000 - 0x102fe0ff7 com.apple.CoreServices.OSServices 357 (357) 8D588EB3-92CC-3DB8-61E7-637CECCF7688 /System/Library/Frameworks/CoreServices.framework/Versions/A/Frameworks/OSServi ces.framework/Versions/A/OSServicesNov 15 10:48:26 localhost ReportCrash[198]: 0x10303a000 - 0x1030cafff com.apple.SearchKit 1.3.0 (1.3.0) 45BA1053-9196-3C2F-2421-AFF5E09627CC /System/Library/Frameworks/CoreServices.framework/Versions/A/Frameworks/SearchK it.framework/Versions/A/SearchKitNov 15 10:48:26 localhost ReportCrash[198]: 0x103108000 - 0x103143fff com.apple.AE 496.4 (496.4) CB905496-4D6B-F26A-399D-840D26DBEE5B /System/Library/Frameworks/CoreServices.framework/Versions/A/Frameworks/AE.fram ework/Versions/A/AENov 15 10:48:26 localhost ReportCrash[198]: 0x10315d000 - 0x1031fdfff com.apple.LaunchServices 362.1 (362.1) CC3BE120-AF3C-FE7E-342D-EB2A208AE20E /System/Library/Frameworks/CoreServices.framework/Versions/A/Frameworks/LaunchS ervices.framework/Versions/A/LaunchServicesNov 15 10:48:26 localhost ReportCrash[198]: 0x103243000 - 0x10326bfff com.apple.DictionaryServices 1.1.1 (1.1.1) FBE782D5-F5F5-DA3B-EE10-8D6B24BD6C03 /System/Library/Frameworks/CoreServices.framework/Versions/A/Frameworks/Diction aryServices.framework/Versions/A/DictionaryServicesNov 15 10:48:26 localhost ReportCrash[198]: 0x103285000 - 0x10329bfef libbsm.0.dylib ??? (???) 0321D32C-9FE1-3919-E03E-2530A0C1191B /usr/lib/libbsm.0.dylibNov 15 10:48:26 localhost ReportCrash[198]: 0x1032a4000 - 0x1032b3fff com.apple.NetFS 3.2.1 (3.2.1) DE59FB56-8536-9999-352A-2016ADCF4FCF /System/Library/Frameworks/NetFS.framework/Versions/A/NetFSNov 15 10:48:26 localhost ReportCrash[198]: 0x1032bc000 - 0x1032e7ff7 libxslt.1.dylib 3.24.0 (compatibility 3.0.0) 6589F0FC-41DB-8494-CA8B-487F4E328EB9 /usr/lib/libxslt.1.dylibNov 15 10:48:26 localhost ReportCrash[198]: 0x1032f2000 - 0x103401fe7 libcrypto.0.9.8.dylib 0.9.8 (compatibility 0.9.8) 804D3424-EB13-4E87-D721-3A0511110A95 /usr/lib/libcrypto.0.9.8.dylibNov 15 10:48:26 localhost ReportCrash[198]: 0x103466000 - 0x1035ecfe7 com.apple.JavaScriptCore 6531.22 (6531.22.5) AF2C47DA-4E57-5EC2-8F51-9827C802CFFA /System/Library/Frameworks/JavaScriptCore.framework/Versions/A/JavaScriptCoreNov 15 10:48:26 localhost ReportCrash[198]: 0x103657000 - 0x103658ff7 com.apple.TrustEvaluationAgent 1.1 (1) A91CE5B9-3C63-5F8C-5052-95CCAB866F72 /System/Library/PrivateFrameworks/TrustEvaluationAgent.framework/Versions/A/Tru stEvaluationAgentNov 15 10:48:26 localhost ReportCrash[198]: 0x10365c000 - 0x103667fff com.apple.CrashReporterSupport 10.6.3 (250) C6ADB9F6-5BC8-C45F-2FD4-35AE42367975 /System/Library/PrivateFrameworks/CrashReporterSupport.framework/Versions/A/Cra shReporterSupportNov 15 10:48:26 localhost ReportCrash[198]: 0x103674000 - 0x103d71067 com.apple.CoreGraphics 1.544.1 (???) 4CFF2265-A2DF-CA9E-9DFB-1F044276A9BB /System/Library/Frameworks/ApplicationServices.framework/Versions/A/Frameworks/ CoreGraphics.framework/Versions/A/CoreGraphicsNov 15 10:48:26 localhost ReportCrash[198]: 0x103e63000 - 0x10401dfff com.apple.ImageIO.framework 3.0.2 (3.0.1) 4178D2C4-CD81-564A-DCB8-EEB52EF56C12 /System/Library/Frameworks/ApplicationServices.framework/Versions/A/Frameworks/ ImageIO.framework/Versions/A/ImageIONov 15 10:48:26 localhost ReportCrash[198]: 0x104083000 - 0x104101fff com.apple.CoreText 3.1.0 (???) E83F0CB9-B937-FE97-A6B3-9466BA560C8B /System/Library/Frameworks/ApplicationServices.framework/Versions/A/Frameworks/ CoreText.framework/Versions/A/CoreTextNov 15 10:48:26 localhost ReportCrash[198]: 0x10413f000 - 0x1041d9fff com.apple.ApplicationServices.ATS 4.2 (???) 9A9A4671-D498-7C1F-7DBD-3FE4B1A2A276 /System/Library/Frameworks/ApplicationServices.framework/Versions/A/Frameworks/ ATS.framework/Versions/A/ATSNov 15 10:48:26 localhost ReportCrash[198]: 0x104202000 - 0x1042b7fe7 com.apple.ColorSync 4.6.3 (4.6.3) 412C460A-C792-5A15-FD42-1FBE20FC4E3F /System/Library/Frameworks/ApplicationServices.framework/Versions/A/Frameworks/ ColorSync.framework/Versions/A/ColorSyncNov 15 10:48:26 localhost ReportCrash[198]: 0x1042f4000 - 0x104345fe7 com.apple.HIServices 1.8.0 (???) 2D0D9100-B712-ED4B-7622-BBA92053F446 /System/Library/Frameworks/ApplicationServices.framework/Versions/A/Frameworks/ HIServices.framework/Versions/A/HIServicesNov 15 10:48:26 localhost ReportCrash[198]: 0x104371000 - 0x104386ff7 com.apple.LangAnalysis 1.6.6 (1.6.6) 8327481D-1C88-4085-2F74-72CD92196120 /System/Library/Frameworks/ApplicationServices.framework/Versions/A/Frameworks/ LangAnalysis.framework/Versions/A/LangAnalysisNov 15 10:48:26 localhost ReportCrash[198]: 0x104394000 - 0x104419fff com.apple.print.framework.PrintCore 6.2 (312.5) 2BA9CEF6-CCF4-6719-9642-E9667F815C66 /System/Library/Frameworks/ApplicationServices.framework/Versions/A/Frameworks/ PrintCore.framework/Versions/A/PrintCoreNov 15 10:48:26 localhost ReportCrash[198]: 0x10444f000 - 0x104490fef com.apple.QD 3.35 (???) 6B7D6A89-2578-5C40-C0DE-A5BCB0AA6FD8 /System/Library/Frameworks/ApplicationServices.framework/Versions/A/Frameworks/ QD.framework/Versions/A/QDNov 15 10:48:26 localhost ReportCrash[198]: 0x1044a8000 - 0x1044bcff7 com.apple.speech.synthesis.framework 3.10.35 (3.10.35) 574C1BE0-5E5E-CCAF-06F8-92A69CB2892D /System/Library/Frameworks/ApplicationServices.framework/Versions/A/Frameworks/ SpeechSynthesis.framework/Versions/A/SpeechSynthesisNov 15 10:48:26 localhost ReportCrash[198]: 0x1044cd000 - 0x1044cdff7 com.apple.Accelerate 1.6 (Accelerate 1.6) 15DF8B4A-96B2-CB4E-368D-DEC7DF6B62BB /System/Library/Frameworks/Accelerate.framework/Versions/A/AccelerateNov 15 10:48:26 localhost ReportCrash[198]: 0x1044d0000 - 0x10451ffef libTIFF.dylib ??? (???) 8A8AF1CB-80E6-1457-E52A-1271733CBF7E /System/Library/Frameworks/ApplicationServices.framework/Versions/A/Frameworks/ ImageIO.framework/Versions/A/Resources/libTIFF.dylibNov 15 10:48:26 localhost ReportCrash[198]: 0x10452c000 - 0x104531fff libGIF.dylib ??? (???) 5AD1D618-2C1D-AD00-7EA4-D8EC6A1773A4 /System/Library/Frameworks/ApplicationServices.framework/Versions/A/Frameworks/ ImageIO.framework/Versions/A/Resources/libGIF.dylibNov 15 10:48:26 localhost ReportCrash[198]: 0x104536000 - 0x104554fff libPng.dylib ??? (???) 4EFA6B07-6613-BC33-11D7-CF2D9B967511 /System/Library/Frameworks/ApplicationServices.framework/Versions/A/Frameworks/ ImageIO.framework/Versions/A/Resources/libPng.dylibNov 15 10:48:26 localhost ReportCrash[198]: 0x10455c000 - 0x10455efff libRadiance.dylib ??? (???) 3DAD870E-B3AE-B998-AA36-9D6B940D44C2 /System/Library/Frameworks/ApplicationServices.framework/Versions/A/Frameworks/ ImageIO.framework/Versions/A/Resources/libRadiance.dylibNov 15 10:48:26 localhost ReportCrash[198]: 0x104562000 - 0x104588fe7 libJPEG.dylib ??? (???) F0FD3FDA-432D-9920-6AA9-3AE1191D6AEA /System/Library/Frameworks/ApplicationServices.framework/Versions/A/Frameworks/ ImageIO.framework/Versions/A/Resources/libJPEG.dylibNov 15 10:48:26 localhost ReportCrash[198]: 0x104590000 - 0x10466afff com.apple.vImage 4.0 (4.0) B5A8B93B-D302-BC30-5A18-922645DB2F56 /System/Library/Frameworks/Accelerate.framework/Versions/A/Frameworks/vImage.fr amework/Versions/A/vImageNov 15 10:48:26 localhost ReportCrash[198]: 0x104679000 - 0x104679ff7 com.apple.Accelerate.vecLib 3.6 (vecLib 3.6) 4CCE5D69-F1B3-8FD3-1483-E0271DB2CCF3 /System/Library/Frameworks/Accelerate.framework/Versions/A/Frameworks/vecLib.fr amework/Versions/A/vecLibNov 15 10:48:26 localhost ReportCrash[198]: 0x10467c000 - 0x1046c4ff7 libvDSP.dylib 268.0.1 (compatibility 1.0.0) 98FC4457-F405-0262-00F7-56119CA107B6 /System/Library/Frameworks/Accelerate.framework/Versions/A/Frameworks/vecLib.fr amework/Versions/A/libvDSP.dylibNov 15 10:48:26 localhost ReportCrash[198]: 0x1046cc000 - 0x104736fe7 libvMisc.dylib 268.0.1 (compatibility 1.0.0) 7BD7F19B-ACD4-186C-B42D-4DEBA6795628 /System/Library/Frameworks/Accelerate.framework/Versions/A/Frameworks/vecLib.fr amework/Versions/A/libvMisc.dylibNov 15 10:48:26 localhost ReportCrash[198]: 0x104740000 - 0x104f4afe7 libBLAS.dylib 219.0.0 (compatibility 1.0.0) 2F26CDC7-DAE9-9ABE-6806-93BBBDA20DA0 /System/Library/Frameworks/Accelerate.framework/Versions/A/Frameworks/vecLib.fr amework/Versions/A/libBLAS.dylibNov 15 10:48:26 localhost ReportCrash[198]: 0x104f93000 - 0x1053d6fef libLAPACK.dylib 219.0.0 (compatibility 1.0.0) 57D38705-6F21-2A82-F3F6-03CFFF214775 /System/Library/Frameworks/Accelerate.framework/Versions/A/Frameworks/vecLib.fr amework/Versions/A/libLAPACK.dylibNov 15 10:48:26 localhost ReportCrash[198]: 0x105563000 - 0x105623fe7 libFontParser.dylib ??? (???) A79479ED-819A-2B63-4900-D4790E74006F /System/Library/Frameworks/ApplicationServices.framework/Versions/A/Frameworks/ ATS.framework/Versions/A/Resources/libFontParser.dylibNov 15 10:48:26 localhost ReportCrash[198]: 0x10571a000 - 0x10574fff7 libcups.2.dylib 2.8.0 (compatibility 2.0.0) CE664505-29D1-3634-A055-99D2874FA671 /usr/lib/libcups.2.dylibNov 15 10:48:26 localhost ReportCrash[198]: 0x10575e000 - 0x10580dfff edu.mit.Kerberos 6.5.9 (6.5.9) D6C7CD0A-EA9E-1B7F-2D7E-4CC08A78B678 /System/Library/Frameworks/Kerberos.framework/Versions/A/KerberosNov 15 10:48:26 localhost ReportCrash[198]: 0x105833000 - 0x105854fff libresolv.9.dylib 41.0.0 (compatibility 1.0.0) 9B7AEE96-D18E-5ECF-9837-BD5CFD397831 /usr/lib/libresolv.9.dylibNov 15 10:48:26 localhost ReportCrash[198]: 0x10585e000 - 0x105983fef com.apple.audio.toolbox.AudioToolbox 1.6.3 (1.6.3) 72149B5E-BEC7-B6E9-3B34-0E0620827542 /System/Library/Frameworks/AudioToolbox.framework/Versions/A/AudioToolboxNov 15 10:48:26 localhost ReportCrash[198]: 0x1059f2000 - 0x1059f3ff7 com.apple.audio.units.AudioUnit 1.6.3 (1.6.3) 65C333FF-3F7A-AD36-DC36-D3F2F46727C5 /System/Library/Frameworks/AudioUnit.framework/Versions/A/AudioUnitNov 15 10:48:26 localhost ReportCrash[198]: 0x1059f8000 - 0x105b36fff com.apple.CoreData 102.1 (251) 96C5E9A6-C28C-E9CC-A0DB-27801A22A49F /System/Library/Frameworks/CoreData.framework/Versions/A/CoreDataNov 15 10:48:26 localhost ReportCrash[198]: 0x105bce000 - 0x105cb4fe7 com.apple.DesktopServices 1.5.5 (1.5.5) 5130409F-082D-B3F3-B567-C52638FF483C /System/Library/PrivateFrameworks/DesktopServicesPriv.framework/Versions/A/Desk topServicesPrivNov 15 10:48:26 localhost ReportCrash[198]: 0x105d03000 - 0x106001fef com.apple.HIToolbox 1.6.2 (???) 193A3F85-A1F8-2FD7-A8BD-D6AE722C8BA9 /System/Library/Frameworks/Carbon.framework/Versions/A/Frameworks/HIToolbox.fra mework/Versions/A/HIToolboxNov 15 10:48:26 localhost ReportCrash[198]: 0x10612d000 - 0x1064c5fe7 com.apple.QuartzCore 1.6.1 (227.18) 00EED230-F7BA-6455-2C9D-A65B590E6E13 /System/Library/Frameworks/QuartzCore.framework/Versions/A/QuartzCoreNov 15 10:48:26 localhost ReportCrash[198]: 0x1065f2000 - 0x1065fdff7 com.apple.speech.recognition.framework 3.11.1 (3.11.1) C359B93B-CC9B-FC0B-959E-FB10674103A7 /System/Library/Frameworks/Carbon.framework/Versions/A/Frameworks/SpeechRecogni tion.framework/Versions/A/SpeechRecognitionNov 15 10:48:26 localhost ReportCrash[198]: 0x106607000 - 0x10664eff7 com.apple.coreui 2 (114) 31118426-355F-206A-65AB-CCA2D2D3EBD7 /System/Library/PrivateFrameworks/CoreUI.framework/Versions/A/CoreUINov 15 10:48:26 localhost ReportCrash[198]: 0x106673000 - 0x1066f2fef com.apple.audio.CoreAudio 3.2.2 (3.2.2) 03D4DAA6-E987-F51B-93AE-3C2D91AA570A /System/Library/Frameworks/CoreAudio.framework/Versions/A/CoreAudioNov 15 10:48:26 localhost ReportCrash[198]: 0x106728000 - 0x106729fff liblangid.dylib ??? (???) D0666597-B331-C43C-67BB-F2E754079A7A /usr/lib/liblangid.dylibNov 15 10:48:26 localhost ReportCrash[198]: 0x10672d000 - 0x106743ff7 com.apple.MultitouchSupport.framework 204.13 (204.13) D015924C-4282-B5EF-7190-340F46FB6F18 /System/Library/PrivateFrameworks/MultitouchSupport.framework/Versions/A/Multit ouchSupportNov 15 10:48:26 localhost ReportCrash[198]: 0x106750000 - 0x106750ff7 com.apple.vecLib 3.6 (vecLib 3.6) 96FB6BAD-5568-C4E0-6FA7-02791A58B584 /System/Library/Frameworks/vecLib.framework/Versions/A/vecLibNov 15 10:48:26 localhost ReportCrash[198]: 0x106753000 - 0x1067a8fef com.apple.framework.familycontrols 2.0.1 (2010) 23A6340F-D798-C8C0-93A7-384E964297CF /System/Library/PrivateFrameworks/FamilyControls.framework/Versions/A/FamilyCon trolsNov 15 10:48:26 localhost ReportCrash[198]: 0x1067c5000 - 0x10687afe7 com.apple.ink.framework 1.3.3 (107) A68339AA-909D-E46C-35C0-72808EE3D043 /System/Library/Frameworks/Carbon.framework/Versions/A/Frameworks/Ink.framework /Versions/A/InkNov 15 10:48:26 localhost ReportCrash[198]: 0x1068ad000 - 0x1068d2ff7 com.apple.CoreVideo 1.6.1 (45.5) EEAD844B-D846-F27B-6BFF-D97D3FC31BBC /System/Library/Frameworks/CoreVideo.framework/Versions/A/CoreVideoNov 15 10:48:26 localhost ReportCrash[198]: 0x1068eb000 - 0x1068faff7 com.apple.opengl 1.6.8 (1.6.8) A4784A50-F306-61A7-3638-96D538CBC934 /System/Library/Frameworks/OpenGL.framework/Versions/A/OpenGLNov 15 10:48:26 localhost ReportCrash[198]: 0x106903000 - 0x106934fff libGLImage.dylib ??? (???) 27565CDD-3A12-6DA7-23C1-E2A21216CB2B /System/Library/Frameworks/OpenGL.framework/Versions/A/Libraries/libGLImage.dyl ibNov 15 10:48:26 localhost ReportCrash[198]: 0x10693b000 - 0x10695efff com.apple.opencl 12.1 (12.1) E92CDD8E-5B2C-209B-7C85-79605E3BDB01 /System/Library/Frameworks/OpenCL.framework/Versions/A/OpenCLNov 15 10:48:26 localhost ReportCrash[198]: 0x106967000 - 0x10696dff7 IOSurface ??? (???) 4FFF6BA6-785C-DC57-6E4A-4D0156972BB2 /System/Library/Frameworks/IOSurface.framework/Versions/A/IOSurfaceNov 15 10:48:26 localhost ReportCrash[198]: 0x106976000 - 0x1069bffef libGLU.dylib ??? (???) 41CE0600-B36C-7C5D-85F4-68A5F2E3CCD8 /System/Library/Frameworks/OpenGL.framework/Versions/A/Libraries/libGLU.dylibNov 15 10:48:26 localhost ReportCrash[198]: 0x1069ce000 - 0x1069e2fff libGL.dylib ??? (???) 5AD69545-D1A3-C017-C7AF-B4AFD6F08FA2 /System/Library/Frameworks/OpenGL.framework/Versions/A/Libraries/libGL.dylibNov 15 10:48:26 localhost ReportCrash[198]: 0x1069f2000 - 0x106b0bfef libGLProgrammability.dylib ??? (???) 39A6A60E-5B7A-89B0-5CBF-99FD62C37F30 /System/Library/Frameworks/OpenGL.framework/Versions/A/Libraries/libGLProgramma bility.dylibNov 15 10:48:26 localhost ReportCrash[198]: 0x106b2c000 - 0x106b2fff7 libCoreVMClient.dylib ??? (???) 305BFF0D-6C64-AFEE-68F7-FECA17199860 /System/Library/Frameworks/OpenGL.framework/Versions/A/Libraries/libCoreVMClien t.dylibNov 15 10:48:26 localhost ReportCrash[198]: 0x106b34000 - 0x106b39fff libGFXShared.dylib ??? (???) 8D5BE6C3-A830-54A5-5371-575293D31B0A /System/Library/Frameworks/OpenGL.framework/Versions/A/Libraries/libGFXShared.d ylibNov 15 10:48:26 localhost ReportCrash[198]: 0x106b3e000 - 0x106bcafef SecurityFoundation 36840.0.0 (compatibility 1.0.0) 105C82B6-A1C7-9082-ECA6-AEA08C1948C6 /System/Library/Frameworks/SecurityFoundation.framework/Versions/A/SecurityFoun dationNov 15 10:48:26 localhost ReportCrash[198]: 0x106c0e000 - 0x106c15fff com.apple.OpenDirectory 10.6 (10.6) D72FD8AB-B328-B27B-DA16-3BBB7BC0C08C /System/Library/Frameworks/OpenDirectory.framework/Versions/A/OpenDirectoryNov 15 10:48:26 localhost ReportCrash[198]: 0x106c1e000 - 0x106c37fff com.apple.CFOpenDirectory 10.6 (10.6) E98F7642-7F87-C3B4-18FB-3D3947E53CD0 /System/Library/Frameworks/OpenDirectory.framework/Versions/A/Frameworks/CFOpen Directory.framework/Versions/A/CFOpenDirectoryNov 15 10:48:26 localhost ReportCrash[198]: 0x106c4c000 - 0x106c6cff7 com.apple.DirectoryService.Framework 3.6 (621.3) 8FBCBA30-5BB6-E447-8146-08486933AEB8 /System/Library/Frameworks/DirectoryService.framework/Versions/A/DirectoryServi ceNov 15 10:48:26 localhost ReportCrash[198]: 0x106c76000 - 0x106cb7ff7 com.apple.MediaKit 10.3 (485) 779F7525-0F11-0FAA-9E3B-3F22DD975CC5 /System/Library/PrivateFrameworks/MediaKit.framework/Versions/A/MediaKitNov 15 10:48:26 localhost ReportCrash[198]: 0x106cca000 - 0x106da2fe7 com.apple.DiscRecording 5.0.5 (5050.4.6) 4B3F20F9-7966-66C3-8C5F-E2D482184EA2 /System/Library/Frameworks/DiscRecording.framework/Versions/A/DiscRecordingNov 15 10:48:26 localhost ReportCrash[198]: 0x106e02000 - 0x106e1cff7 com.apple.NetInfo 1.0.0 (???) 7348D6F9-9EB3-7E93-9F98-B6D690B95226 /System/Library/PrivateFrameworks/NetInfo.framework/Versions/A/NetInfoNov 15 10:48:26 localhost ReportCrash[198]: 0x106e28000 - 0x106f28ff7 com.apple.DiskImagesFramework 10.6.4 (285) 6B33176A-CF2B-8052-1556-D163E8DDC097 /System/Library/PrivateFrameworks/DiskImages.framework/Versions/A/DiskImagesNov 15 10:48:26 localhost ReportCrash[198]: 0x106f85000 - 0x106f85ff7 com.apple.Carbon 150 (152) 586B20CD-AEB9-57F1-F2C1-BB14BE70C5B3 /System/Library/Frameworks/Carbon.framework/Versions/A/CarbonNov 15 10:48:26 localhost ReportCrash[198]: 0x106f88000 - 0x106fc4fe7 libcurl.4.dylib 6.1.0 (compatibility 6.0.0) EABCA30B-B900-0BCC-84A1-5C1F3F13D221 /usr/lib/libcurl.4.dylibNov 15 10:48:26 localhost ReportCrash[198]: 0x106fd2000 - 0x10700aff7 libssl.0.9.8.dylib 0.9.8 (compatibility 0.9.8) D98473F3-AF4F-B2C0-E597-637033EE3111 /usr/lib/libssl.0.9.8.dylibNov 15 10:48:26 localhost ReportCrash[198]: 0x10701f000 - 0x107024ff7 com.apple.CommonPanels 1.2.4 (91) 8B088D78-E508-6622-E477-E34C22CF2F67 /System/Library/Frameworks/Carbon.framework/Versions/A/Frameworks/CommonPanels. framework/Versions/A/CommonPanelsNov 15 10:48:26 localhost ReportCrash[198]: 0x10702c000 - 0x10702ffff com.apple.help 1.3.1 (41) AEDDF93F-BAC0-0308-68FD-039A99F3A158 /System/Library/Frameworks/Carbon.framework/Versions/A/Frameworks/Help.framewor k/Versions/A/HelpNov 15 10:48:26 localhost ReportCrash[198]: 0x107035000 - 0x10704bfff com.apple.ImageCapture 6.0 (6.0) 01E09982-7DD2-0868-0180-42E7D298B35A /System/Library/Frameworks/Carbon.framework/Versions/A/Frameworks/ImageCapture. framework/Versions/A/ImageCaptureNov 15 10:48:26 localhost ReportCrash[198]: 0x107065000 - 0x107080ff7 com.apple.openscripting 1.3.1 (???) DC329CD4-1159-A40A-A769-70CAA70F601A /System/Library/Frameworks/Carbon.framework/Versions/A/Frameworks/OpenScripting .framework/Versions/A/OpenScriptingNov 15 10:48:26 localhost ReportCrash[198]: 0x107091000 - 0x107093fff com.apple.print.framework.Print 6.1 (237.1) 87A5BEEC-2D37-5CB7-8B13-7B605397573F /System/Library/Frameworks/Carbon.framework/Versions/A/Frameworks/Print.framewo rk/Versions/A/PrintNov 15 10:48:26 localhost ReportCrash[198]: 0x107098000 - 0x10709bff7 com.apple.securityhi 4.0 (36638) 0234B95B-A339-4576-BB0D-A568634B50F5 /System/Library/Frameworks/Carbon.framework/Versions/A/Frameworks/SecurityHI.fr amework/Versions/A/SecurityHINov 15 10:48:26 localhost ReportCrash[198]: 0x1074c3000 - 0x1074d0fe7 libCSync.A.dylib 544.1.0 (compatibility 64.0.0) 46F00644-B0B4-1214-A17E-70F4F1702048 /System/Library/Frameworks/ApplicationServices.framework/Versions/A/Frameworks/ CoreGraphics.framework/Versions/A/Resources/libCSync.A.dylibNov 15 10:48:26 localhost ReportCrash[198]: 0x107622000 - 0x107629fff com.apple.TIMCore 1.2.0 (1.2.0) 040AADAE-E9BD-167A-9B07-E65E7C82A5F2 /System/Library/CoreServices/Menu Extras/TextInput.menu/Contents/SharedSupport/TIMCore.bundle/Contents/MacOS/TIMC oreNov 15 10:48:26 localhost ReportCrash[198]: 0x107632000 - 0x107643ff7 com.apple.TextInputUI 1.0 (1.0) 7F16CC61-2F8D-8C43-50F9-A1B493C407C8 /System/Library/CoreServices/Menu Extras/TextInput.menu/Contents/SharedFrameworks/TextInputUI.framework/Versions/ A/TextInputUINov 15 10:48:26 localhost ReportCrash[198]: 0x107655000 - 0x107670ff7 com.apple.airport.clientbundle 6.2.1 (621.1) 4567D8C0-9321-F90C-E71B-5DFAA195CC9D /System/Library/PrivateFrameworks/Apple80211.framework/Versions/A/Resources/Cli entController.bundle/Contents/MacOS/ClientControllerNov 15 10:48:26 localhost ReportCrash[198]: 0x107788000 - 0x1077cbff7 libRIP.A.dylib 544.1.0 (compatibility 64.0.0) D1DB9F39-1510-9DB3-B14D-A15879328CC2 /System/Library/Frameworks/ApplicationServices.framework/Versions/A/Frameworks/ CoreGraphics.framework/Versions/A/Resources/libRIP.A.dylibNov 15 10:48:26 localhost ReportCrash[198]: 0x1077dc000 - 0x1077e0ff7 libCGXType.A.dylib 544.1.0 (compatibility 64.0.0) C141864F-9475-4E48-FDF6-B11518560F2D /System/Library/Frameworks/ApplicationServices.framework/Versions/A/Frameworks/ CoreGraphics.framework/Versions/A/Resources/libCGXType.A.dylibNov 15 10:48:26 localhost ReportCrash[198]: 0x10dde1000 - 0x10dde7fff libCGXCoreImage.A.dylib 544.1.0 (compatibility 64.0.0) A7D4D3BE-393C-2D09-41C1-623A59B76066 /System/Library/Frameworks/ApplicationServices.framework/Versions/A/Frameworks/ CoreGraphics.framework/Versions/A/Resources/libCGXCoreImage.A.dylibNov 15 10:48:26 localhost ReportCrash[198]: 0x11e300000 - 0x11e3cbfe7 ColorSyncDeprecated.dylib 4.6.0 (compatibility 1.0.0) A34CE62D-4733-B8BF-A9B2-09933AA467C3 /System/Library/Frameworks/ApplicationServices.framework/Versions/A/Frameworks/ ColorSync.framework/Versions/A/Resources/ColorSyncDeprecated.dylibNov 15 10:48:26 localhost ReportCrash[198]: 0x11e59f000 - 0x11e5dcff7 libFontRegistry.dylib ??? (???) D82C0359-D761-79ED-09F5-00A1F9108076 /System/Library/Frameworks/ApplicationServices.framework/Frameworks/ATS.framewo rk/Resources/libFontRegistry.dylibNov 15 10:48:26 localhost ReportCrash[198]: 0x11f675000 - 0x11f693ff7 com.apple.menuextra.airport 6.2.1 (621.1) 0FF0765C-F601-3915-8852-688F71238C45 /System/Library/CoreServices/Menu Extras/AirPort.menu/Contents/MacOS/AirPortNov 15 10:48:26 localhost ReportCrash[198]: 0x11f6a6000 - 0x11f6c9ff7 com.apple.SystemConfiguration.EAP8021X 10.0.1 (1.0) 4856F0D0-8DBE-BB58-7B59-371AC2783969 /System/Library/PrivateFrameworks/EAP8021X.framework/Versions/A/EAP8021XNov 15 10:48:26 localhost ReportCrash[198]: 0x11f6d5000 - 0x11f71eff7 com.apple.securityinterface 4.0.1 (37214) 08DB37D6-A716-DC37-536C-7889999EF395 /System/Library/Frameworks/SecurityInterface.framework/Versions/A/SecurityInter faceNov 15 10:48:26 localhost ReportCrash[198]: 0x1205a0000 - 0x1205cfff7 com.apple.XInstall.InstallAssistant 230.1.1 (262) CBBC52A9-E10A-8A4B-EC22-41C3F5551443 /System/Installation/CDIS/Mac OS X Installer.app/Contents/Resources/OSXInstallAssistant.bundle/Contents/MacOS/OSXI nstallAssistantNov 15 10:48:26 localhost ReportCrash[198]: 0x120baa000 - 0x120bdbfef libTrueTypeScaler.dylib ??? (???) 3F09E12E-1A3F-E592-31EF-52D77E968FB2 /System/Library/Frameworks/ApplicationServices.framework/Frameworks/ATS.framewo rk/Resources/libTrueTypeScaler.dylibNov 15 10:48:26 localhost ReportCrash[198]: 0x7fff5fc00000 - 0x7fff5fc3bdef dyld 132.1 (???) DB8B8AB0-0C97-B51C-BE8B-B79895735A33 /usr/lib/dyldNov 15 10:48:26 localhost ReportCrash[198]: 0x7fffffe00000 - 0x7fffffe01fff libSystem.B.dylib ??? (???) 39D14F74-5D42-5807-1DBD-18DBEF1F9E46 /usr/lib/libSystem.B.dylibNov 15 10:48:26 localhost ReportCrash[198]: Nov 15 10:48:26 localhost ReportCrash[198]: Nov 15 10:50:27 localhost Viewer[200]: NetworkBrowser failed to launch "/usr/bin/nmblookup" (No such file or directory)

    DB:2.75:Installation As Restore From Backup Fails pa

    Hi Thomas,many thanks for your detailed answer.I tried to restore from TimeMachine Backup after booting my iMac with a bootable DVD with Lion and it worked.Kind regards,Rainer

  • RELEVANCY SCORE 2.75

    DB:2.75:Office 365 Error Code 126-4 md


    Original Title 126-4

    Error Code 126-4??

    DB:2.75:Office 365 Error Code 126-4 md

    Hello Fredrick,

    When do you receive the error message with Office 365? Is it while installation or accessing Office 365 applications?

    Provide the complete error message you receive.

    If the issue occurs while installing Office suite then you may follow the steps provided in the article below which provides basic troubleshooting steps for the Office 2013 installation failures:
    http://support.microsoft.com/kb/2822317

    If the issue occurs while accessing the Office applications then try to do an
    ‘Quick Repair’ of Office 365 installation then try to access the applications and check how it works.

    Refer to the article given below on how to perform ‘Quick Repair’ of Office 365:

    http://office.microsoft.com/en-us/project-help/repair-or-remove-office-2010-HA010357402.aspx

    For further queries, reply with complete information about the issue and we would be happy to assist.
    Thank You.

  • RELEVANCY SCORE 2.74

    DB:2.74:Error Code a7


    I keep getting SOMETHING WENT WRONG ERROR CODE 0-4 when I try to install student home and office on a pc. HELP

    DB:2.74:Error Code a7

    You didn't state whether it was Office 2013 or Office 365 so I couldn't be more specific. Just click the links that apply to your version...

    See if anything here helps...

    Error: “Something went wrong and we can't sign you in right now” when trying to install Office 2013...
    http://support.microsoft.com/kb/2811180

    OR

    General troubleshooting for installing Office 2013 and Office 365...
    http://support.microsoft.com/kb/2822317

    OR

    http://techhstuff.blogspot.in/2013/09/office-2013-installation-error.html

    OR

    See this thread...
    http://answers.microsoft.com/en-us/office/forum/office_2013_release-office_install/problems-installing-office-2013-and-office-365/42d81528-c7a9-4604-8687-f85f4df9770e

  • RELEVANCY SCORE 2.74

    DB:2.74:Latex/Prosper Does Not Show Fonts cz



    Hi all,

    I have a strange problem which I cant figure out whether it lies between the chair and the table or on the table.

    Namely, I am usin Prosper to generate LaTeX slides. This morning previewing a produced PS-file gave the following error:
    Error: /invalidfont in findfont
    Operand stack:
    Fc 10 --nostringval-- 165 16 --nostringval-- 165 109 --nostringval-- 149 165 83 149 99 2 --nostringval-- 165 165 248 66 149 66 66 165 165 1 --nostringval-- 165 165 1 --nostringval-- 165 165 21 --nostringval-- 198 28 --nostringval-- 83 99 83 44 --nostringval-- --nostringval-- 24 297.54 Helvetica Font Helvetica 531531 Helvetica --nostringval-- Courier (Courier) Courier
    Execution stack:
    %interp_exit .runexec2 --nostringval-- --nostringval-- --nostringval-- 2 %stopped_push --nostringval-- --nostringval-- --nostringval-- false 1 %stopped_push 1 3 %oparray_pop 1 3 %oparray_pop 1 3 %oparray_pop .runexec2 --nostringval-- --nostringval-- --nostringval-- 2 %stopped_push --nostringval-- --nostringval-- 47 4 %oparray_pop 48 4 %oparray_pop --nostringval-- --nostringval-- --nostringval-- --nostringval-- --nostringval-- false 1 %stopped_push 51 5 %oparray_pop --nostringval-- --nostringval-- --nostringval-- --nostringval--
    Dictionary stack:
    --dict:1049/1417(ro)(G)-- --dict:0/20(G)-- --dict:74/200(L)-- --dict:115/300(L)-- --dict:17/17(ro)(G)-- --dict:1049/1417(ro)(G)--
    Current allocation mode is local
    Last OS error: 2
    ESP Ghostscript 7.07.1: Unrecoverable error, exit code 1

    DB:2.74:Latex/Prosper Does Not Show Fonts cz


    Hi again,

    I did some research and I guess prosper is not to be blamed here at all, this was a pure ghostscript issue. I reinstalled ghostscript and now everything works. I still do not know what exactly went wrong, so I probably wont submit a bug report as it will very probably become unreproducable anyway.

    Jan

  • RELEVANCY SCORE 2.74

    DB:2.74:I Did The Update And Now Cant Open Itunes I Get A Error 7&Nbsp; Windows Error 198 s9


    I did the update and now itunes wont open...I get a windows error 7 (windows error 198) HELP

    DB:2.74:I Did The Update And Now Cant Open Itunes I Get A Error 7&Nbsp; Windows Error 198 s9

    I did the update and now itunes wont open...I get a windows error 7 (windows error 198) HELP

  • RELEVANCY SCORE 2.73

    DB:2.73:Xps 600 Error Code 3 & 4 f3


    DB:2.73:Xps 600 Error Code 3 & 4 f3

    micoinde,

    * Read this

    3&4 mean memory modules are detected, but a memory failure has occurred.

  • RELEVANCY SCORE 2.73

    DB:2.73:Error Code 1224-4 7p


    How to deal with this kind of error??
    Thanks!

    DB:2.73:Error Code 1224-4 7p

    I have tried to repair it but it didn't work. So I reinstalled and the problem was fixxed.

    Thnaks anyway!

  • RELEVANCY SCORE 2.73

    DB:2.73:Error : You Have Encountered An Unexpected Error. Please Contact The System 9c


    Hi All,

    When i am try to open the system administrator it shows the following error

    You have encountered an unexpected error. Please contact the System Administrator for assistance.
    Click here for exception details.

    Exception details as follows :

    Exception Details.
    oracle.apps.fnd.framework.OAException: Application: FND, Message Name: Page region must have an application module.
    at oracle.apps.fnd.framework.webui.OAPageErrorHandler.prepareException(OAPageErrorHandler.java:1251)
    at oracle.apps.fnd.framework.webui.OAPageBean.preparePage(OAPageBean.java:2149)
    at oracle.apps.fnd.framework.webui.OAPageBean.preparePage(OAPageBean.java:538)
    at oracle.apps.fnd.framework.webui.OAPageBean.preparePage(OAPageBean.java:426)
    at OA.jspService(_OA.java:212)
    at com.orionserver.http.OrionHttpJspPage.service(OrionHttpJspPage.java:59)
    at oracle.jsp.runtimev2.JspPageTable.service(JspPageTable.java:379)
    at oracle.jsp.runtimev2.JspServlet.internalService(JspServlet.java:594)
    at oracle.jsp.runtimev2.JspServlet.service(JspServlet.java:518)
    at javax.servlet.http.HttpServlet.service(HttpServlet.java:856)
    at com.evermind.server.http.ServletRequestDispatcher.invoke(ServletRequestDispatcher.java:713)
    at com.evermind.server.http.ServletRequestDispatcher.forwardInternal(ServletRequestDispatcher.java:370)
    at com.evermind.server.http.ServletRequestDispatcher.unprivileged_forward(ServletRequestDispatcher.java:259)
    at com.evermind.server.http.ServletRequestDispatcher.access$100(ServletRequestDispatcher.java:51)
    at com.evermind.server.http.ServletRequestDispatcher$2.oc4jRun(ServletRequestDispatcher.java:193)
    at oracle.oc4j.security.OC4JSecurity.doPrivileged(OC4JSecurity.java:284)
    at com.evermind.server.http.ServletRequestDispatcher.forward(ServletRequestDispatcher.java:198)
    at com.evermind.server.http.EvermindPageContext.forward(EvermindPageContext.java:395)
    at RF.jspService(_RF.java:225)
    at com.orionserver.http.OrionHttpJspPage.service(OrionHttpJspPage.java:59)
    at oracle.jsp.runtimev2.JspPageTable.service(JspPageTable.java:379)
    at oracle.jsp.runtimev2.JspServlet.internalService(JspServlet.java:594)
    at oracle.jsp.runtimev2.JspServlet.service(JspServlet.java:518)
    at javax.servlet.http.HttpServlet.service(HttpServlet.java:856)
    at com.evermind.server.http.ServletRequestDispatcher.invoke(ServletRequestDispatcher.java:713)
    at com.evermind.server.http.ServletRequestDispatcher.forwardInternal(ServletRequestDispatcher.java:370)
    at com.evermind.server.http.ServletRequestDispatcher.unprivileged_forward(ServletRequestDispatcher.java:259)
    at com.evermind.server.http.ServletRequestDispatcher.access$100(ServletRequestDispatcher.java:51)
    at com.evermind.server.http.ServletRequestDispatcher$2.oc4jRun(ServletRequestDispatcher.java:193)
    at oracle.oc4j.security.OC4JSecurity.doPrivileged(OC4JSecurity.java:284)
    at com.evermind.server.http.ServletRequestDispatcher.forward(ServletRequestDispatcher.java:198)
    at com.evermind.server.http.EvermindPageContext.forward(EvermindPageContext.java:395)
    at OA.jspService(_OA.java:221)
    at com.orionserver.http.OrionHttpJspPage.service(OrionHttpJspPage.java:59)
    at oracle.jsp.runtimev2.JspPageTable.service(JspPageTable.java:379)
    at oracle.jsp.runtimev2.JspServlet.internalService(JspServlet.java:594)
    at oracle.jsp.runtimev2.JspServlet.service(JspServlet.java:518)
    at javax.servlet.http.HttpServlet.service(HttpServlet.java:856)
    at com.evermind.server.http.ServletRequestDispatcher.invoke(ServletRequestDispatcher.java:713)
    at com.evermind.server.http.ServletRequestDispatcher.forwardInternal(ServletRequestDispatcher.java:370)
    at com.evermind.server.http.ServletRequestDispatcher.unprivileged_forward(ServletRequestDispatcher.java:259)
    at com.evermind.server.http.ServletRequestDispatcher.access$100(ServletRequestDispatcher.java:51)
    at com.evermind.server.http.ServletRequestDispatcher$2.oc4jRun(ServletRequestDispatcher.java:193)
    at oracle.oc4j.security.OC4JSecurity.doPrivileged(OC4JSecurity.java:284)
    at com.evermind.server.http.ServletRequestDispatcher.forward(ServletRequestDispatcher.java:198)
    at com.evermind.server.http.EvermindPageContext.forward(EvermindPageContext.java:395)
    at OA.jspService(_OA.java:221)
    at com.orionserver.http.OrionHttpJspPage.service(OrionHttpJspPage.java:59)
    at oracle.jsp.runtimev2.JspPageTable.service(JspPageTable.java:379)
    at oracle.jsp.runtimev2.JspServlet.internalService(JspServlet.java:594)
    at oracle.jsp.runtimev2.JspServlet.service(JspServlet.java:518)
    at javax.servlet.http.HttpServlet.service(HttpServlet.java:856)
    at com.evermind.server.http.ResourceFilterChain.doFilter(ResourceFilterChain.java:64)
    at oracle.apps.jtf.base.session.ReleaseResFilter.doFilter(ReleaseResFilter.java:26)
    at com.evermind.server.http.EvermindFilterChain.doFilter(EvermindFilterChain.java:15)
    at oracle.apps.fnd.security.AppsServletFilter.doFilter(AppsServletFilter.java:318)
    at com.evermind.server.http.ServletRequestDispatcher.invoke(ServletRequestDispatcher.java:621)
    at com.evermind.server.http.ServletRequestDispatcher.forwardInternal(ServletRequestDispatcher.java:370)
    at com.evermind.server.http.HttpRequestHandler.doProcessRequest(HttpRequestHandler.java:871)
    at com.evermind.server.http.HttpRequestHandler.processRequest(HttpRequestHandler.java:453)
    at com.evermind.server.http.AJPRequestHandler.run(AJPRequestHandler.java:313)
    at com.evermind.server.http.AJPRequestHandler.run(AJPRequestHandler.java:199)
    at oracle.oc4j.network.ServerSocketReadHandler$SafeRunnable.run(ServerSocketReadHandler.java:260)
    at com.evermind.util.ReleasableResourcePooledExecutor$MyWorker.run(ReleasableResourcePooledExecutor.java:303)
    at java.lang.Thread.run(Thread.java:619)
    ## Detail 0 ##
    oracle.apps.fnd.framework.OAException: Application: FND, Message Name: Page region must have an application module.
    at oracle.apps.fnd.framework.webui.OAPageBean.preparePage(OAPageBean.java:1283)
    at oracle.apps.fnd.framework.webui.OAPageBean.preparePage(OAPageBean.java:538)
    at oracle.apps.fnd.framework.webui.OAPageBean.preparePage(OAPageBean.java:426)
    at OA.jspService(_OA.java:212)
    at com.orionserver.http.OrionHttpJspPage.service(OrionHttpJspPage.java:59)
    at oracle.jsp.runtimev2.JspPageTable.service(JspPageTable.java:379)
    at oracle.jsp.runtimev2.JspServlet.internalService(JspServlet.java:594)
    at oracle.jsp.runtimev2.JspServlet.service(JspServlet.java:518)
    at javax.servlet.http.HttpServlet.service(HttpServlet.java:856)
    at com.evermind.server.http.ServletRequestDispatcher.invoke(ServletRequestDispatcher.java:713)
    at com.evermind.server.http.ServletRequestDispatcher.forwardInternal(ServletRequestDispatcher.java:370)
    at com.evermind.server.http.ServletRequestDispatcher.unprivileged_forward(ServletRequestDispatcher.java:259)
    at com.evermind.server.http.ServletRequestDispatcher.access$100(ServletRequestDispatcher.java:51)
    at com.evermind.server.http.ServletRequestDispatcher$2.oc4jRun(ServletRequestDispatcher.java:193)
    at oracle.oc4j.security.OC4JSecurity.doPrivileged(OC4JSecurity.java:284)
    at com.evermind.server.http.ServletRequestDispatcher.forward(ServletRequestDispatcher.java:198)
    at com.evermind.server.http.EvermindPageContext.forward(EvermindPageContext.java:395)
    at RF.jspService(_RF.java:225)
    at com.orionserver.http.OrionHttpJspPage.service(OrionHttpJspPage.java:59)
    at oracle.jsp.runtimev2.JspPageTable.service(JspPageTable.java:379)
    at oracle.jsp.runtimev2.JspServlet.internalService(JspServlet.java:594)
    at oracle.jsp.runtimev2.JspServlet.service(JspServlet.java:518)
    at javax.servlet.http.HttpServlet.service(HttpServlet.java:856)
    at com.evermind.server.http.ServletRequestDispatcher.invoke(ServletRequestDispatcher.java:713)
    at com.evermind.server.http.ServletRequestDispatcher.forwardInternal(ServletRequestDispatcher.java:370)
    at com.evermind.server.http.ServletRequestDispatcher.unprivileged_forward(ServletRequestDispatcher.java:259)
    at com.evermind.server.http.ServletRequestDispatcher.access$100(ServletRequestDispatcher.java:51)
    at com.evermind.server.http.ServletRequestDispatcher$2.oc4jRun(ServletRequestDispatcher.java:193)
    at oracle.oc4j.security.OC4JSecurity.doPrivileged(OC4JSecurity.java:284)
    at com.evermind.server.http.ServletRequestDispatcher.forward(ServletRequestDispatcher.java:198)
    at com.evermind.server.http.EvermindPageContext.forward(EvermindPageContext.java:395)
    at OA.jspService(_OA.java:221)
    at com.orionserver.http.OrionHttpJspPage.service(OrionHttpJspPage.java:59)
    at oracle.jsp.runtimev2.JspPageTable.service(JspPageTable.java:379)
    at oracle.jsp.runtimev2.JspServlet.internalService(JspServlet.java:594)
    at oracle.jsp.runtimev2.JspServlet.service(JspServlet.java:518)
    at javax.servlet.http.HttpServlet.service(HttpServlet.java:856)
    at com.evermind.server.http.ServletRequestDispatcher.invoke(ServletRequestDispatcher.java:713)
    at com.evermind.server.http.ServletRequestDispatcher.forwardInternal(ServletRequestDispatcher.java:370)
    at com.evermind.server.http.ServletRequestDispatcher.unprivileged_forward(ServletRequestDispatcher.java:259)
    at com.evermind.server.http.ServletRequestDispatcher.access$100(ServletRequestDispatcher.java:51)
    at com.evermind.server.http.ServletRequestDispatcher$2.oc4jRun(ServletRequestDispatcher.java:193)
    at oracle.oc4j.security.OC4JSecurity.doPrivileged(OC4JSecurity.java:284)
    at com.evermind.server.http.ServletRequestDispatcher.forward(ServletRequestDispatcher.java:198)
    at com.evermind.server.http.EvermindPageContext.forward(EvermindPageContext.java:395)
    at OA.jspService(_OA.java:221)
    at com.orionserver.http.OrionHttpJspPage.service(OrionHttpJspPage.java:59)
    at oracle.jsp.runtimev2.JspPageTable.service(JspPageTable.java:379)
    at oracle.jsp.runtimev2.JspServlet.internalService(JspServlet.java:594)
    at oracle.jsp.runtimev2.JspServlet.service(JspServlet.java:518)
    at javax.servlet.http.HttpServlet.service(HttpServlet.java:856)
    at com.evermind.server.http.ResourceFilterChain.doFilter(ResourceFilterChain.java:64)
    at oracle.apps.jtf.base.session.ReleaseResFilter.doFilter(ReleaseResFilter.java:26)
    at com.evermind.server.http.EvermindFilterChain.doFilter(EvermindFilterChain.java:15)
    at oracle.apps.fnd.security.AppsServletFilter.doFilter(AppsServletFilter.java:318)
    at com.evermind.server.http.ServletRequestDispatcher.invoke(ServletRequestDispatcher.java:621)
    at com.evermind.server.http.ServletRequestDispatcher.forwardInternal(ServletRequestDispatcher.java:370)
    at com.evermind.server.http.HttpRequestHandler.doProcessRequest(HttpRequestHandler.java:871)
    at com.evermind.server.http.HttpRequestHandler.processRequest(HttpRequestHandler.java:453)
    at com.evermind.server.http.AJPRequestHandler.run(AJPRequestHandler.java:313)
    at com.evermind.server.http.AJPRequestHandler.run(AJPRequestHandler.java:199)
    at oracle.oc4j.network.ServerSocketReadHandler$SafeRunnable.run(ServerSocketReadHandler.java:260)
    at com.evermind.util.ReleasableResourcePooledExecutor$MyWorker.run(ReleasableResourcePooledExecutor.java:303)
    at java.lang.Thread.run(Thread.java:619)
    oracle.apps.fnd.framework.OAException: Application: FND, Message Name: Page region must have an application module.
    at oracle.apps.fnd.framework.webui.OAPageBean.preparePage(OAPageBean.java:1283)
    at oracle.apps.fnd.framework.webui.OAPageBean.preparePage(OAPageBean.java:538)
    at oracle.apps.fnd.framework.webui.OAPageBean.preparePage(OAPageBean.java:426)
    at OA.jspService(_OA.java:212)
    at com.orionserver.http.OrionHttpJspPage.service(OrionHttpJspPage.java:59)
    at oracle.jsp.runtimev2.JspPageTable.service(JspPageTable.java:379)
    at oracle.jsp.runtimev2.JspServlet.internalService(JspServlet.java:594)
    at oracle.jsp.runtimev2.JspServlet.service(JspServlet.java:518)
    at javax.servlet.http.HttpServlet.service(HttpServlet.java:856)
    at com.evermind.server.http.ServletRequestDispatcher.invoke(ServletRequestDispatcher.java:713)
    at com.evermind.server.http.ServletRequestDispatcher.forwardInternal(ServletRequestDispatcher.java:370)
    at com.evermind.server.http.ServletRequestDispatcher.unprivileged_forward(ServletRequestDispatcher.java:259)
    at com.evermind.server.http.ServletRequestDispatcher.access$100(ServletRequestDispatcher.java:51)
    at com.evermind.server.http.ServletRequestDispatcher$2.oc4jRun(ServletRequestDispatcher.java:193)
    at oracle.oc4j.security.OC4JSecurity.doPrivileged(OC4JSecurity.java:284)
    at com.evermind.server.http.ServletRequestDispatcher.forward(ServletRequestDispatcher.java:198)
    at com.evermind.server.http.EvermindPageContext.forward(EvermindPageContext.java:395)
    at RF.jspService(_RF.java:225)
    at com.orionserver.http.OrionHttpJspPage.service(OrionHttpJspPage.java:59)
    at oracle.jsp.runtimev2.JspPageTable.service(JspPageTable.java:379)
    at oracle.jsp.runtimev2.JspServlet.internalService(JspServlet.java:594)
    at oracle.jsp.runtimev2.JspServlet.service(JspServlet.java:518)
    at javax.servlet.http.HttpServlet.service(HttpServlet.java:856)
    at com.evermind.server.http.ServletRequestDispatcher.invoke(ServletRequestDispatcher.java:713)
    at com.evermind.server.http.ServletRequestDispatcher.forwardInternal(ServletRequestDispatcher.java:370)
    at com.evermind.server.http.ServletRequestDispatcher.unprivileged_forward(ServletRequestDispatcher.java:259)
    at com.evermind.server.http.ServletRequestDispatcher.access$100(ServletRequestDispatcher.java:51)
    at com.evermind.server.http.ServletRequestDispatcher$2.oc4jRun(ServletRequestDispatcher.java:193)
    at oracle.oc4j.security.OC4JSecurity.doPrivileged(OC4JSecurity.java:284)
    at com.evermind.server.http.ServletRequestDispatcher.forward(ServletRequestDispatcher.java:198)
    at com.evermind.server.http.EvermindPageContext.forward(EvermindPageContext.java:395)
    at OA.jspService(_OA.java:221)
    at com.orionserver.http.OrionHttpJspPage.service(OrionHttpJspPage.java:59)
    at oracle.jsp.runtimev2.JspPageTable.service(JspPageTable.java:379)
    at oracle.jsp.runtimev2.JspServlet.internalService(JspServlet.java:594)
    at oracle.jsp.runtimev2.JspServlet.service(JspServlet.java:518)
    at javax.servlet.http.HttpServlet.service(HttpServlet.java:856)
    at com.evermind.server.http.ServletRequestDispatcher.invoke(ServletRequestDispatcher.java:713)
    at com.evermind.server.http.ServletRequestDispatcher.forwardInternal(ServletRequestDispatcher.java:370)
    at com.evermind.server.http.ServletRequestDispatcher.unprivileged_forward(ServletRequestDispatcher.java:259)
    at com.evermind.server.http.ServletRequestDispatcher.access$100(ServletRequestDispatcher.java:51)
    at com.evermind.server.http.ServletRequestDispatcher$2.oc4jRun(ServletRequestDispatcher.java:193)
    at oracle.oc4j.security.OC4JSecurity.doPrivileged(OC4JSecurity.java:284)
    at com.evermind.server.http.ServletRequestDispatcher.forward(ServletRequestDispatcher.java:198)
    at com.evermind.server.http.EvermindPageContext.forward(EvermindPageContext.java:395)
    at OA.jspService(_OA.java:221)
    at com.orionserver.http.OrionHttpJspPage.service(OrionHttpJspPage.java:59)
    at oracle.jsp.runtimev2.JspPageTable.service(JspPageTable.java:379)
    at oracle.jsp.runtimev2.JspServlet.internalService(JspServlet.java:594)
    at oracle.jsp.runtimev2.JspServlet.service(JspServlet.java:518)
    at javax.servlet.http.HttpServlet.service(HttpServlet.java:856)
    at com.evermind.server.http.ResourceFilterChain.doFilter(ResourceFilterChain.java:64)
    at oracle.apps.jtf.base.session.ReleaseResFilter.doFilter(ReleaseResFilter.java:26)
    at com.evermind.server.http.EvermindFilterChain.doFilter(EvermindFilterChain.java:15)
    at oracle.apps.fnd.security.AppsServletFilter.doFilter(AppsServletFilter.java:318)
    at com.evermind.server.http.ServletRequestDispatcher.invoke(ServletRequestDispatcher.java:621)
    at com.evermind.server.http.ServletRequestDispatcher.forwardInternal(ServletRequestDispatcher.java:370)
    at com.evermind.server.http.HttpRequestHandler.doProcessRequest(HttpRequestHandler.java:871)
    at com.evermind.server.http.HttpRequestHandler.processRequest(HttpRequestHandler.java:453)
    at com.evermind.server.http.AJPRequestHandler.run(AJPRequestHandler.java:313)
    at com.evermind.server.http.AJPRequestHandler.run(AJPRequestHandler.java:199)
    at oracle.oc4j.network.ServerSocketReadHandler$SafeRunnable.run(ServerSocketReadHandler.java:260)
    at com.evermind.util.ReleasableResourcePooledExecutor$MyWorker.run(ReleasableResourcePooledExecutor.java:303)
    at java.lang.Thread.run(Thread.java:619)
    ------------------------------------------------------------------------------------------------------------------------------

    And error in the alertlog file is as follows :

    Fatal NI connect error 12170.

    VERSION INFORMATION:
    TNS for Linux: Version 11.1.0.7.0 - Production
    Oracle Bequeath NT Protocol Adapter for Linux: Version 11.1.0.7.0 - Production
    TCP/IP NT Protocol Adapter for Linux: Version 11.1.0.7.0 - Production
    Time: 07-MAR-2012 11:09:35
    Tracing not turned on.
    Tns error struct:
    ns main err code: 12535

    TNS-12535: TNS:operation timed out
    ns secondary err code: 12560
    nt main err code: 505

    TNS-00505: Operation timed out
    nt secondary err code: 110
    nt OS err code: 0
    Client address: (ADDRESS=(PROTOCOL=tcp)(HOST=172.25.129.6)(PORT=49329))
    ----------------------------------------------------------------------------------------------------------------------

    Application version is 12.1.1
    Database version : 11.1.0.7.0
    OS : RHEL 4 (update 5).

    Please help,

    DB:2.73:Error : You Have Encountered An Unexpected Error. Please Contact The System 9c

    Issue get resolved, Problem is somebodies had changed the Menu option of system administrator responsibility,so the application is routed to another menu option and get the exception.
    After changing the menu option to original,its working fine.

    Thanks to all,

  • RELEVANCY SCORE 2.73

    DB:2.73:Conn.Pooling Error !!! px


    My JRUN Based Conn.Pooling fails stating this reason.

    java.sql.SQLException: Io exception: Connection refused
    (DESCRIPTION=(TMP=)(VSNNUM=135286784)(ERR=12500)(ERROR_STACK=
    (ERROR=(CODE=12500)(EMFI=4))(ERROR=(CODE=12540)(EMFI=4))(ERROR=
    (CODE=12560)(EMFI=4))(ERROR=(CODE=510)(EMFI=4))(ERROR=
    (BUF='IBM/AIX RISC System/6000 Error: 11: Resource temporarily
    unavailable'))))

    We are using Oracle815 with Thin Drivers(classes12.zip) in our
    JRUN is that 815 does not support conn.pooling

    DB:2.73:Conn.Pooling Error !!! px

    My JRUN Based Conn.Pooling fails stating this reason.

    java.sql.SQLException: Io exception: Connection refused
    (DESCRIPTION=(TMP=)(VSNNUM=135286784)(ERR=12500)(ERROR_STACK=
    (ERROR=(CODE=12500)(EMFI=4))(ERROR=(CODE=12540)(EMFI=4))(ERROR=
    (CODE=12560)(EMFI=4))(ERROR=(CODE=510)(EMFI=4))(ERROR=
    (BUF='IBM/AIX RISC System/6000 Error: 11: Resource temporarily
    unavailable'))))

    We are using Oracle815 with Thin Drivers(classes12.zip) in our
    JRUN is that 815 does not support conn.pooling

  • RELEVANCY SCORE 2.73

    DB:2.73:Oracle 9i xm


    My Oracle 9i occurs unknown errors like this :

    (DESCRIPTION=(TMP=)(VSNNUM=153092352)(ERR=12500)(ERROR_STACK=(ERROR=(CODE=12
    500)(EMFI=4))(ERROR=(CODE=12560)(EMFI=4))(ERROR=(CODE=530)(EMFI=4))(ERROR=(B
    UF='32-bit Windows Error: 2: No such file or directory'))))

    Could somebody tell me what happened? thanks!

    DB:2.73:Oracle 9i xm

    My Oracle 9i occurs unknown errors like this :

    (DESCRIPTION=(TMP=)(VSNNUM=153092352)(ERR=12500)(ERROR_STACK=(ERROR=(CODE=12
    500)(EMFI=4))(ERROR=(CODE=12560)(EMFI=4))(ERROR=(CODE=530)(EMFI=4))(ERROR=(B
    UF='32-bit Windows Error: 2: No such file or directory'))))

    Could somebody tell me what happened? thanks!

  • RELEVANCY SCORE 2.73

    DB:2.73:Office Error Code s3


    my error code is12152-4 I really need office can someone help me I must get this to install asap

    DB:2.73:Office Error Code s3

    Please give us the FULL and EXACT error message text that is displayed along with the error code.

    The following link tells you how to do that:
    http://answers.microsoft.com/en-us/wiki/editwiki?wikiId=f5e9749f-6806-46cf-9eda-e25ec4890bcb

    You can also look through the other error messages collected there to see if you can find similar (does not have to be exactly the same) error message text. Try the fixes reported for those errors.

  • RELEVANCY SCORE 2.73

    DB:2.73:Adobe Csxs Infrastructure 4 Update Leaves Error Code U44m1p7 sd



    Adobe CSXS Infrastructure 4 update leaves Error code U44M1P7. What does this mean?

    DB:2.73:Adobe Csxs Infrastructure 4 Update Leaves Error Code U44m1p7 sd


    I get the same error, tried the reinstall and can't load CC Desktop to get all the apps updates

    Online CHAT was USELESS

    I am beginning to this this subscription model does not work!

    NOTHING but problems on the adminstrative side

    I am moving to a MAC

  • RELEVANCY SCORE 2.73

    DB:2.73:Python Location Data Insert Error 9x



    I'm trying to create a Python script that will update the ServiceNow cmn_location.do table automatically, but the results are inconsistent at best. Out of 198 entries, I get successful adds of 72 or, 124, or 103 with no consistency. The only error I get is the following on the failed adds: And this error is consistent on each failure. I looked at the data and the "city" entry looks fine. I cannot see any difference between good and bad adds. At first I thought it might be "missing" (null) data I'm trying to add. But when I look at the results I see both good and bad adds with the same missing fields.Below is a code snippet where the error is occurring:snTableName = cmn_locationsn_server = SOAPProxy(self.proxy + snTableName + '.do?SOAP') for i in range(len(locationDataToInsert)): try: sn_queryReply = [sn_server.insert(u_site_inst_id = locationDataToInsert[0], \ name = locationDataToInsert[1], \ u_market = locationDataToInsert[3], \ # This is the retrieved market GUID from the instance street = locationDataToInsert[4], \ city = locationDataToInsert[5], \ state = locationDataToInsert[6], \ zip = locationDataToInsert[7], \ contact = locationDataToInsert[9], \ # This is the retrieved user GUID from the instance phone = locationDataToInsert[10], \ u_status = locationDataToInsert[12], \ u_type = locationDataToInsert[14])] except Exception, e: print str(e)The data to add are all strings and the u_market contact entries are the system's GUID data I retrieve before the add.Can anyone at least point me in a troubleshooting direction? I've hit a wall on this one.

    DB:2.73:Python Location Data Insert Error 9x


    Fault SOAP-ENV:Server: com.glide.processors.soap.SOAPProcessingException: Unsupported action: city: com.glide.processors.soap.SOAPProcessingException: Unsupported action: city

  • RELEVANCY SCORE 2.72

    DB:2.72:Call Of Duty 4 Error mz


    Does anyone know what error code 33 is on call of duty 4 is because it's stopping me from playn online?

    DB:2.72:Call Of Duty 4 Error mz

    i was getting that code but after 3 times of trying it worked fine.

  • RELEVANCY SCORE 2.72

    DB:2.72:Cache Exception Occurred J2ee Joc-044 Exception In Viewing Axf Task Details pj


    We have done a fresh installation configuration of IPM system.

    When I view any invoice on the Task details page in the AXF Tasklist, I get the following exception and the invoice image is not displayed.

    "+A cache exception occurred. J2EE JOC-044 An exception is occurring in the method. CacheAccess.get Error transforming document J2EE JOC-043 base exception: There was an error launching the external transformation process: 198 Unknown tranformation error with code: 198+
    +To download and view locally, use the Download menu item from the File menu of the Viewer.+"

    Any ideas, What could be the problem?

    Thanks.

    DB:2.72:Cache Exception Occurred J2ee Joc-044 Exception In Viewing Axf Task Details pj

    The version of our IPM is "+Version 11.1.1.6.0PSU (130308.1225.18750)+". We had also applied the patch 16453513.

  • RELEVANCY SCORE 2.72

    DB:2.72:Too Few Parameters Eror 91


    Hi all, I keep getting an error saying too few parameters but
    I don't quite understande why it's happening.

    Everything's ok if the code is as follows:

    cfquery name="comment" datasource="site"
    SELECT *
    FROM comments_section post
    /cfquery

    but if I add a WHERE line like this:

    cfquery name="comment" datasource="site"

    SELECT *
    FROM comments_section post
    WHERE comments_section.postid=post.postid

    /cfquery

    it tells me that there was an:

    Error Executing Database Query.
    [Macromedia][SequeLink JDBC Driver][ODBC
    Socket][Microsoft][ODBC Microsoft Access Driver] Too few
    parameters. Expected 1.

    The error occurred in
    C:\CFusionMX7\wwwroot\CFIDE\andyjessop\blog\comments.cfm: line 198

    196 : p/p/td
    197 :
    198 : cfquery name="comment" datasource="site"
    199 :
    200 : SELECT *

    Can anyone help me?

    Thanks in advance,
    Andy

    DB:2.72:Too Few Parameters Eror 91

    You are missing a comma between the tablenames in your from
    clause.

    In your first query, the db is interpreting post as an
    alias.

  • RELEVANCY SCORE 2.71

    DB:2.71:Sso :User Mapping Error px



    Hi ,

    I have installed SAP Enterprise Portal EP5SP5 patch3.

    Single sign on with logon ticket is working fine but user mapping is not working.

    SAP J2EE Engine console_logs showing following error:

    ****************************************************************************************************************

    "getAllSystems(): Failed to read data sources from exportal service.com.sapportals.portal.prt.service.exportal.ExportalCommandException: Error in ExportalService getAllDataSources: Error in ExportalService notifyIVServer: Server returned HTTP response code: 502 for URL: http://PORTDEV.btldport.com:80/hrnp$30001/PORTDEV.btldport.com:80/Action/Notification[serverapi]/brat com.sapportals.portal.prt.service.exportal.Exportal.getAllDataSources(Exportal.java:822)brat com.sapportals.portal.prt.component.usermanagement.UserMappingComponent.getAllSystems(UserMappingComponent.java:245)brat com.sapportals.portal.prt.component.usermanagement.UserMappingComponent.getInitialModel(UserMappingComponent.java:362)brat com.sapportals.portal.prt.component.usermanagement.UserMappingComponent.doContent(UserMappingComponent.java:69)brat com.sapportals.portal.prt.component.AbstractPortalComponent.service(AbstractPortalComponent.java:127)brat com.sapportals.portal.prt.core.PortalRequestManager.callPortalComponent(PortalRequestManager.java:291)brat com.sapportals.portal.prt.core.PortalRequestManager.dispatchRequest(PortalRequestManager.java:198)brat com.sapportals.portal.prt.component.PortalComponentResponse.include(PortalComponentResponse.java:231)brat com.sapportals.portal.prt.pom.PortalNode.service(PortalNode.java:475)brat com.sapportals.portal.prt.core.PortalRequestManager.callPortalComponent(PortalRequestManager.java:291)brat com.sapportals.portal.prt.core.PortalRequestManager.dispatchRequest(PortalRequestManager.java:198)brat com.sapportals.portal.prt.core.PortalRequestManager.runRequestCycle(PortalRequestManager.java:483)brat com.sapportals.portal.prt.portalconnection.sapnative.DelegatedPlugIn.handleRequest"

    ****************************************************************************************************************

    I have entered User ID and Password correctly in user mapping.

    I think there is problem with accessing user mapping data.

    Please give me solution.

    DB:2.71:Sso :User Mapping Error px


    I'm also having the same errors with the following environment:

    PDK 5.0.6.0

    Tomcat 3.3.1a (alpha)

    JDK 1.3.1_11

    Windows XP SP1

    SAP R/3 4.6C Release

    Added a new system in Systems.xml and new destination in jcoDestinations.xml, then mapped user by UserManagementAdmin. Next, when I try to test connections, get the errors already showed by Atul Kulkarni. Portal is able to establish connection with the R/3 but can not carry out the test function.

    We are in a preproduction step for a starting project, so we are considering possible technologies for developing a portal infrastructure, and SAP EP is one of this.

  • RELEVANCY SCORE 2.71

    DB:2.71:Installation Error jx


    Hi,

    While installing EBS 11i (11.5.10.2)on Linux(2.6.9-55.ELsmp) 32bit getting following error.

    Error while running adlnkoh.sh. Please check logfile

    Errors while running adlnkoh.sh

    There was an error while running the command - su oramgr -c /u01/11i/app/proddb/9.2.0/temp/PROD_cesora/adrun9i.sh APPS APPS
    /u01/11i/app/proddb/9.2.0/appsutil/install/adlnkoh.sh: line 198: /u01/11i/app/proddb/9.2.0/bin/sqlplus: No such file or directory
    RW-50010: Error: - script has returned an error: 1
    RW-50004: Error code received when running external process. Check log file for details.
    Running Database Install Driver for PROD instance.

    Please help me.

    Thanks,
    Naveen.

    DB:2.71:Installation Error jx

    Hi;

    What is your linux version?Did you verify you have all pre-request and you have valid stage wiht md5sum?
    MD5 Checksums for 11i10.2 Rapid Install Media [ID 316843.1]

    By the way those are generic error,please check log file for details

    Regard
    Helios

  • RELEVANCY SCORE 2.71

    DB:2.71:Soap Receiver Channel: Rw Error cf



    Hi experts!

    I have an error in my SOAP Receiver adapter at RW:

    SOAP: response message contains an error XIAdapter/PARSING/ADAPTER.SOAP_EXCEPTION - soap fault: Server was unable to read request. --- There is an error in XML document (1, 198). --- Input string was not in a correct format.

    How can i know what field is causing the error?

    "There is an error in XML document (1, 198)." is not much instructive.

    Regards,

    Daniela

    DB:2.71:Soap Receiver Channel: Rw Error cf


    Tks Michal,

    I'll check this.

    regards,

    Daniela

  • RELEVANCY SCORE 2.71

    DB:2.71:Webflows - Bea Weblogic Portal 4.0 3k



    Hello...

    My name is Miriam Serrano I am working with BEA WebLogic Portal 4.0. My application
    is clientes, but I have a error with a webflow maquila

    Not Logged In..
    Logged In...as secofi2
    Login - No existe informacion de session ...obteniendo perfil del usuario
    Login - Creando objeto en session ... (InteresadoValue - TipoUsuario - Rol)
    Logged In...as secofi2
    Validando session para tramite maquila (namespace):maquila3
    Jan 22, 2003 4:09:54 PM CST Error HTTP [WebAppServletContext(30282805,cli
    entes,/clientes)] Root cause of ServletException
    java.lang.NullPointerException:
    at jsp_servlet._framework._maquila.__generales._jspService(__generales.j
    ava:307)
    at weblogic.servlet.jsp.JspBase.service(JspBase.java:27)
    at weblogic.servlet.internal.ServletStubImpl.invokeServlet(ServletStubIm
    pl.java:262)
    at weblogic.servlet.internal.ServletStubImpl.invokeServlet(ServletStubIm
    pl.java:198)
    at weblogic.servlet.internal.RequestDispatcherImpl.forward(RequestDispat
    cherImpl.java:250)
    at com.bea.p13n.appflow.webflow.servlets.internal.WebflowServlet.doGet(W
    ebflowServlet.java:167)
    at com.bea.portal.appflow.servlets.internal.PortalWebflowServlet.doGet(P
    ortalWebflowServlet.java:172)
    at javax.servlet.http.HttpServlet.service(HttpServlet.java:740)
    at javax.servlet.http.HttpServlet.service(HttpServlet.java:853)
    at weblogic.servlet.internal.ServletStubImpl.invokeServlet(ServletStubIm
    pl.java:262)
    at weblogic.servlet.internal.ServletStubImpl.invokeServlet(ServletStubIm
    pl.java:198)
    at weblogic.servlet.internal.WebAppServletContext.invokeServlet(WebAppSe
    rvletContext.java:2637)
    at weblogic.servlet.internal.ServletRequestImpl.execute(ServletRequestIm
    pl.java:2359)
    at weblogic.kernel.ExecuteThread.execute(ExecuteThread.java:139)
    at weblogic.kernel.ExecuteThread.run(ExecuteThread.java:120)

    Not Logged In..
    Not Logged In..
    Validando session para tramite maquila (namespace):maquila3
    No existe informacion del cliente en la session para realizar tramite
    Not Logged In..
    Logged In...as secofi2
    Login - No existe informacion de session ...obteniendo perfil del usuario
    Login - Creando objeto en session ... (InteresadoValue - TipoUsuario - Rol)
    Logged In...as secofi2
    Validando session para tramite maquila (namespace):maquila3
    Jan 22, 2003 4:37:10 PM CST Error HTTP [WebAppServletContext(17480164,cli
    entes,/clientes)] Root cause of ServletException
    java.lang.NullPointerException
    at jsp_servlet._framework._maquila.__generales._jspService(__generales.j
    ava:307)
    at weblogic.servlet.jsp.JspBase.service(JspBase.java:27)
    at weblogic.servlet.internal.ServletStubImpl.invokeServlet(ServletStubIm
    pl.java:262)
    at weblogic.servlet.internal.ServletStubImpl.invokeServlet(ServletStubIm
    pl.java:321)
    at weblogic.servlet.internal.ServletStubImpl.invokeServlet(ServletStubIm
    pl.java:198)
    at weblogic.servlet.internal.RequestDispatcherImpl.forward(RequestDispat
    cherImpl.java:250)
    at com.bea.p13n.appflow.webflow.servlets.internal.WebflowServlet.doGet(W
    ebflowServlet.java:167)
    at com.bea.portal.appflow.servlets.internal.PortalWebflowServlet.doGet(P
    ortalWebflowServlet.java:172)
    at javax.servlet.http.HttpServlet.service(HttpServlet.java:740)
    at javax.servlet.http.HttpServlet.service(HttpServlet.java:853)
    at weblogic.servlet.internal.ServletStubImpl.invokeServlet(ServletStubIm
    pl.java:262)
    at weblogic.servlet.internal.ServletStubImpl.invokeServlet(ServletStubIm
    pl.java:198)
    at weblogic.servlet.internal.WebAppServletContext.invokeServlet(WebAppSe
    rvletContext.java:2637)
    at weblogic.servlet.internal.ServletRequestImpl.execute(ServletRequestIm
    pl.java:2359)
    at weblogic.kernel.ExecuteThread.execute(ExecuteThread.java:139)
    at weblogic.kernel.ExecuteThread.run(ExecuteThread.java:120)

    Can you help me?
    regards

    DB:2.71:Webflows - Bea Weblogic Portal 4.0 3k

    What is happening at __generales.java:307 ?

    Look through the domain applications\.wlnotdelete directories and find
    the file to find out what is causing the NullPointerException.

    Do you have a support account with Portal Support?

    -- Jim

    Miriam wrote:
    Hello...

    My name is Miriam Serrano I am working with BEA WebLogic Portal 4.0. My application
    is clientes, but I have a error with a webflow maquila

    Not Logged In..
    Logged In...as secofi2
    Login - No existe informacion de session ...obteniendo perfil del usuario
    Login - Creando objeto en session ... (InteresadoValue - TipoUsuario - Rol)
    Logged In...as secofi2
    Validando session para tramite maquila (namespace):maquila3
    Jan 22, 2003 4:09:54 PM CST Error HTTP [WebAppServletContext(30282805,cli
    entes,/clientes)] Root cause of ServletException
    java.lang.NullPointerException:
    at jsp_servlet._framework._maquila.__generales._jspService(__generales.j
    ava:307)
    at weblogic.servlet.jsp.JspBase.service(JspBase.java:27)
    at weblogic.servlet.internal.ServletStubImpl.invokeServlet(ServletStubIm
    pl.java:262)
    at weblogic.servlet.internal.ServletStubImpl.invokeServlet(ServletStubIm
    pl.java:198)
    at weblogic.servlet.internal.RequestDispatcherImpl.forward(RequestDispat
    cherImpl.java:250)
    at com.bea.p13n.appflow.webflow.servlets.internal.WebflowServlet.doGet(W
    ebflowServlet.java:167)
    at com.bea.portal.appflow.servlets.internal.PortalWebflowServlet.doGet(P
    ortalWebflowServlet.java:172)
    at javax.servlet.http.HttpServlet.service(HttpServlet.java:740)
    at javax.servlet.http.HttpServlet.service(HttpServlet.java:853)
    at weblogic.servlet.internal.ServletStubImpl.invokeServlet(ServletStubIm
    pl.java:262)
    at weblogic.servlet.internal.ServletStubImpl.invokeServlet(ServletStubIm
    pl.java:198)
    at weblogic.servlet.internal.WebAppServletContext.invokeServlet(WebAppSe
    rvletContext.java:2637)
    at weblogic.servlet.internal.ServletRequestImpl.execute(ServletRequestIm
    pl.java:2359)
    at weblogic.kernel.ExecuteThread.execute(ExecuteThread.java:139)
    at weblogic.kernel.ExecuteThread.run(ExecuteThread.java:120)

    Not Logged In..
    Not Logged In..
    Validando session para tramite maquila (namespace):maquila3
    No existe informacion del cliente en la session para realizar tramite
    Not Logged In..
    Logged In...as secofi2
    Login - No existe informacion de session ...obteniendo perfil del usuario
    Login - Creando objeto en session ... (InteresadoValue - TipoUsuario - Rol)
    Logged In...as secofi2
    Validando session para tramite maquila (namespace):maquila3
    Jan 22, 2003 4:37:10 PM CST Error HTTP [WebAppServletContext(17480164,cli
    entes,/clientes)] Root cause of ServletException
    java.lang.NullPointerException
    at jsp_servlet._framework._maquila.__generales._jspService(__generales.j
    ava:307)
    at weblogic.servlet.jsp.JspBase.service(JspBase.java:27)
    at weblogic.servlet.internal.ServletStubImpl.invokeServlet(ServletStubIm
    pl.java:262)
    at weblogic.servlet.internal.ServletStubImpl.invokeServlet(ServletStubIm
    pl.java:321)
    at weblogic.servlet.internal.ServletStubImpl.invokeServlet(ServletStubIm
    pl.java:198)
    at weblogic.servlet.internal.RequestDispatcherImpl.forward(RequestDispat
    cherImpl.java:250)
    at com.bea.p13n.appflow.webflow.servlets.internal.WebflowServlet.doGet(W
    ebflowServlet.java:167)
    at com.bea.portal.appflow.servlets.internal.PortalWebflowServlet.doGet(P
    ortalWebflowServlet.java:172)
    at javax.servlet.http.HttpServlet.service(HttpServlet.java:740)
    at javax.servlet.http.HttpServlet.service(HttpServlet.java:853)
    at weblogic.servlet.internal.ServletStubImpl.invokeServlet(ServletStubIm
    pl.java:262)
    at weblogic.servlet.internal.ServletStubImpl.invokeServlet(ServletStubIm
    pl.java:198)
    at weblogic.servlet.internal.WebAppServletContext.invokeServlet(WebAppSe
    rvletContext.java:2637)
    at weblogic.servlet.internal.ServletRequestImpl.execute(ServletRequestIm
    pl.java:2359)
    at weblogic.kernel.ExecuteThread.execute(ExecuteThread.java:139)
    at weblogic.kernel.ExecuteThread.run(ExecuteThread.java:120)

    Can you help me?
    regards

  • RELEVANCY SCORE 2.71

    DB:2.71:Error Code 66a k7


    security update for microsoft.net framework 4 on windows xp , windows 7 ...etc downloads but comes up as error code 66 A

  • RELEVANCY SCORE 2.71

    DB:2.71:Error Code 4 8f


    DB:2.71:Error Code 4 8f

    gabgardad

    You're Welcome.

    Bev.

    ===================================================
    Please don't send me questions about your system by DCF Messenger.
    Post the issue in the appropriate Board, where they will be answered.

  • RELEVANCY SCORE 2.71

    DB:2.71:Ajax ak


    Estou utilizando AJAX pela primeira vez. Adicionei um UpdatePanel e esta ocorrendo esse erro quando rodo o projeto:

    Server Error in '/WebSite' Application.

    The control with ID 'UpdatePanel1' requires a ScriptManager on the page. The ScriptManager must appear before any controls that need it.
    Description: An unhandled exception occurred during the execution of the current web request. Please review the stack trace for more information about the error and where it originated in the code. Exception Details: System.InvalidOperationException: The control with ID 'UpdatePanel1' requires a ScriptManager on the page. The ScriptManager must appear before any controls that need it.Source Error:

    An unhandled exception was generated during the execution of the current web request. Information regarding the origin and location of the exception can be identified using the exception stack trace below. Stack Trace:

    [InvalidOperationException: The control with ID 'UpdatePanel1' requires a ScriptManager on the page. The ScriptManager must appear before any controls that need it.]
    System.Web.UI.UpdatePanel.get_ScriptManager() +198
    System.Web.UI.UpdatePanel.RegisterPanel() +87
    System.Web.UI.UpdatePanel.OnInit(EventArgs e) +17
    System.Web.UI.Control.InitRecursive(Control namingContainer) +321
    System.Web.UI.Control.InitRecursive(Control namingContainer) +198
    System.Web.UI.Control.InitRecursive(Control namingContainer) +198
    System.Web.UI.Control.InitRecursive(Control namingContainer) +198
    System.Web.UI.Control.InitRecursive(Control namingContainer) +198
    System.Web.UI.Page.ProcessRequestMain(Boolean includeStagesBeforeAsyncPoint, Boolean includeStagesAfterAsyncPoint) +692

    DB:2.71:Ajax ak

    Heloisa, obrigado !!! o erro nao esta ocorrendo mais, justamente pq eu coloquei o ScriptManager antes do UpdatePanel.
    Voce sabe as diferenças conforme postei anteriormente ?

  • RELEVANCY SCORE 2.71

    DB:2.71:Cannot Activate My Iphone 4 Error Code 1202 7p


    Trying to activate new iphone 4....getting error code 1202....

    DB:2.71:Cannot Activate My Iphone 4 Error Code 1202 7p

    Trying to activate new iphone 4....getting error code 1202....

  • RELEVANCY SCORE 2.71

    DB:2.71:Unable To Install Windows Vista Service Pack 1 Kb936330 - Error Code 800f081f df


    Kept having the same error code while performing the "window updates".
    Similiarerror issues when updating :-
    (1) Internet Explorer 8 for windows Vista - Error 8007071B
    (2) KB973923 - Error code 643
    (3) KB973688 - Error code 643
    (4) KB954430 - Error code 643
    (5) KB973525 - Error code 8007371B
    (6) KB951847 - Error code 80073712

    Thanks.

    DB:2.71:Unable To Install Windows Vista Service Pack 1 Kb936330 - Error Code 800f081f df


    OK.

    They are the Windows Update experts there.

    Have a Happy New year.

    Cheers.

    Mick Murphy - Microsoft Partner

  • RELEVANCY SCORE 2.71

    DB:2.71:Error Code 12152-4 d8


    download will not install

    DB:2.71:Error Code 12152-4 d8

    This is a "new"error code that I have not seen before. Please provide us with the FULL and EXACT error message text associated with the code. The following link tells how to capture the text and paste it here:

    http://answers.microsoft.com/en-us/office/wiki/office_365hp-office_install/office-3652013-code-0-and-code-300/f5e9749f-6806-46cf-9eda-e25ec4890bcb

    You can also look at the other error codes in the wiki to see if any have approximately similar subjects and try the fixes associated with them.

    If it is any consolation, you are at least the 3rd person who has posted about this "new" error in the last couple of days.

    Sorry to say, but you can't get an installation disk with the full installation files. MS has gone totally overboard with click to run. AFIK all 2013/365 installation disks now provide the same installer stub that you get from the download site.

  • RELEVANCY SCORE 2.71

    DB:2.71:Iphone 4 Will Not Restore Keep Getting Error Code 21 aa


    iphone 4 will not restore keep getting error code 21. can anyone help?

    DB:2.71:Iphone 4 Will Not Restore Keep Getting Error Code 21 aa

    I had the same message. After hours of trying to fix the problem, I realized it was my computer, not the phone. I took the phone to another computer and it updated first, and then restored. I then took the phone to the computer with all my information and PRESTO my phone was back but better.

  • RELEVANCY SCORE 2.71

    DB:2.71:Sqlplus Command Is Changing To Sqlplus0 8k


    Hi

    I am installing R11.5.10 on rhel 4. while installation i getting below error.

    There was an error while running the command - su oracle -c /home/oracle/visdb/9.2.0/temp/VIS_r11/adrun9i.sh APPS APPS
    /home/oracle/visdb/9.2.0/appsutil/install/adlnkoh.sh: line 198: /home/oracle/visdb/9.2.0/bin/sqlplus: No such file or directory
    RW-50010: Error: - script has returned an error: 1
    RW-50004: Error code received when running external process. Check log file for details.

    when i check $ORACLE_HOME/bin , in place of sqlplus command this is sqlplus0. i have manually copied sqlplus0 to sqlplus and retry the installation. but again the movement the adlnkoh.sh command runs this rename my sqlplus command to sqlplus0.

    I am middle of the installation, kindly help me.

    Thanks
    Krishna

    DB:2.71:Sqlplus Command Is Changing To Sqlplus0 8k

    Hi

    I have applied patch p4198954_40_LINUX.zip and then reinstall. and this time i got sucess.

    Thanks
    Krishna

  • RELEVANCY SCORE 2.71

    DB:2.71:How Do You Fix Error Code 1610612703-4 m3


    getting error code 1610612703-4 - how does one fix this?

    DB:2.71:How Do You Fix Error Code 1610612703-4 m3

    Hello Everyone,

    I can understand how that must make you feel when a particular feature is not working the way it should.

    In order to resolve this issue, please follow steps in
    this article to uninstall Office. Once it’s removed, go to your
    My Account page to reinstall Office.

    Try the above steps and let us know if it helps to resolve the issue on your computer.

    Thank you.