• RELEVANCY SCORE 3.94

    DB:3.94:Internal Error 2753.Dist Acrodist.Exe x9






    I am trying to reinstall Adobe Acrobat 6.0 and during teh insatallation I get the error message.

    Internal error 2753 Dist acrodist.exe

    DB:3.94:Internal Error 2753.Dist Acrodist.Exe x9


    And on what system? If this is Win 7, then no, simply forget it. The minimum version required is Acrobat 9. All others are not compatible. for anything else you need to provide more info.

    Mylenium

  • RELEVANCY SCORE 3.38

    DB:3.38:Internal Error 2753. Setupsup.Exe dm





    Internal Error 2753. setupsup.exe

    DB:3.38:Internal Error 2753. Setupsup.Exe dm

    Hi,

    More information required.

    "Suggestions for asking a question on help forums"
    http://support.microsoft.com/kb/555375/en-us

    Cheers.

  • RELEVANCY SCORE 3.14

    DB:3.14:Internal Error 2753. Znslreg.Exe 9x





    Has anyone come across a solution when dealing with MSinstaller Scansoft Paperport 11 - Internal error 2753. ZNSLReg.exe? Ms Installer also comes up when I open MS Word 2010, I guess as it's trying to install the add-ons.

    I'm running Windows 7 Pro 64 bit and Office 2010 32 bit.

    Thx in advance!
    Louie

    DB:3.14:Internal Error 2753. Znslreg.Exe 9x

    Hello Louie,

    You may try the Microsoft Fixit mentioned in the following link and check.

    Fix problems with programs that can't be installed or uninstalled

    http://support.microsoft.com/mats/Program_Install_and_Uninstall/
    Note: Make sure you run the Fixit for installing program and chose all the programs for the patch while running this Fixit.

    Hope this information helps.

  • RELEVANCY SCORE 3.07

    DB:3.07:Downloaded Microsight Flight Installs 66 Then Error 9s


    Trying to install Microsoft Flight, gets to 66% then get error 2753 and OX80070643

  • RELEVANCY SCORE 2.89

    DB:2.89:Lr 2.1 Installation: Error 2753 c3


    The file "pxsetup.exe" is not marked for installation

    Any ideas why...?

    regards
    Fabio

  • RELEVANCY SCORE 2.89

    DB:2.89:Error Applying Transforms. c8


    when I try to unstall java i get the error message ( error applying transforms )
    so when I to reinstall java i get the message ( Internal Error 2753.regwtils.dll )

    William J. Kitchen

    DB:2.89:Error Applying Transforms. c8

    Have a look at...
    http://www.java.com/en/download/help/error_applying_transforms.xml

    --
    Gina Whipp
    2010 Microsoft MVP (Access)

    Please post all replies to the forum where everyone can benefit.

  • RELEVANCY SCORE 2.89

    DB:2.89:Unable To Install Adobe Reader 8.1.2 Help!!! kp


    Help Please I had Adobe Reader 8 on my Laptop Os WinsXP but it was corrupt so I unstalled it and I`m trying ( Approx 8 tries ) to install Adobe Reader 8.1.2 but all I get when it`s trying to Install is a dialog box that pops up saying

    Internal Error 2753. Updater api_NON_OPT and then says Adobe Reader 8.1.2 setup Failed.

    Any suggestions?
    Thanks in Advance
    Alex

    DB:2.89:Unable To Install Adobe Reader 8.1.2 Help!!! kp

    I can help if you gor error 1402 about not having permission to update reg sub-key MSFS under:
    HKLM/Software/Microsoft/Windows/CurrentVersion/Run/OptionalComponents

    Logged into my own account, I could see no sub-keys under Run even though I have Administrator rights. I logged in under the Administrator Account (the one under which Adobe was originally installed). Now I could see all sub-keys.

    I installed Adobe Reader 8.1.2 successfully.

    I rebooted and logged back in under my own account and can now see all sub-keys.

    I suspect 2 things. Either my registry was corrupt and I lost the sub-keys (dont think so) or an update from say Adobe Reader 8.1.1 to 8.1.2 can initially only be done under the account that did the original install (I hope this is not the case). Good luck.

  • RELEVANCY SCORE 2.89

    DB:2.89:Problem Repairing And Removing Photoshop 3.0 kk


    I have done a re-install of windows xp home when I tried to re-install photo shop starter 3.0 it asked to repair or remove, when trying to repair this error message came up.
    Internal Error 2753. Photo shop_ Album_starter_edit
    I tried to remove it and got error message, Internal Error 2753.adb2.exe does any one know how to solve the issue. I had the same problem when I re-installed acrobat reader but I got that fixed.
    Thanks Martin

    DB:2.89:Problem Repairing And Removing Photoshop 3.0 kk

    In the system tray it is set as hide when in active and has a red x on it in the program files the only thing in the adobe folder is acrobat reader. I have done a search for it and nothing comes up, no luck it.
    Martin

  • RELEVANCY SCORE 2.82

    DB:2.82:Error Message 2753. Regutil.Dll d1


    I am trying to install Java but I keep getting error message 2753. regutils.dll

    DB:2.82:Error Message 2753. Regutil.Dll d1

    http://forums.sun.com/thread.jspa?threadID=5331236

  • RELEVANCY SCORE 2.82

    DB:2.82:Trying To Install Java 6.21 And The Error Message Comes Up, Internal Error 2753.Regutils.Dll 1s


    Trying to install Java 6.21 and the error message comes up. I had to uninstall java and now all I have is v6.0 and no other update will work

    DB:2.82:Trying To Install Java 6.21 And The Error Message Comes Up, Internal Error 2753.Regutils.Dll 1s

    The other solution is convert to Linux - it's less painful than reinstalling Java.

  • RELEVANCY SCORE 2.77

    DB:2.77:Pooladm: Cannot Enable Pools: No Such File Or Directory k9


    I'm having a problem enabling pools in Solaris 10. I used a core installation and manually installed the SUNWpool, SUNWpoolr, SUNWzoner, and SUNWzoneu packages.

    When I try to execute "pooladm -e" to enable pools I get the following error:
    pooladm: cannot enable pools: No such file or directory

    Also, when I enable the svc:/system/pools:default service it errors into maintenance state with the same error in the log file.

    I believe the problem is related to the non-existance of /dev/pool, but I'm not sure why it is not there.

    Here is the output from truss:
    bash-3.00# truss -f pooladm -e
    2753: execve("/usr/sbin/pooladm", 0xFFBFFC8C, 0xFFBFFC98) argc = 2
    2753: resolvepath("/usr/lib/ld.so.1", "/lib/ld.so.1", 1023) = 12
    2753: resolvepath("/usr/sbin/pooladm", "/usr/sbin/pooladm", 1023) = 17
    2753: stat("/usr/sbin/pooladm", 0xFFBFFA68) = 0
    2753: open("/var/ld/ld.config", O_RDONLY) Err#2 ENOENT
    2753: stat("/lib/libpool.so.1", 0xFFBFF520) Err#2 ENOENT
    2753: stat("/usr/lib/libpool.so.1", 0xFFBFF520) = 0
    2753: resolvepath("/usr/lib/libpool.so.1", "/usr/lib/libpool.so.1", 1023) = 21
    2753: open("/usr/lib/libpool.so.1", O_RDONLY) = 3
    2753: mmap(0x00010000, 8192, PROT_READ|PROT_EXEC, MAP_PRIVATE|MAP_ALIGN, 3, 0) = 0xFF3A0000
    2753: mmap(0x00010000, 172032, PROT_NONE, MAP_PRIVATE|MAP_NORESERVE|MAP_ANON|MAP_ALIGN, -1, 0) = 0xFF370000
    2753: mmap(0xFF370000, 93041, PROT_READ|PROT_EXEC, MAP_PRIVATE|MAP_FIXED|MAP_TEXT, 3, 0) = 0xFF370000
    2753: mmap(0xFF398000, 7097, PROT_READ|PROT_WRITE|PROT_EXEC, MAP_PRIVATE|MAP_FIXED|MAP_INITDATA, 3, 98304) = 0xFF398000
    2753: munmap(0xFF388000, 65536) = 0
    2753: memcntl(0xFF370000, 17100, MC_ADVISE, MADV_WILLNEED, 0, 0) = 0
    2753: close(3) = 0
    2753: stat("/lib/libc.so.1", 0xFFBFF520) = 0
    2753: resolvepath("/lib/libc.so.1", "/lib/libc.so.1", 1023) = 14
    2753: open("/lib/libc.so.1", O_RDONLY) = 3
    2753: mmap(0xFF3A0000, 8192, PROT_READ|PROT_EXEC, MAP_PRIVATE|MAP_FIXED, 3, 0) = 0xFF3A0000
    2753: mmap(0x00010000, 1015808, PROT_NONE, MAP_PRIVATE|MAP_NORESERVE|MAP_ANON|MAP_ALIGN, -1, 0) = 0xFF200000
    2753: mmap(0xFF200000, 909301, PROT_READ|PROT_EXEC, MAP_PRIVATE|MAP_FIXED|MAP_TEXT, 3, 0) = 0xFF200000
    2753: mmap(0xFF2EE000, 32017, PROT_READ|PROT_WRITE|PROT_EXEC, MAP_PRIVATE|MAP_FIXED|MAP_INITDATA, 3, 909312) = 0xFF2EE000
    2753: mmap(0xFF2F6000, 5984, PROT_READ|PROT_WRITE|PROT_EXEC, MAP_PRIVATE|MAP_FIXED|MAP_ANON, -1, 0) = 0xFF2F6000
    2753: munmap(0xFF2DE000, 65536) = 0
    2753: memcntl(0xFF200000, 144128, MC_ADVISE, MADV_WILLNEED, 0, 0) = 0
    2753: close(3) = 0
    2753: stat("/lib/libxml2.so.2", 0xFFBFF520) Err#2 ENOENT
    2753: stat("/usr/lib/libxml2.so.2", 0xFFBFF520) = 0
    2753: resolvepath("/usr/lib/libxml2.so.2", "/usr/lib/libxml2.so.2", 1023) = 21
    2753: open("/usr/lib/libxml2.so.2", O_RDONLY) = 3
    2753: mmap(0xFF3A0000, 8192, PROT_READ|PROT_EXEC, MAP_PRIVATE|MAP_FIXED, 3, 0) = 0xFF3A0000
    2753: mmap(0x00010000, 1540096, PROT_NONE, MAP_PRIVATE|MAP_NORESERVE|MAP_ANON|MAP_ALIGN, -1, 0) = 0xFF080000
    2753: mmap(0xFF080000, 1397070, PROT_READ|PROT_EXEC, MAP_PRIVATE|MAP_FIXED|MAP_TEXT, 3, 0) = 0xFF080000
    2753: mmap(0xFF1E4000, 72885, PROT_READ|PROT_WRITE|PROT_EXEC, MAP_PRIVATE|MAP_FIXED|MAP_INITDATA, 3, 1392640) = 0xFF1E4000
    2753: mmap(0xFF1F6000, 2168, PROT_READ|PROT_WRITE|PROT_EXEC, MAP_PRIVATE|MAP_FIXED|MAP_ANON, -1, 0) = 0xFF1F6000
    2753: munmap(0xFF1D6000, 57344) = 0
    2753: mmap(0x00000000, 8192, PROT_READ|PROT_WRITE|PROT_EXEC, MAP_PRIVATE|MAP_ANON, -1, 0) = 0xFF360000
    2753: memcntl(0xFF080000, 202876, MC_ADVISE, MADV_WILLNEED, 0, 0) = 0
    2753: close(3) = 0
    2753: stat("/lib/libscf.so.1", 0xFFBFF520) = 0
    2753: resolvepath("/lib/libscf.so.1", "/lib/libscf.so.1", 1023) = 16
    2753: open("/lib/libscf.so.1", O_RDONLY) = 3
    2753: mmap(0xFF3A0000, 8192, PROT_READ|PROT_EXEC, MAP_PRIVATE|MAP_FIXED, 3, 0) = 0xFF3A0000
    2753: mmap(0x00010000, 172032, PROT_NONE, MAP_PRIVATE|MAP_NORESERVE|MAP_ANON|MAP_ALIGN, -1, 0) = 0xFF330000
    2753: mmap(0xFF330000, 97095, PROT_READ|PROT_EXEC, MAP_PRIVATE|MAP_FIXED|MAP_TEXT, 3, 0) = 0xFF330000
    2753: mmap(0xFF358000, 4934, PROT_READ|PROT_WRITE|PROT_EXEC, MAP_PRIVATE|MAP_FIXED|MAP_INITDATA, 3, 98304) = 0xFF358000
    2753: munmap(0xFF348000, 65536) = 0
    2753: memcntl(0xFF330000, 20432, MC_ADVISE, MADV_WILLNEED, 0, 0) = 0
    2753: close(3) = 0
    2753: stat("/lib/libnvpair.so.1", 0xFFBFF520) = 0
    2753: resolvepath("/lib/libnvpair.so.1", "/lib/libnvpair.so.1", 1023) = 19
    2753: open("/lib/libnvpair.so.1", O_RDONLY) = 3
    2753: mmap(0xFF3A0000, 8192, PROT_READ|PROT_EXEC, MAP_PRIVATE|MAP_FIXED, 3, 0) = 0xFF3A0000
    2753: mmap(0x00010000, 98304, PROT_NONE, MAP_PRIVATE|MAP_NORESERVE|MAP_ANON|MAP_ALIGN, -1, 0) = 0xFF310000
    2753: mmap(0xFF310000, 24206, PROT_READ|PROT_EXEC, MAP_PRIVATE|MAP_FIXED|MAP_TEXT, 3, 0) = 0xFF310000
    2753: mmap(0xFF326000, 1192, PROT_READ|PROT_WRITE|PROT_EXEC, MAP_PRIVATE|MAP_FIXED|MAP_INITDATA, 3, 24576) = 0xFF326000
    2753: munmap(0xFF316000, 65536) = 0
    2753: memcntl(0xFF310000, 7604, MC_ADVISE, MADV_WILLNEED, 0, 0) = 0
    2753: close(3) = 0
    2753: stat("/lib/libexacct.so.1", 0xFFBFF520) Err#2 ENOENT
    2753: stat("/usr/lib/libexacct.so.1", 0xFFBFF520) = 0
    2753: resolvepath("/usr/lib/libexacct.so.1", "/usr/lib/libexacct.so.1", 1023) = 23
    2753: open("/usr/lib/libexacct.so.1", O_RDONLY) = 3
    2753: mmap(0xFF3A0000, 8192, PROT_READ|PROT_EXEC, MAP_PRIVATE|MAP_FIXED, 3, 0) = 0xFF3A0000
    2753: mmap(0x00010000, 90112, PROT_NONE, MAP_PRIVATE|MAP_NORESERVE|MAP_ANON|MAP_ALIGN, -1, 0) = 0xFF060000
    2753: mmap(0xFF060000, 15042, PROT_READ|PROT_EXEC, MAP_PRIVATE|MAP_FIXED|MAP_TEXT, 3, 0) = 0xFF060000
    2753: mmap(0xFF074000, 888, PROT_READ|PROT_WRITE|PROT_EXEC, MAP_PRIVATE|MAP_FIXED|MAP_INITDATA, 3, 16384) = 0xFF074000
    2753: munmap(0xFF064000, 65536) = 0
    2753: memcntl(0xFF060000, 3568, MC_ADVISE, MADV_WILLNEED, 0, 0) = 0
    2753: close(3) = 0
    2753: stat("/lib/libpthread.so.1", 0xFFBFF520) = 0
    2753: resolvepath("/lib/libpthread.so.1", "/lib/libpthread.so.1", 1023) = 20
    2753: open("/lib/libpthread.so.1", O_RDONLY) = 3
    2753: mmap(0xFF3A0000, 8192, PROT_READ|PROT_EXEC, MAP_PRIVATE|MAP_FIXED, 3, 0) = 0xFF3A0000
    2753: mmap(0x00002000, 16384, PROT_NONE, MAP_PRIVATE|MAP_NORESERVE|MAP_ANON|MAP_ALIGN, -1, 0) = 0xFF3EC000
    2753: mmap(0xFF3EC000, 12032, PROT_READ|PROT_EXEC, MAP_PRIVATE|MAP_FIXED|MAP_TEXT, 3, 0) = 0xFF3EC000
    2753: close(3) = 0
    2753: stat("/lib/libz.so.1", 0xFFBFF520) Err#2 ENOENT
    2753: stat("/usr/lib/libz.so.1", 0xFFBFF520) = 0
    2753: resolvepath("/usr/lib/libz.so.1", "/usr/lib/libz.so.1", 1023) = 18
    2753: open("/usr/lib/libz.so.1", O_RDONLY) = 3
    2753: mmap(0xFF3A0000, 8192, PROT_READ|PROT_EXEC, MAP_PRIVATE|MAP_FIXED, 3, 0) = 0xFF3A0000
    2753: mmap(0x00010000, 139264, PROT_NONE, MAP_PRIVATE|MAP_NORESERVE|MAP_ANON|MAP_ALIGN, -1, 0) = 0xFF030000
    2753: mmap(0xFF030000, 69442, PROT_READ|PROT_EXEC, MAP_PRIVATE|MAP_FIXED|MAP_TEXT, 3, 0) = 0xFF030000
    2753: mmap(0xFF050000, 6012, PROT_READ|PROT_WRITE|PROT_EXEC, MAP_PRIVATE|MAP_FIXED|MAP_INITDATA, 3, 65536) = 0xFF050000
    2753: munmap(0xFF042000, 57344) = 0
    2753: memcntl(0xFF030000, 5032, MC_ADVISE, MADV_WILLNEED, 0, 0) = 0
    2753: close(3) = 0
    2753: stat("/lib/libm.so.2", 0xFFBFF520) = 0
    2753: resolvepath("/lib/libm.so.2", "/lib/libm.so.2", 1023) = 14
    2753: open("/lib/libm.so.2", O_RDONLY) = 3
    2753: mmap(0xFF3A0000, 8192, PROT_READ|PROT_EXEC, MAP_PRIVATE|MAP_FIXED, 3, 0) = 0xFF3A0000
    2753: mmap(0x00010000, 786432, PROT_NONE, MAP_PRIVATE|MAP_NORESERVE|MAP_ANON|MAP_ALIGN, -1, 0) = 0xFEF00000
    2753: mmap(0xFEF00000, 693647, PROT_READ|PROT_EXEC, MAP_PRIVATE|MAP_FIXED|MAP_TEXT, 3, 0) = 0xFEF00000
    2753: mmap(0xFEFB8000, 28592, PROT_READ|PROT_WRITE|PROT_EXEC, MAP_PRIVATE|MAP_FIXED|MAP_INITDATA, 3, 688128) = 0xFEFB8000
    2753: munmap(0xFEFAA000, 57344) = 0
    2753: memcntl(0xFEF00000, 33076, MC_ADVISE, MADV_WILLNEED, 0, 0) = 0
    2753: close(3) = 0
    2753: stat("/lib/libsocket.so.1", 0xFFBFF520) = 0
    2753: resolvepath("/lib/libsocket.so.1", "/lib/libsocket.so.1", 1023) = 19
    2753: open("/lib/libsocket.so.1", O_RDONLY) = 3
    2753: mmap(0xFF3A0000, 8192, PROT_READ|PROT_EXEC, MAP_PRIVATE|MAP_FIXED, 3, 0) = 0xFF3A0000
    2753: mmap(0x00010000, 122880, PROT_NONE, MAP_PRIVATE|MAP_NORESERVE|MAP_ANON|MAP_ALIGN, -1, 0) = 0xFF000000
    2753: mmap(0xFF000000, 44594, PROT_READ|PROT_EXEC, MAP_PRIVATE|MAP_FIXED|MAP_TEXT, 3, 0) = 0xFF000000
    2753: mmap(0xFF01C000, 4277, PROT_READ|PROT_WRITE|PROT_EXEC, MAP_PRIVATE|MAP_FIXED|MAP_INITDATA, 3, 49152) = 0xFF01C000
    2753: munmap(0xFF00C000, 65536) = 0
    2753: memcntl(0xFF000000, 14320, MC_ADVISE, MADV_WILLNEED, 0, 0) = 0
    2753: close(3) = 0
    2753: stat("/lib/libnsl.so.1", 0xFFBFF520) = 0
    2753: resolvepath("/lib/libnsl.so.1", "/lib/libnsl.so.1", 1023) = 16
    2753: open("/lib/libnsl.so.1", O_RDONLY) = 3
    2753: mmap(0xFF3A0000, 8192, PROT_READ|PROT_EXEC, MAP_PRIVATE|MAP_FIXED, 3, 0) = 0xFF3A0000
    2753: mmap(0x00010000, 729088, PROT_NONE, MAP_PRIVATE|MAP_NORESERVE|MAP_ANON|MAP_ALIGN, -1, 0) = 0xFEE00000
    2753: mmap(0xFEE00000, 594942, PROT_READ|PROT_EXEC, MAP_PRIVATE|MAP_FIXED|MAP_TEXT, 3, 0) = 0xFEE00000
    2753: mmap(0xFEEA2000, 33745, PROT_READ|PROT_WRITE|PROT_EXEC, MAP_PRIVATE|MAP_FIXED|MAP_INITDATA, 3, 598016) = 0xFEEA2000
    2753: mmap(0xFEEAC000, 23232, PROT_READ|PROT_WRITE|PROT_EXEC, MAP_PRIVATE|MAP_FIXED|MAP_ANON, -1, 0) = 0xFEEAC000
    2753: munmap(0xFEE92000, 65536) = 0
    2753: mmap(0x00000000, 8192, PROT_READ|PROT_WRITE|PROT_EXEC, MAP_PRIVATE|MAP_ANON, -1, 0) = 0xFF300000
    2753: memcntl(0xFEE00000, 89508, MC_ADVISE, MADV_WILLNEED, 0, 0) = 0
    2753: close(3) = 0
    2753: stat("/lib/libdoor.so.1", 0xFFBFF520) = 0
    2753: resolvepath("/lib/libdoor.so.1", "/lib/libdoor.so.1", 1023) = 17
    2753: open("/lib/libdoor.so.1", O_RDONLY) = 3
    2753: mmap(0xFF3A0000, 8192, PROT_READ|PROT_EXEC, MAP_PRIVATE|MAP_FIXED, 3, 0) = 0xFF3A0000
    2753: mmap(0x00010000, 81920, PROT_NONE, MAP_PRIVATE|MAP_NORESERVE|MAP_ANON|MAP_ALIGN, -1, 0) = 0xFEFE0000
    2753: mmap(0xFEFE0000, 3315, PROT_READ|PROT_EXEC, MAP_PRIVATE|MAP_FIXED|MAP_TEXT, 3, 0) = 0xFEFE0000
    2753: mmap(0xFEFF2000, 600, PROT_READ|PROT_WRITE|PROT_EXEC, MAP_PRIVATE|MAP_FIXED|MAP_INITDATA, 3, 8192) = 0xFEFF2000
    2753: munmap(0xFEFE2000, 65536) = 0
    2753: memcntl(0xFEFE0000, 2240, MC_ADVISE, MADV_WILLNEED, 0, 0) = 0
    2753: close(3) = 0
    2753: stat("/lib/libuutil.so.1", 0xFFBFF520) = 0
    2753: resolvepath("/lib/libuutil.so.1", "/lib/libuutil.so.1", 1023) = 18
    2753: open("/lib/libuutil.so.1", O_RDONLY) = 3
    2753: mmap(0xFF3A0000, 8192, PROT_READ|PROT_EXEC, MAP_PRIVATE|MAP_FIXED, 3, 0) = 0xFF3A0000
    2753: mmap(0x00010000, 106496, PROT_NONE, MAP_PRIVATE|MAP_NORESERVE|MAP_ANON|MAP_ALIGN, -1, 0) = 0xFEEE0000
    2753: mmap(0xFEEE0000, 26032, PROT_READ|PROT_EXEC, MAP_PRIVATE|MAP_FIXED|MAP_TEXT, 3, 0) = 0xFEEE0000
    2753: mmap(0xFEEF8000, 1882, PROT_READ|PROT_WRITE|PROT_EXEC, MAP_PRIVATE|MAP_FIXED|MAP_INITDATA, 3, 32768) = 0xFEEF8000
    2753: munmap(0xFEEE8000, 65536) = 0
    2753: memcntl(0xFEEE0000, 6652, MC_ADVISE, MADV_WILLNEED, 0, 0) = 0
    2753: close(3) = 0
    2753: stat("/lib/libgen.so.1", 0xFFBFF520) = 0
    2753: resolvepath("/lib/libgen.so.1", "/lib/libgen.so.1", 1023) = 16
    2753: open("/lib/libgen.so.1", O_RDONLY) = 3
    2753: mmap(0xFF3A0000, 8192, PROT_READ|PROT_EXEC, MAP_PRIVATE|MAP_FIXED, 3, 0) = 0xFF3A0000
    2753: mmap(0x00010000, 98304, PROT_NONE, MAP_PRIVATE|MAP_NORESERVE|MAP_ANON|MAP_ALIGN, -1, 0) = 0xFEEC0000
    2753: mmap(0xFEEC0000, 22089, PROT_READ|PROT_EXEC, MAP_PRIVATE|MAP_FIXED|MAP_TEXT, 3, 0) = 0xFEEC0000
    2753: mmap(0xFEED6000, 2303, PROT_READ|PROT_WRITE|PROT_EXEC, MAP_PRIVATE|MAP_FIXED|MAP_INITDATA, 3, 24576) = 0xFEED6000
    2753: munmap(0xFEEC6000, 65536) = 0
    2753: memcntl(0xFEEC0000, 5656, MC_ADVISE, MADV_WILLNEED, 0, 0) = 0
    2753: close(3) = 0
    2753: munmap(0xFF3A0000, 8192) = 0
    2753: mmap(0x00010000, 24576, PROT_READ|PROT_WRITE|PROT_EXEC, MAP_PRIVATE|MAP_ANON|MAP_ALIGN, -1, 0) = 0xFEFD0000
    2753: getcontext(0xFFBFF758)
    2753: getrlimit(RLIMIT_STACK, 0xFFBFF738) = 0
    2753: getpid() = 2753 [2752]
    2753: setustack(0xFEFD2088)
    2753: sigfillset(0xFF2F64D8) = 0
    2753: stat("/platform/SUNW,Sun-Fire-T200/lib/libc_psr.so.1", 0xFFBFF1B0) = 0
    2753: resolvepath("/platform/SUNW,Sun-Fire-T200/lib/libc_psr.so.1", "/platform/sun4v/lib/libc_psr.so.1", 1023) = 33
    2753: open("/platform/SUNW,Sun-Fire-T200/lib/libc_psr.so.1", O_RDONLY) = 3
    2753: mmap(0x00010000, 8192, PROT_READ|PROT_EXEC, MAP_PRIVATE|MAP_ALIGN, 3, 0) = 0xFEDF0000
    2753: close(3) = 0
    2753: brk(0x00022448) = 0
    2753: brk(0x00024448) = 0
    2753: getprivimplinfo(0xFFBFF2E0, 2076) = 0
    2753: sysconfig(_CONFIG_NGROUPS) = 16
    2753: zone_lookup("") = 0
    2753: zone_getattr(0, ZONE_ATTR_PRIVSET, 0xFEFD02C8, 12) = 12
    2753: getppriv(PRIV_EFFECTIVE, {ffffffffffffffffffffffff}) = 0
    2753: open64("/dev/pool", O_RDONLY) Err#2 ENOENT
    2753: fstat64(2, 0xFFBFEC88) = 0
    pooladm2753: write(2, " p o o l a d m", 7) = 7
    : 2753: write(2, " : ", 2) = 2
    cannot enable pools2753: write(2, " c a n n o t e n a b l".., 19) = 19
    : 2753: write(2, " : ", 2) = 2
    No such file or directory2753: write(2, " N o s u c h f i l e".., 25) = 25

    2753: write(2, "\n", 1) = 1
    2753: _exit(1)

    DB:2.77:Pooladm: Cannot Enable Pools: No Such File Or Directory k9

    All it took was running devfsadm and the errors were gone.

  • RELEVANCY SCORE 2.77

    DB:2.77:Internal Error 2753. Updater.Api_Non_Opt 7m


    Has anyone seen this message when trying to install Reader v 8.1? It occurs about 80% of the way through installation and gives a fatal error.

    DB:2.77:Internal Error 2753. Updater.Api_Non_Opt 7m

    Has anyone seen this message when trying to install Reader v 8.1? It occurs about 80% of the way through installation and gives a fatal error.

  • RELEVANCY SCORE 2.77

    DB:2.77:Sdk Error Code 2753 pm


    I wanted to install the Windows Software Development Kit.
    Now I got an error occured while installing Application Verifier For Windows.
    The Error Information shows:
    The installer has encountered an unexpected error installing this package. This may indicate a problem with this package. The error code is 2753.
    I don't know what I've done wrong. Please help me!

    DB:2.77:Sdk Error Code 2753 pm

    Hello, there

    I have the same problem trying to install the SDK , and I done the same thing that you guys propose, so here is my link

    please let me know howto fix that

    thanks

  • RELEVANCY SCORE 2.74

    DB:2.74:Can't Deinstall Vmware 4.5.1 On Winxp 9f



    after a failed upgrade from 4.5.1 to 4.5.2 ("first deinstall old version") I am not able to deinstall vmware any more. The error message is: "Internal Error 2753. vmware_netinstall.exe". What can I do?

    DB:2.74:Can't Deinstall Vmware 4.5.1 On Winxp 9f


    Change vmware_netinstall.exe to vmware_netinstall.old

  • RELEVANCY SCORE 2.73

    DB:2.73:Internal Error 2753 1z


    I recently had to reinstall Windows XP on my PC which has a Maximus II Formula P5Q Pro motherboard. I was trying to reinstall the motherboard drivers, specifically the Marvell Yukon Gigabit Ethernet Driver, when I got the error message Internal error
    2753, installu.exe. I have been unable to install this driver, and I have no internet access, my ISP tells me, because I don't have the right NIC drivers. Help.

    DB:2.73:Internal Error 2753 1z

    I recently had to reinstall Windows XP on my PC which has a Maximus II Formula P5Q Pro motherboard. I was trying to reinstall the motherboard drivers, specifically the Marvell Yukon Gigabit Ethernet Driver, when I got the error message Internal error
    2753, installu.exe. I have been unable to install this driver, and I have no internet access, my ISP tells me, because I don't have the right NIC drivers. Help.

  • RELEVANCY SCORE 2.69

    DB:2.69:Install Error 2753: Regutils cf


    I am running Windows 7 64-bit and am trying to update my Java JRE. I keep receiving a message that says

    'This software has already been installed on your computer. Would you like to reinstall it? YES or NO (buttons)"

    When I click YES to uninstall the software, the Windows Installer starts, and then I receive an error window:

    Java(TM) 6 Update 14
    Internal Error 2753. regutils.dll

    I am unable to install or uninstall the software.

    Mike

    DB:2.69:Install Error 2753: Regutils cf

    Thanks for the help. In the end this was the solution, although I was not successful in reinstalling version 17, I was able to install version 18 by installing the 64-bit version first, then installing the 32-bit version.

    From the first error, "2753", the solution appears to have been to:

    1. Uninstall Java using the Windows Install Cleanup
    2. Ensure all files in the java/jre6 directories in both the 64-bit and 32-bit program files area were completely deleted
    3. Reinstall Java 64-bit, version 18
    4. Reinstall Java 32-bit, version 18

    Thanks again for the help!

    O'Robhartaigh

  • RELEVANCY SCORE 2.68

    DB:2.68:Error Code 2753 1j


    When I try to uninstall the old version of Silverlight in order to install the new version it comes up with an error code 2753. It refuses to uninstall. I don't know what to do.

    DB:2.68:Error Code 2753 1j

    How to clean a corrupted Silverlight installation and then reinstall Silverlight

  • RELEVANCY SCORE 2.68

    DB:2.68:I Cannot Reinstall Java m7


    I've installed jdk - cannot remmember version..-.
    And i found it doesn't work, so installed jre.
    It also doesn't work.

    I opened "add/remove program", and search jdk and jre. but there is not.
    So I delete jdk and jre folders. And I ran registry cleaner.
    And I found javarar by googling, and tried to uninstall java and jdk.

    After cleaning registry, I tried to inttall jre-6u10-windows-x64.
    But I met "This software has already been installed on your computer. Would you like to reinstall it?".
    I pressed "Yes". Then I met "Internal Error 2753. regutils.dll".

    How can I reinstall "jre-6u10-windows-x64"?

    DB:2.68:I Cannot Reinstall Java m7

    Dear Looce,

    Thanks you for your kind comment.

    My box is vista x64, and I installed x64 jdk and jre.

  • RELEVANCY SCORE 2.68

    DB:2.68:Export War File Compilation Error j9


    Hi,

    I have an application that compliles and deployes fine in JSC. However, if I try to export WAR file to deploy on the Weblogic server I get the error below. The error seems to be due to the fact that one of the JSPs resides in a subdirectory. Moving it to the main directory solves the problem, but this application will have many JSPs and I won't be able to keep them in the same directory. Is it a bug or I miss something?

    init:
    deps-module-jar:
    deps-ear-jar:
    deps-jar:
    library-inclusion-in-archive:
    library-inclusion-in-manifest:
    compile:
    compile-jsps:
    Building jar: E:\cartman\dist\cartman.war
    do-dist:
    extract.war:
    Expanding: E:\cartman\dist\cartman.war into E:\cartman\dist\tmp
    Deleting: E:\cartman\dist\tmp\WEB-INF\sun-web.xml
    Deleting: E:\cartman\dist\cartman.war
    Copying 1 file to E:\cartman\dist\tmp\WEB-INF
    errorhandler.modifications:
    Moving 1 files to E:\cartman\dist\tmp\WEB-INF
    Processing E:\cartman\dist\tmp\WEB-INF\web.before.errorhandler to E:\cartman\dist\tmp\WEB-INF\web.xml
    Loading stylesheet E:\cartman\nbproject\export-web-xml.xsl
    j2ee13.init:
    j2ee13.web.xml:
    Moving 1 files to E:\cartman\dist\tmp\WEB-INF
    Processing E:\cartman\dist\tmp\WEB-INF\web.before.j2ee13 to E:\cartman\dist\tmp\WEB-INF\web.xml
    Loading stylesheet E:\cartman\nbproject\j2ee13-web-xml.xsl
    j2ee13.index.jsp:
    j2ee13.jspf:
    Moving 5 files to E:\cartman\dist\tmp
    Transforming into E:\cartman\dist\tmp
    Processing E:\cartman\dist\tmp\Help.jsp.before.j2ee13 to E:\cartman\dist\tmp\Help.jsp
    Loading stylesheet E:\cartman\nbproject\j2ee13-jsp.xsl
    Processing E:\cartman\dist\tmp\Login.jsp.before.j2ee13 to E:\cartman\dist\tmp\Login.jsp
    Processing E:\cartman\dist\tmp\ThankYou.jsp.before.j2ee13 to E:\cartman\dist\tmp\ThankYou.jsp
    Processing E:\cartman\dist\tmp\WelcomeUser.jsp.before.j2ee13 to E:\cartman\dist\tmp\WelcomeUser.jsp
    Processing E:\cartman\dist\tmp\adminReports\adminReportsMain.jsp.before.j2ee13 to E:\cartman\dist\tmp\adminReports\adminReportsMain.jsp
    Processing E:\cartman\dist\tmp\Help.jsp.before.j2ee13 to E:\cartman\dist\tmp\Help.jsp
    Processing E:\cartman\dist\tmp\Login.jsp.before.j2ee13 to E:\cartman\dist\tmp\Login.jsp
    Processing E:\cartman\dist\tmp\ThankYou.jsp.before.j2ee13 to E:\cartman\dist\tmp\ThankYou.jsp
    Processing E:\cartman\dist\tmp\WelcomeUser.jsp.before.j2ee13 to E:\cartman\dist\tmp\WelcomeUser.jsp
    Processing E:\cartman\dist\tmp\adminReportsMain.jsp.before.j2ee13 to E:\cartman\dist\tmp\adminReportsMain.jsp
    Failed to process E:\cartman\dist\tmp\adminReportsMain.jsp.before.j2ee13
    E:\cartman\nbproject\build-impl.xml:411: java.io.FileNotFoundException: E:\cartman\dist\tmp\adminReportsMain.jsp.before.j2ee13 (The system cannot find the file specified)
    BUILD FAILED (total time: 15 seconds)The file adminReportsMain.jsp is under Web Pages/adminReports directory.

    Thanks in advance,

    Vlad

    DB:2.68:Export War File Compilation Error j9

    Thank you for reporting this issue. A bug has been logged for this and the fix is targeted for future release.

  • RELEVANCY SCORE 2.68

    DB:2.68:Error 2753 1p


    i am getting an error that says the file 'accrdsub.exe is not marked for installation, what does this mean?

    DB:2.68:Error 2753 1p

    i got that too on my new pc. this file has something to do with activKey/ActivIdentitystuff.
    what i was trying to do was to update/fix the activKey, cause everytime i started pc i got an error about a library missing, related to accrdsub.exe
    i found that this thing was still running while i was trying to update it. so i killed the process named accrdsub.exe, so this executable stopped being used.
    after that i could finally update the "activ" software

  • RELEVANCY SCORE 2.67

    DB:2.67:Get Error Message 2753 To Download To Lightroom 3.6 kj



    Error messagr 2753 when downloading Lightroom 3.6

    DB:2.67:Get Error Message 2753 To Download To Lightroom 3.6 kj


    jbpoby for the best assistance, I recommend our chat support at http://adobe.ly/tl8Vx7. Our chat representatives can provide a personalized experience to resolve the issue you have described.

  • RELEVANCY SCORE 2.65

    DB:2.65:Problem With Sso After Upgrade To 10.4.4 sf





    Hello,
    Im having an error during the upgrade from 10.3.1 to 10.4.4.

    This is the log

    Installation started in background
    Determining the packages that need to be installed.
    File downloading BILLING-WIN_10.4.4/dist-msi-Microsoft-2003-i386/billing.msi: completed.
    File downloading BILLING-WIN_10.4.4/dist-msi-Microsoft-2003-i386/billing-plugins.msi:completed.
    File downloading BILLING-WIN_10.4.4/dist-msi-Microsoft-2003-i386/sso.msi: completed.
    File downloading PANEL-WIN_10.4.4/dist-msi-Microsoft-2003-i386/perl-conf.msi: completed.
    Starting installation of packages
    upgrading SSO...
    MSI: Error! Critical action Upgrading SSO... has been failed:
    C:\Program Files\Parallels\Plesk\sso\scripts\upgrade.php is not recognized as an internal or external command, operable program or batch file.
    Failed to install C:\6ad8fe91ce048554694fd8035230a9a7\parallels\BILLING-WIN_10.4.4\dist-msi-Microsoft-2003-i386\sso.msi: Fatal error during installation. (Error code 1603)
    Error: Action sequence upgrade: upgrading SSO... of package sso has been failed with code 1603
    Not all packages were installed.
    Please, contact product technical support.

    --------------

    Ive also tried to to reinstall it manually but with the same results.

    Anybody has the same problem and solved ....?

    Thanks
    Daniel

    DB:2.65:Problem With Sso After Upgrade To 10.4.4 sf




    Probably you met the same issue as described in thread: http://forum.parallels.com/showthread.php?t=260707
    Post details there and I hope you will get it resolved.

  • RELEVANCY SCORE 2.63

    DB:2.63:Internal Error Code 2753 x8


    trying to install HP Photo and Imaging 1.2 on Vista Business 32 and get Internal error code 2753; and the install shuts down. What is the problem and how do i fix?

    DB:2.63:Internal Error Code 2753 x8

    Hi,

    Thank you for posting on Microsoft Answers.

    Looks like the application might have installed partially.
    Open programs and features and make sure its completely removed and then try to install the software and check.
    You can also try to remove the temp files on the computer
    Click start and type %temp% in the search box and make sure everything is deleted, later try to install the software and check to see if it works.
    If the above steps doesn't work then try to put the computer in clean boot state and try to install the software
    Steps to perform clean boot:
    Click Start, type msconfig in the Start Search box, and then press ENTER.
    1. If you are prompted for an administrator password or for a confirmation, type the password, or click Continue.
    2. On the General tab, click Selective Startup.
    3. Under Selective Startup, click to clear the Load Startup Items check box.
    4. Click the Services tab, click to select the Hide All Microsoft Services check box, and then click Disable All.
    5. Click OK.
    6. When you are prompted, click Restart.

    Once you are back on the desktop try to install the software and check

    Hope this helps

    Regards,
    Niranjan

  • RELEVANCY SCORE 2.63

    DB:2.63:Need Help With Unistalling Java. fk


    ok so i wanted to uninstall java. when a Internal error:2753, so then i serched the web and it told me to delete all java files in my registry.( dumb me) i did but i DELETED all of them. and then thats when i get the error 2753. when i try
    to do the CMDregsvr32 vbscript.dll fix. it says it isnt recongized. please someone HELP ME

    DB:2.63:Need Help With Unistalling Java. fk

    Hi,

    Sorry.
    This forum is for discussing windows forms applications development. Youd better ask at Java forum for Java questions.

    Thanks for your understanding.
    Have a nice day.

    Best regards,
    Ling WangPlease remember to click “Mark as Answer” on the post that helps you, and to click “Unmark as Answer” if a marked post does not actually answer your question. This can be beneficial to other community members reading the thread.

  • RELEVANCY SCORE 2.62

    DB:2.62:Boot Camp 2.0 Reinstall Error Code 2753 sk


    All,

    After having problems with 2.1, I uninstalled 2.1 and tried to install 2.0 from the Leopard disk 1. During the install I get an error 2753. This occurs while it's trying to access the Apple Time Service. The time in XP comes up incorrectly. Any suggestions?

    DB:2.62:Boot Camp 2.0 Reinstall Error Code 2753 sk

    One final note. I uninstalled AVG, installed 2.1, and reinstalled AVG. All is fine with the machine. In my case AVG needed to be uninstall and reinstalled after 2.1 to work correctly.

  • RELEVANCY SCORE 2.58

    DB:2.58:How To Fix Error 2753 Swdnld.Exe Not Marked For Installation zs


    Ran Secunia PSI 2.0 and tried to install solution for end of life Adobe Shockwave Player 10.4.1.35 and got error message 2753

    DB:2.58:How To Fix Error 2753 Swdnld.Exe Not Marked For Installation zs

    Hi,
    I would suggest you to try the suggestions from the link and check if it helps in fixing the issue:
    Unable to install Shockwave Player 10
    http://secunia.com/community/forum/thread/show/11864/unable_to_install_schockwave_player_10

  • RELEVANCY SCORE 2.58

    DB:2.58:Corregir Error 2753 xp


    al disintalar microsoft silverligt aparece error2753 como corrijo esto

    DB:2.58:Corregir Error 2753 xp

    MAGNIFICA SUGERENCIA GRACIAS SIGUE AYUDANDO

  • RELEVANCY SCORE 2.57

    DB:2.57:Can't Install Adobe Reader 9 xf


    I have tried to install Adober Reader 9 and can't do it. It almost installs, then I get a message "Internal error 2753. Updater.api_NON_OPT"
    I have Adober Reader 8.1. Do I have to uninstall that before installing AR 9?? Also, AR 8.1 is on an external hard drive. Should that be on my C hard drive?
    Thanks for any help.
    Clara

    DB:2.57:Can't Install Adobe Reader 9 xf

    Hey Pat Willener !!!!!!!!!!!!!!!!!!!!
    Zip a Dee do Dah!!!!!!!!!!It worked!
    Thank you so much!
    Merry Christmas,
    Clara

  • RELEVANCY SCORE 2.57

    DB:2.57:Internal Error 2753. Avpinst.Dll When Installing Kaspersky Antivirus d7


    I get an internal error 2753. avpinst.dll while trying to uninstall Kaspersky Internet Security 2011. I can't remove it, repair it, or update it!

    Any suggestions?

    DB:2.57:Internal Error 2753. Avpinst.Dll When Installing Kaspersky Antivirus d7

    Thankx its removal tool realy 100% wrok .
    its help me thankx u again

  • RELEVANCY SCORE 2.57

    DB:2.57:Lr 2.3 ca


    Downloaded it twice today. Installation stops at

    "Error 2753. The File 'pxsetup.exe' is not marked for installation.

    NaturaLight.us

    DB:2.57:Lr 2.3 ca

    Michael,

    I looked up your error message on Google. The advice there is to delete (or rename) the previous directory that contains Lightroom and then try the installation. In your case this would be the Lightroom 2.2 directory. It sounds like Chris's solution is a winner.

    Hal

  • RELEVANCY SCORE 2.53

    DB:2.53:Internal Error 2753 Qv.Exe kc



    While installing Qlikview 9 the beloow error is coming

    Before this it was running fine .. But previously i installed qv10 and uninstall it .

    Please help as soon as possible ....

    DB:2.53:Internal Error 2753 Qv.Exe kc


    Hi Albertini S.p.A.

    Thank you so much

    you r a genious .....

  • RELEVANCY SCORE 2.52

    DB:2.52: Toshiba Bluetooth Bt1.2/2.0 Error 2753 Setupdiu.Exe pm


    I have cdrom and dongle for the above, but when I want to install the driver and software I get an error message Error 2753 setupdiu.exe not marked for installation. Does anyone know how to overcome this please? I am running XP Pro Thanks gtwt

    DB:2.52: Toshiba Bluetooth Bt1.2/2.0 Error 2753 Setupdiu.Exe pm

    yygrek you are a genius. i've been trying to fix this for ages. nothing suggested on the net works. a big thank you.

    Message was edited by: Fran

  • RELEVANCY SCORE 2.52

    DB:2.52:Internal Error 2753 When Unistalling Adobe Reader 8 81


    Internal Error 2753 When trying to unistall adobe reader 8. Will not let me unnstall adobe reader 8.

    DB:2.52:Internal Error 2753 When Unistalling Adobe Reader 8 81

    Hi JamesSnow,

    The 2753 error can appear when a (previous) installation of Adobe Reader has become corrupt.

    You may refer to the following Adobe Support link to remove Adobe Reader 8 and check if it helps.
    Error "Internal error 2753..." | Install | Adobe Reader

    Important: The above mentioned article contains steps that tell you how to modify the registry. However, serious problems might occur if you modify the registry incorrectly. Therefore, make sure that you follow these steps carefully. For added protection,
    back up the registry before you modify it. Then, you can restore the registry if a problem occurs.
    For more information about how to back up and restore the registry, follow the steps from the below link:
    Back up the registry

    Hope this information is helpful.

  • RELEVANCY SCORE 2.51

    DB:2.51:Internal Error 2753 Regutils.Dll 1f


    I was advised to uninstall old JAVA versions, which I did, then to install the latest version(version-6 update 30). I keep getting the intenal error 2753 regutils.dll code and I can't fix it. Any advice ?

    Please note that I am of the ball point pen generation and not very computer literate.

    DB:2.51:Internal Error 2753 Regutils.Dll 1f

    Hi,
    1. When exactly do you get this error message?
    I would suggest you to follow these steps and check if it helps:
    Method 1:
    I would suggest you to try running System File Checker. System File Checker tool will troubleshoot missing or corrupted system files on Windows. It determines which file is causing the issue, and then replaces the file.
    http://support.microsoft.com/kb/929833
    Method 2:
    Try restoring the computer to an earlier point and check if it helps:
    http://windows.microsoft.com/en-US/windows-vista/System-Restore-frequently-asked-questions
    Hope it helps.

  • RELEVANCY SCORE 2.50

    DB:2.50:Starter Album Error Int Error 2753 f1


    Hi everyone I tried to remove my starter album edition from my computer running XP,
    Using Control panel Add remove programs but I get the above error notice int error 2753 ADB2.exe.
    Does anyone know what this means or where Adobe would list this error
    many thanks nina

    DB:2.50:Starter Album Error Int Error 2753 f1

    Hi Nina, I experienced the same Error Message and others myself when trying to uninstall SE 3.0 My thread is elsewhere in this forum. I have solved it for myself and I think that the solution could well work for yourself.From a search engine I downloaded, installed and used a Free software, namely Revo Uninstaller 1.5 (the latest version available to me) It was childsplay to do and, touch wood, so far it has'nt failed me at the first attempt. If you do use it, you will still experience the same Error Message etc, but have confidence, carry on with the procedure because the program is being uninstalled. The software even clears up after the event. I have now used it for a number of programs that "Add and Remove" could not cope with, it succeeded each time at the first go. I hope that this helps you . Regards - Maurice Nutting

  • RELEVANCY SCORE 2.49

    DB:2.49:Installation Problem With Adobe Reader? zp



    "Error 2753 The file acrosup64.dll is not marked for installation"

    DB:2.49:Installation Problem With Adobe Reader? zp


    Hi nbb56,

    Can you please share the following info:
    - Which OS and architecture are you on
    - What are the exact steps being followed for installation.
    - Do you have any previous version of Reader already installed on your machine.

    Also it would be helpful if you can you share Windows Installer log. Please follow the steps below to create installer log
    1. Launch Notepad
    2. Copy paste the following text in notepad

    Windows Registry Editor Version 5.00

    [HKEY_LOCAL_MACHINE\SOFTWARE\Policies\Microsoft\Windows\Installer\]
    "Logging"="voicewarmupx"

    3. Now press Ctrl+S to save the file.
    4. In the "Filename" field type any_file_name.reg for e.g. abc.reg
    4. In the "Save as type" dropdown, select "All Files"
    5. Click Save button to save the file at desired location
    6. Go to the location where you saved the file and double click on it.
    7. Follow the prompts to create the registry key.

    After the registry key is added successfully, please re run the 11.0.07 patch installer. Once you get the error message click ok and then click on finish to close the installer dialog.
    Now go to C:\Users\{username}\AppData\Local\Temp and look for file with name similar to MSIxxxxx.log.

    Please upload the dump (compress the dump using WinZip or likewise) and share the link here.
    For help see link How to share a document

    Regards,
    Rave

  • RELEVANCY SCORE 2.49

    DB:2.49:Error Code 2753 When Trying To Install Programs 79


    I have vista and I am getting internal error code 2753 whenever I try and install anything, how can I fix this problem?

    DB:2.49:Error Code 2753 When Trying To Install Programs 79


    I have vista and I am getting internal error code 2753 whenever I try and install anything, how can I fix this problem?

    hey
    jenn22c
    see if the below information helps you
    http://www.ehow.com/how_5047270_fix-internal-error.html

    Walter, The Time Zone Traveller

  • RELEVANCY SCORE 2.49

    DB:2.49:Error 2753 Message pp


    I have been trying to install HIRO PC Setup and it will not complete because it is giving me this message.
    Erroe 2753, The File 'xvid_1.2.1_04122008.exe' is not marked for installation.
    Until I can get this installed I cannot watch my downloaded episodes of Underbelly.
    How can I fix this or acquire the file I need.
    Ozgirl

    DB:2.49:Error 2753 Message pp

    Thanks for trying to help. I tried that and it has made no difference. It still gives me the same message.
    Thanks anyway. This is very frustrating. lol
    Hugs
    Ozgirl

  • RELEVANCY SCORE 2.48

    DB:2.48:Uninstall Error - Systemworks 2002 cj


    I want to install Symantec SystemWorks 2003, and must uninstall my 2002 version first
    . I keep geetting this error message while trying to uninstall the 2002 ver
    sion:

    Internal Error 2753.N32Userl.dll

    I am using Windows 2000 Pro. I've tried rebooting, and uninstalling, both
    from the Control Panel and from the program's own uninstall, but get the sam
    e message.

    Have searched the Symantec KnowledgeBase to no avail. DOes anyone have a so
    lution?PS Is there a Sumantec newsgroup? Have tried news.symantec but no luck.

    DB:2.48:Uninstall Error - Systemworks 2002 cj


    The utility you mention is only for the stand-alone Anit-Virus program, not SystemWorks.

    However, while reading aobut that, I found the KnowledgeBase article "How to Manually Uninstall SystemWorks 2002 for Windows 2000-NT", which is exactly what I need.

    Thanks.

  • RELEVANCY SCORE 2.47

    DB:2.47:Re: Uninstall Error Code 11


    2753

    DB:2.47:Re: Uninstall Error Code 11

    arinello wrote:
    This procedure is not possible here - when trying to uninstall or install, the same "Internal error 2753. regutils.dll" pops up...

    (I'm struggling with exactly the same problem, and haven't resolved it yet).Please don't resurrect old threads. Create a new one and ask a specific question if you have a problem.

    I'm locking this thread.

    Kaj

  • RELEVANCY SCORE 2.47

    DB:2.47:Getting Internal Error 2753 Dpinst.Exe 3c


    I am using Flexera Installshield 8.0. Usinginstallshieldwe need to install our application based on 32 bit or 64 bit.
    Some systems we are facing problems like.. instead of invoking the Driver package we were prompted with Internal Error 2753: dpinst.exe.

    DB:2.47:Getting Internal Error 2753 Dpinst.Exe 3c

    Hi,

    Please contact Flexera support team for assistance. They should be able to help you.
    Refer to the link.
    http://community.flexerasoftware.com/forum.php

  • RELEVANCY SCORE 2.47

    DB:2.47:Distiller 8 -F Command Doesn't Work On Vista Home 9j


    Hi,

    I am not able to use external reference in a postscript file even when I access it through the command line

    dir C:\Program Files\Adobe\Acrobat 8.0\Acrobat\
    START acrodist -F

    Error log suggests undefinedfilename.I have check for correct location of image files.Same file works fine on WindowsXP pro and Distiller 8. Please suggest any possible solution for this problem.

    Regards
    Sudhakar

    DB:2.47:Distiller 8 -F Command Doesn't Work On Vista Home 9j

    Does anyone know if the -F option for distiller can be added to a joboptions file rather than a command line switch at startup?

  • RELEVANCY SCORE 2.47

    DB:2.47:Shockwave Player 12.1.5.155 Msi. Error Message On Attempted Install. Error 2753.The File Is Not Marked For Installation 9k



    When attempting to install this MSI, an error occurs. Error 2753. The file 'swhelper_1213153.exe' is not marked for installation. And the installation fails.

    DB:2.47:Shockwave Player 12.1.5.155 Msi. Error Message On Attempted Install. Error 2753.The File Is Not Marked For Installation 9k


    Superscedence will only work if you have all the previous versions that were ever installed on all the computers. I would need the original MSIs in order to do this. I have posted a question in the forums about this.

  • RELEVANCY SCORE 2.46

    DB:2.46:Trouble Uninstalling Max 2009. 7p


    Hi. I’ve been trying to uninstall 3ds Max 2009 for many reasons which I’d rather not get into detail about at this time. When I go to Add or Remove Programs, I press remove and it begins to uninstall as it seems, but it then pops up “Internal Error 2753.” and then outputs what seems to be random numbers. When I press OK, it says “Fatal error during installation.” Does anyone have any idea how to fix this?

    DB:2.46:Trouble Uninstalling Max 2009. 7p

    Nope, I got the same error. I'll try doing it in safe mode, and if that doesn't work should I try the registry method anyways (it's retail, not trial)?Edit: Wow, this is a bit weird, but it didn't work in safe mode. But, when I rebooted into normal mode, it worked fine with the cd. Thank you very much for your help.

  • RELEVANCY SCORE 2.45

    DB:2.45:How To Solve Internal Error 2753 8s


    how to solve internal error 2753

    DB:2.45:How To Solve Internal Error 2753 8s

    hi
    much more information is required
    what operating system
    etc
    read this
    How to ask a question
    http://support.microsoft.com/kb/555375

    - What are you trying to do?
    - Why are you trying to do it?
    - What did you try already, why, and what was the result of your actions?
    - What was the exact error message that you received?
    - How long have you been experiencing this problem?
    - Have you searched the relevant forum/newsgroup archives?
    - Have you searched for any tools or KB articles or any other resources?
    - Have you recently installed or uninstalled any software or hardware?
    - What changes were made to the system between the time everything last worked and when you noticedthe problem?

  • RELEVANCY SCORE 2.45

    DB:2.45:Berkeley In Hp Ux 11.23 Rp4440 Server kf


    Hi, can you help me with this error:

    checking for strip... /usr/bin/strip
    checking for a BSD-compatible install... ../dist/install-sh -c
    checking for cc... cc
    checking for C compiler default output file name... configure: error: C compiler cannot create executables

    See `config.log' for more details.

    I try to compile with this options:

    ../dist/configure CFLAGS=+DA2.0w

    Without these options I can compile, but I need these options for an internal system.

    Thanks in advanced.

    DB:2.45:Berkeley In Hp Ux 11.23 Rp4440 Server kf

    I will wait for a days, I think some librarys are not installed.

  • RELEVANCY SCORE 2.45

    DB:2.45:Re: Internal Error 2753. Regutils pa


    Forgot to mention something, someone has tried to delete the JRE folder but could not.

    What I can think of as a reason for this is, some process might be holding that folder to be get deleted. Go the "Task Manager" (right click on the task bar) and go under the processes Tab. Kill all the java processes (java, jqs, javaws etc). Now it should allow you to delete the java (jre6) folder.

    - Subrata Nath

    Edited by: SunJavaFx on Mar 12, 2010 5:44 AM

    DB:2.45:Re: Internal Error 2753. Regutils pa

    You area few years late.

    Moderator action: locking this zombie.

  • RELEVANCY SCORE 2.45

    DB:2.45:Reader Update Fails Error Code 2753 zk



    I was informed that I should update Reader 11.0.6. Each time that I attempt to do so, the update fails due to error 2753. The file 'acrosup64.dll' is not marked for installation. I had earlier updated Acrobat to version 10.1.10, if that matters. What is the problem? Cannot find error 2753 on the Adobe web site.

    DB:2.45:Reader Update Fails Error Code 2753 zk


    I had already used the Microsoft uninstaller before this message, and it apparently worked. A day or two later, I installed Reader and the new version installed. I am nonetheless of the opinion that this travail was unnecessary, had Adobe done its job.

  • RELEVANCY SCORE 2.45

    DB:2.45:Error 2753.Avpinstall j1


    How do I fix internal error 2753.avpinstall?

    DB:2.45:Error 2753.Avpinstall j1

    You are welcome. Glad it all worked out.

  • RELEVANCY SCORE 2.45

    DB:2.45:Error 6 Occurred At Invoke Node In Dist Build App 1j


    Error 6 occurred at Invoke Node in Dist Build App from LLB.vi-Dist Build App Image.vi-Build Application.viPossible reasons:LabView: Generic file I/O errororNI-488: I/O operation abortedVersion 6.0.2

    DB:2.45:Error 6 Occurred At Invoke Node In Dist Build App 1j

    We reset the builder to include an exe file extension in the application name and the vi now builds.

  • RELEVANCY SCORE 2.45

    DB:2.45:I Am Trying To Uninstall A Corrupted Adobe Photoshop Album And I Get Error 2753 13


    I cannot uninstall a corrupted Adobe Photoshop Album. I ger internal error 2753.ADB2.EXE2. I am over my head and I need help sos.

    DB:2.45:I Am Trying To Uninstall A Corrupted Adobe Photoshop Album And I Get Error 2753 13

    Hi,
    How are you sure that Adobe Photoshop Album is corrupt?
    Run the fix it tool from the following article and check.
    Diagnose and fix program installing and uninstalling problems automatically

    http://support.microsoft.com/mats/Program_Install_and_Uninstall/en-us

  • RELEVANCY SCORE 2.45

    DB:2.45:Cant Uninstall Old Java Software... Error 2753 Reg Utils az


    Have Windows XP Pro. Control Panel Uninstall shows half a dozen old version Java entries which apparently interfere with the latest Java 6 Upd 25. Attempts to uninstall produce Error 2753 Reg Utils response. Assume that's a registry error. How do I get
    rid of it?

    DB:2.45:Cant Uninstall Old Java Software... Error 2753 Reg Utils az

    i can't delete java 6u30 because of error 2753 regulits.dll

  • RELEVANCY SCORE 2.45

    DB:2.45:Internal Error Code 2753 While Trying To Remove Java ma


    Original title: Internal error code 2753
    I get this error code when I am trying to remove Java from my computer and also trying to downloada Java update. Is ther anything I can do to correct this problem.

    DB:2.45:Internal Error Code 2753 While Trying To Remove Java ma

    Hello Xeno,
    The Windows Cleanup Utility is no longer available from Microsoft as it has been seen to cause corruption in other components.
    You might need to find a 3rd party cleanup/removal tool or contact Sun for support. Clickhere for a link to Java support.
    Hope this helps.

    Sincerely,

    Marilyn
    Microsoft Answers Support Engineer
    Visit our
    Microsoft Answers Feedback Forum and let us know what you think

  • RELEVANCY SCORE 2.45

    DB:2.45:I Get Error 2753. pc


    I can't uninstall microsoft silverlight. I get error 2753. I can't open diagcab file for fix it wizard. And have no run as administrator option for CMD. Any ideas?

    DB:2.45:I Get Error 2753. pc

    Sure. This worked for me: http://blogs.msdn.com/b/rpomeroy/archive/2008/06/10/how-to-manually-clean-up-a-bad-silverlight-installation.aspx

    If Silverlight isn't working for you and you are getting errors trying to either uninstall, reinstall or upgrade Silverlight the steps below will likely help you.
    Steps to clean up a machine to fix a broken Silverlight installation:

    Copy these instructions to Notepad, Microsoft Word or some other text editor because you will be asked to close all browsers.Click this button
    to download and run Microsoft Fix it solution 50747Follow the instructions of Microsoft Fix it 50747Visit http://www.microsoft.com/getsilverlightand install Silverlight

  • RELEVANCY SCORE 2.45

    DB:2.45:Problem With Building Berkeleydb 4.8.24 With Mingw x1


    Good day!

    I downloaded db-4.8.24.NC.tar.gz, configured it with
    "../dist/configure --disable-shared --disable-replication --enable-mingw --enable-static"
    and runned "make"
    After some time I received compilation problem like this (see below):
    -----
    ./libtool --mode=compile gcc -c -I. -I../dist/.. -O3 ../dist/../lock/lock_failchk.c
    libtool: compile: gcc -c -I. -I../dist/.. -O3 ../dist/../lock/lock_failchk.c -o lock_failchk.o
    ./libtool --mode=compile gcc -c -I. -I../dist/.. -O3 ../dist/../lock/lock_id.c
    libtool: compile: gcc -c -I. -I../dist/.. -O3 ../dist/../lock/lock_id.c -o lock_id.o
    ./libtool --mode=compile gcc -c -I. -I../dist/.. -O3 ../dist/../lock/lock_list.c
    libtool: compile: gcc -c -I. -I../dist/.. -O3 ../dist/../lock/lock_list.c -o lock_list.o
    ./libtool --mode=compile gcc -c -I. -I../dist/.. -O3 ../dist/../lock/lock_method.c
    libtool: compile: gcc -c -I. -I../dist/.. -O3 ../dist/../lock/lock_method.c -o lock_method.o
    ./libtool --mode=compile gcc -c -I. -I../dist/.. -O3 ../dist/../lock/lock_region.c
    libtool: compile: gcc -c -I. -I../dist/.. -O3 ../dist/../lock/lock_region.c -o lock_region.o
    ./libtool --mode=compile gcc -c -I. -I../dist/.. -O3 ../dist/../lock/lock_stat.c
    libtool: compile: gcc -c -I. -I../dist/.. -O3 ../dist/../lock/lock_stat.c -o lock_stat.o
    ./libtool --mode=compile gcc -c -I. -I../dist/.. -O3 ../dist/../lock/lock_timer.c
    libtool: compile: gcc -c -I. -I../dist/.. -O3 ../dist/../lock/lock_timer.c -o lock_timer.o
    ./libtool --mode=compile gcc -c -I. -I../dist/.. -O3 ../dist/../lock/lock_util.c
    libtool: compile: gcc -c -I. -I../dist/.. -O3 ../dist/../lock/lock_util.c -o lock_util.o
    ./libtool --mode=compile gcc -c -I. -I../dist/.. -O3 ../dist/../mutex/mut_alloc.c
    libtool: compile: gcc -c -I. -I../dist/.. -O3 ../dist/../mutex/mut_alloc.c -o mut_alloc.o
    ./libtool --mode=compile gcc -c -I. -I../dist/.. -O3 ../dist/../mutex/mut_failchk.c
    libtool: compile: gcc -c -I. -I../dist/.. -O3 ../dist/../mutex/mut_failchk.c -o mut_failchk.o
    ../dist/../mutex/mut_failchk.c: In function '__mut_failchk':
    ../dist/../mutex/mut_failchk.c:53: error: incompatible type for argument 3 of 'dbenv-is_alive'
    ../dist/../mutex/mut_failchk.c:53: note: expected 'db_threadid_t' but argument is of type 'int'
    ../dist/../mutex/mut_failchk.c:57: error: incompatible type for argument 3 of 'dbenv-thread_id_string'
    ../dist/../mutex/mut_failchk.c:57: note: expected 'db_threadid_t' but argument is of type 'int'
    make: *** [mut_failchk.o] Error 1
    sh-3.1$ make
    -----
    I have MSYS 1.0.11, mingw 5.1.6, GCC 4.4.0

    DB:2.45:Problem With Building Berkeleydb 4.8.24 With Mingw x1

    My guess is that the GCC 3.4.5 header files somewhere typedef `pthread_t` as `unsigned long int`.

    I am also trying to compile Berkeley DB 4.8.24 with MinGW gcc version 4.4.0, and I received the same error. Fortunately, though, I was able to proceed after changing line 113 of `db.h` in the `build_unix` folder from:
    typedef pthread_t db_threadid_t;
    to:
    typedef u_int32_t db_threadid_t;

  • RELEVANCY SCORE 2.43

    DB:2.43:How Can I Fix Internal Error 2753. Starteamaddin.Exe 1s


    Hi. I'm trying to install Borland CaliberRM 2008 SP1 Patch but I have this Error:

    I'm doing with Standard User and Elevate Privileges during the installation for the process.

    Thank's a lot.
    VICTOR MANUEL NIEBLES

    DB:2.43:How Can I Fix Internal Error 2753. Starteamaddin.Exe 1s

    Hola,
    Por polticas de la empresa el UAC est dehabilitado en todos los ordenadores.
    He hecho una chapuza, y es que he identificado los ficheros que me hacian falta, en total suman unos 50mb que no se instalan originalmente y los copie de una instalacin buena. Pero esto no es muy profesional. Quiero hacerlo como debe ser.
    He identificado tambien que cuando se lanza con usuario administrador, si ves los logs, hace uso del Framework 4.0 y cuando se lanza con el usuario standard usa el 2.0 No logro entender por qu se comporta as. Se te ocurre algo ?
    Saludos,VICTOR MANUEL NIEBLES

  • RELEVANCY SCORE 2.40

    DB:2.40:Ayuda Con El Error 2753 Agent.Exe zz


    Hola necesito ayuda tengo windows 7 professional
    con service pack1 y al querer instalar el programa
    smartsystems me marca el error 2753 "the file agent.exe is not marked for installation"
    porque me manda este error ¿cómo lo puedo solucionar?

    DB:2.40:Ayuda Con El Error 2753 Agent.Exe zz

    Hola necesito ayuda tengo windows 7 professional
    con service pack1 y al querer instalar el programa
    smartsystems me marca el error 2753 "the file agent.exe is not marked for installation"
    porque me manda este error ¿cómo lo puedo solucionar?

  • RELEVANCY SCORE 2.40

    DB:2.40:Problem To Install From Acrobat Aip Error 2753 Update.Api Return Code3 x7



    Hello,

    i have created an acrobat aip in the recommanded way 8.0.0-8.1.0-...8.1.6.

    During the client installation i get the error "internal error 2753. Updater.api." The last action in the log was:

    Aktion beendet um 09:46:56: UninstallALMAnchorService. Rckgabewert 1.Aktion gestartet um 09:46:56: AumUnregister.DEBUG: Error 2753: The File 'Updater.api' is not marked for installation.MSI (s) (44:18) [09:46:59:566]: Produkt: Adobe Acrobat 8 Standard - English, Franais, Deutsch -- Interner Fehler 2753. Updater.api

    Any ideas why...?

    DB:2.40:Problem To Install From Acrobat Aip Error 2753 Update.Api Return Code3 x7


    Hello,

    i have created an acrobat aip in the recommanded way 8.0.0-8.1.0-...8.1.6.

    During the client installation i get the error "internal error 2753. Updater.api." The last action in the log was:

    Aktion beendet um 09:46:56: UninstallALMAnchorService. Rckgabewert 1.Aktion gestartet um 09:46:56: AumUnregister.DEBUG: Error 2753: The File 'Updater.api' is not marked for installation.MSI (s) (44:18) [09:46:59:566]: Produkt: Adobe Acrobat 8 Standard - English, Franais, Deutsch -- Interner Fehler 2753. Updater.api

    Any ideas why...?

  • RELEVANCY SCORE 2.40

    DB:2.40:Install Error On Cit200 8c


    During install, I get Internal Error 2753, unins000.exe before the program fully installs ...

    Ideas? Thank you ...

    The phone works fine on one computer, I am just trying to install it on my desktop computer for home use ...

    Thank you in advance!

    DB:2.40:Install Error On Cit200 8c

    I have the latest driver ... and did disable the Norton ... STILL have the same problem ...

    Went into the registry and deleted the references to the CIT200 ... tried again and no luck ... other ideas?

    Thank you!

  • RELEVANCY SCORE 2.40

    DB:2.40:Error 2753 The File Rcappsvc.Exe Is Not Marked For Installation. 73


    error: 2753: the file 'rcappsvc.exe is not marked for installation'. when installing or removing a software (clear connection manager software), i get the above error message and unable to install the software or remove the previous version.

    Please advise

  • RELEVANCY SCORE 2.38

    DB:2.38:Internal Error For Java aj


    internal error 2753.regutilils.dll i cannot load java after it disappeared sorry new to this please help. My mum has cancer and this is how she spends her time playing on line pogo. can someone help me please thanks so much

    DB:2.38:Internal Error For Java aj


    Close all your web browsers

    Go go Start, Control Panel, Programs and Features (or Add/Remove Programs), scroll down to Java and Uninstall any entries you find

    Restart the computer and go to Internet Explorer.

    Go to www.java.com and install the latest version

  • RELEVANCY SCORE 2.38

    DB:2.38:Acrodist Error s3


    While trying to create a PDF in Acrobat 7, I am now getting this error msg

    AcroDist.exe

    The instruction at "0x0045c9e5" referenced memory at "0x0229ebdc". The memory could not be "read".

    I am using office 2003. I tried to uninstall and reinstall Acrobat and Microsoft office.

    Running Windows XP
    Thinkpad t60

    DB:2.38:Acrodist Error s3

    While trying to create a PDF in Acrobat 7, I am now getting this error msg

    AcroDist.exe

    The instruction at "0x0045c9e5" referenced memory at "0x0229ebdc". The memory could not be "read".

    I am using office 2003. I tried to uninstall and reinstall Acrobat and Microsoft office.

    Running Windows XP
    Thinkpad t60

  • RELEVANCY SCORE 2.38

    DB:2.38:Officejet F4280, Fatal Error 2753 On Install dj



    When installing the software I got the message "Fatal error 2753. Fatal error. msi.dot.4wrp.

    Help Please

    DB:2.38:Officejet F4280, Fatal Error 2753 On Install dj


    Hi smokie1201,

    Thank you for visiting the HP Support Forums. This is a user-to-user community, and not a venue to receive direct
    help or feedback from HP. If you need to contact HP directly HP about their products or services, please use the link below:http://welcome.hp.com/country/us/en/wwcontact_us.h​tmlIf you have any further questions or concerns, please feel free to send me a Private Message. Thanks!

  • RELEVANCY SCORE 2.38

    DB:2.38:Error Code 2753 After Windows 7 Installed dc


    installed windows 7 over vista, now computer will not shut off. it hangs on shutting down for a while and then reboots.What's up?

    DB:2.38:Error Code 2753 After Windows 7 Installed dc

    Hi,
    These links might help you with your issue.
    http://www.winvistaclub.com/t48.html
    http://windows7forums.com/windows-7-support/1812-pc-not-shutting-down-completely-fans-keep-blowing.html
    http://social.technet.microsoft.com/Forums/en/w7itproappcompat/thread/a039b660-6bfe-4a4e-b169-67fa7c2d6b8c
    -----

  • RELEVANCY SCORE 2.37

    DB:2.37:Error Code 2753 ka


    i installed virtualbox 316 and got the error code 2753. i found no information on the web site about installation error codes.

    DB:2.37:Error Code 2753 ka

    i installed virtualbox 316 and got the error code 2753. i found no information on the web site about installation error codes.

  • RELEVANCY SCORE 2.37

    DB:2.37:Java Is Already Install 8z


    hi group,

    I try to install the last version of java sun and this message appear :
    ******* Java is already install *************
    ******* Internal error 2753. RegUtils*******

    What I have done;
    - I tried to download the last version of 7Mo but it was just a little file of 373Ko who was transfer.
    - I have installed this file of 373Ko
    - I use RevoUninstaller to uninstall Java and clean all directory and register
    - I download the Java file of 15Mo
    - And I try to install it with the error message I just told ( I try to reboot)

    I use FF and IE

    How solve this.

    thank.

    DB:2.37:Java Is Already Install 8z

    group,

    I just uninstalled all Java version and after use the Microsoft tool msicuu2.exe for complete the uninstallation.

    And reinstall Java 6, but each time I use the verification of the install version on the java sun site, it ask for install the plugin.

    And it Firefox can't install the plugin by itself, I download it (xpiinstall.exe) and install it, and nothing change, if I retry to check the install version it ask again the plugin and looping...

    If somebody know what happening, let me know.

    thank.

  • RELEVANCY SCORE 2.37

    DB:2.37:How To Solve Internal Error 2753 8f


    how to solve internal error 2753

    DB:2.37:How To Solve Internal Error 2753 8f

    Hello,
    Due to the age of this issue, it would be best to create a new thread for this at the following forum:
    http://answers.microsoft.com/en-us/windows/forum/hardware
    Doing so will avoid any confusion between your issue and that of the original poster.
    Best regards,
    Matthew_Ha

  • RELEVANCY SCORE 2.37

    DB:2.37:Internal Error 2753 9j


    I recently purchased a Caddylite Golf GPS device. I loaded it and it worked. After a problem with my computer I went through a restore operation which required I reload all my applications etc. This I did except that when I try and reload the Caddylite device I get an error message Internal Error 2753.dpinst.exe1. Can anybody help me to resolve this problem. Cheers Colin

    DB:2.37:Internal Error 2753 9j

     
    Hello Colin,
    Thank you for your post!  I would suggest creating a new thread for your question in the (MSDN  Forums Home  Smart Device Development  Microsoft Device Emulator) forum located here:  (http://social.msdn.microsoft.com/forums/en-US/microsoftdeviceemu/threads/).
    Hope that would be helpful.
    Have a great day!
    Thanks regards,Ashawani
    Tier 2 Application Support
    Server and Tools Online Engineering Live Services Team

  • RELEVANCY SCORE 2.37

    DB:2.37:Cvi Install Error 2753 dc



    I have an installation error 2753. Indicating a problem with NIDNS NSPTool.exe.MDNSOI. I have done some searching but have not turned up a fix. I have installed CVI 2009 successfully and failed the install of NI Device Drivers Nov 2009. The install continued with out any further problems. I then retried the install and received the same error. I continued and installed NI DAQ 9.0.2. This completed successfully. Is this error critical ? What can I do to fix this ?

    DB:2.37:Cvi Install Error 2753 dc


    If you click on my name here in my post and go to my profile, there is a blue link labeled "Send this user a private message". In any case, I will send you one that you can reply to now.




    National InstrumentsProduct Support Engineer

  • RELEVANCY SCORE 2.36

    DB:2.36:Hadoop On Azure: Hive.Cmd Is Not Recognized As An Internal Or External Command sa


    Hello,
    Just meet this error on web hive console:
    'c:\apps\dist\hive-0.9.0\bin\hive.cmd' is not recognized as an internal or external command,
    operable program or batch file.

    Then when I login the desktop, see another error:
    'c:\apps\dist\hadoop-1.1.0-SNAPSHOT\bin\hadoop.cmd' is not recognized as an internal or external command,
    operable program or batch file.

    Hadoop on Azure v1.5 Western America
    Thanks,
    Bob

    DB:2.36:Hadoop On Azure: Hive.Cmd Is Not Recognized As An Internal Or External Command sa

    Can you check
    1)From Windows explorer if file exists?
    2) Please check if environment variable is set.
    3) If everything is fine then check services are running
    4) Check hadoop log (C:\apps\dist\hadoop-1.1.0-SNAPSHOT\logs) and event log if it shows some info

    Thanks and Regards,
    Sudhir Rawat

  • RELEVANCY SCORE 2.36

    DB:2.36:Internal Error 7z


    when I used to install srs wow sanbox it show me the internal error 2753 every times..please.help.me........

    DB:2.36:Internal Error 7z

    when I used to install srs wow sanbox it show me the internal error 2753 every times..please.help.me........

  • RELEVANCY SCORE 2.36

    DB:2.36:Internal Error 2753 3dmax Can't Be Uninstalled mm


    Hi everyone, I am new to the forum, so please advise me if I am doing anything wrong.Program: 3DS MAX 2009 32BIT, Windows XP SP2Recently, I moved my 3DMAX folder from my primary installation drive C: to my external harddrive, and it worked. However, it stopped working today, so I deleted the entire folder and attempted to reinstall the program, but the installation wizard shows that the program is still installed. I checked the Add/Remove Program in my Control Panel, and indeed, it still shows 3DS MAX 2009 as installed, along with libraries, plugins, movies, and bluerock. When I try to remove 3DS MAX 2009, an 'Internal Error 2753' appears, and the uninstallation fails. So I can't uninstall the program and I can't reinstall it either. I have tried repairing the program in Drive C:, but it only recovers the libraries, etc but not 3DMax.exe. I have also tried deleting everything except turbosquid and bluerock#40;which I can't find#41;, and reboot my computer, but neither of these has worked.Any ideas?ChinArchi-intern

    DB:2.36:Internal Error 2753 3dmax Can't Be Uninstalled mm

    Don't forget Google when you have a specific error number. This one appears to come from Windows. Here's one fix I found:http://www.ehow.com/how_5047270_fix-internal-error.html--Cy--

  • RELEVANCY SCORE 2.36

    DB:2.36:Error 2753. The File 'Erclient7.Exe' Is Not Marked For Installation. 7z



    I get the error "Error 2753. The File 'erclient7.exe' is not marked for installation" periodically when trying to upgrade end-users to 7.44. I can't figure out what's causing this. Anybody encounter this before?

    DB:2.36:Error 2753. The File 'Erclient7.Exe' Is Not Marked For Installation. 7z


    I get the error "Error 2753. The File 'erclient7.exe' is not marked for installation" periodically when trying to upgrade end-users to 7.44. I can't figure out what's causing this. Anybody encounter this before?

  • RELEVANCY SCORE 2.35

    DB:2.35:Hp Wireless Assistant Driver Exe Throwing Up Error Code 2753 73



    I recently installed Windows XP Home SP3 on my Compaq Pressario C783TU. When i tried to install the HP Wireless Assistant driver (sp36770.exe) it failed throwing up an error code 2753.

    Also i am unable to find a drivers for the 'Ethernet Controller' and 'Modem Device on High Definition Audio Bus'.

    Please suggest the solution.

    Thanks

    DB:2.35:Hp Wireless Assistant Driver Exe Throwing Up Error Code 2753 73


    as an aside,I also bought an hp printer when my compaq died, got a fatl error on install. Again, no answers from HP. Finally a tech said the HP4500 will NOT work on XP; gotta have win 7!!! But the box says it will work on XP. I am embarrased for HP and embarassed that I trusted the brandname.

  • RELEVANCY SCORE 2.35

    DB:2.35:Scanning 3055 Error 2753 Aec Ver 3 fm



    I've been having problem re installing the software for my laser jet 3055. I kept getting a fatal error 2753. I down loaded the AEC version 3 software but the scanner wont work correctly. will only scan 1 page and wont scan into PDF files.

    Please help.

    DB:2.35:Scanning 3055 Error 2753 Aec Ver 3 fm


    I've been having problem re installing the software for my laser jet 3055. I kept getting a fatal error 2753. I down loaded the AEC version 3 software but the scanner wont work correctly. will only scan 1 page and wont scan into PDF files.

    Please help.

  • RELEVANCY SCORE 2.35

    DB:2.35:Update Error Lr 2.5 To 2.6: Error 2753 The File "Pxsetup.Exe" Is Not Masked For Installation. cx


    Who can help me with this error 2753?
    I tried to install the upgrade from LR 2.5 to LR 2.6, but I get the error msg: The file "pxsetup.exe" is not masked for installation.

    DB:2.35:Update Error Lr 2.5 To 2.6: Error 2753 The File "Pxsetup.Exe" Is Not Masked For Installation. cx


    It looks like the Adobe developers may have re-introduced an old bug. See here.

    My guess is that the old solution will probably apply: uninstall LR 2.5 first.

    Also, you might want to search your system disk for that exe. There's one in the Lightroom 2.5 directory, but there may be one associated with MusicMatch (which might have come pre-installed on your computer or tagged along with some other piece of software). If you find it, getting rid of it can't hurt and probably would help.

    Hal

  • RELEVANCY SCORE 2.35

    DB:2.35:Error 1003 Occurred At Open Vi Reference In Dist Copy Non-Vi Files.Vi-Dist Build Llb Image.Vi-Dist Build App Image.Vi-Build Application.Vi k8


    When trying to build an application using labview 7.1 and windows XP, I get the error Error 1003 occurred at Open VI Reference in Dist Copy Non-VI Files.vi-Dist Build LLB Image.vi-Dist Build App Image.vi-Build Application.viI've tried the crtl-shift-run as well as a mass compile and I still get the error.Any ideas?Thanks,Mike

    DB:2.35:Error 1003 Occurred At Open Vi Reference In Dist Copy Non-Vi Files.Vi-Dist Build Llb Image.Vi-Dist Build App Image.Vi-Build Application.Vi k8

    Hopefully this thread, or this KB article might help.It seems like this could come from a lot of things, but there's suggestions in those which might lead you in the right direction
    Message Edited by Day on 09-22-2006 02:07 PM

  • RELEVANCY SCORE 2.35

    DB:2.35:Error 1500, 2753 And Wait While Another Program Is Installed Windows Installer Interferes With Other Programs mj


    original title:Windows Installer opens on start-up and blocks opening programs such as Office. Error messages include 1500, 2753 and "wait while another program is installed" (no program being installed)
    Upgraded from Vista 32 bit to Windows 7 Ultimate 32-bit. Windows Installer pop-up comes on at start up as if something is being installed. Pressing cancel only for it to come on repeatedly in excess of 10 times. Then, if I try to use a program like Office,
    the installer comes on and just runs, eventually an error message comes on saying that another program is being installed and to wait. The program does not open. With other programs like Skype, installer goes through several steps as if it is installing it
    for the first time. At the same time another window pops up acting like it is trying to install something else but says, "the feature you are trying to use is on a network resource that is unavailable...enter an alternate path to a folder containing the installation
    package 'status.msi' in the box below (this is just an example because the package can be anything). Adobe Reader ran the installer and got an internal error 2753. I have tried to uninstall Reader (and other programs) but the installer gives the same error
    2753 updater api_NON_OPT. in another case, I get a 2753 error with the file reggoogleplugin.exe is not for installation.

    DB:2.35:Error 1500, 2753 And Wait While Another Program Is Installed Windows Installer Interferes With Other Programs mj

    I am having the same problems with Windows 7 not having windows installer, also it will not keep my I Tunes loaded, nor do I have the ability to record video. I thought I had it bad with Vista. Give me XP any day of the week.

  • RELEVANCY SCORE 2.35

    DB:2.35: Tempro Is Not Working For Vista Ultimate X64 93


    Hi

    I have a Qosmio F50-10K and I installed Vista ultimate x64 and the Tempro appliaction is not working. After I install it, I left the Start Tempro button checked and when I press finish it gives me this error:

    "internal error 2753

    Toshiba.ui.controlpanelapplication.exe"

    Same thing happens when I uncheck the box with start tempro.

    For both situations nothing is left in the system, no files, no regstry, nothing.

    Please HELP

    Thank you

    DB:2.35: Tempro Is Not Working For Vista Ultimate X64 93

    Thank you very musch for your help!

    I will wait for the x64 version.

  • RELEVANCY SCORE 2.35

    DB:2.35:Error 7 Occurred At Copy In Abapi Dist New Vi Library.Vi-Abapi Dist Chk For Destinations.Vi-Abapi Copy Files And Apply Settings.Vi-Ebep_Invoke_Build_Engine.Vi-Ebuip_Build_Invoke.Vi-Ebuip_Build_Invoke.Vi.Proxycaller df


    When I try to build executables in LabView 8.01 I getmessage:
    Error 7 occurred at Copy in ABAPI Dist New VI Library.vi-ABAPI Dist Chk for Destinations.vi-ABAPI Copy Files and Apply Settings.vi-EBEP_Invoke_Build_Engine.vi-EBUIP_Build_Invoke.vi-EBUIP_Build_Invoke.vi.ProxyCaller



    Best Regards

  • RELEVANCY SCORE 2.35

    DB:2.35:Adobe Reader Xi (11.0.07) Error 2753. The File 'Acrosup64.Dll' Is Not Marked For Installation. sx



    I am getting Adobe Reader XI (11.0.07) Error 2753. The File 'acrosup64.dll' is not marked for installation when deploying from msi package. .

    Need help to resolve the issue

    DB:2.35:Adobe Reader Xi (11.0.07) Error 2753. The File 'Acrosup64.Dll' Is Not Marked For Installation. sx


    Hi, guys.

    I've got same issue asdingusmagii

    Here is my dump

    Waiting for solution.

    Regards,

    Andrii

  • RELEVANCY SCORE 2.34

    DB:2.34:What Is Error 2753 xx


    when installing Clearwire connection manager error 2753 says that the file 'rcappsvs.exe' is not marked for installtion. what is this?

    DB:2.34:What Is Error 2753 xx

    That's a program contained within the Clearwire product. Speak with the people from whom you obtained the Clearwire package.

    Brian Tillman [MVP-Outlook]
    --------------------------------
    https://mvp.support.microsoft.com/profile/Brian.Tillman
    If a reply helps, please vote it as helpful. If a reply solves the issue, please mark it as an answer.

  • RELEVANCY SCORE 2.34

    DB:2.34:Sprint Smartview Error 2753 jd


    i cannot not uninstall the program it keeps coming up as..... Error 2753. the file "DriverInstaller.exe.EB637675_771D_405E_9F68_F0C56BD98694" is not marked for installation. How can i fix this? And thank you.

    DB:2.34:Sprint Smartview Error 2753 jd

    How does this involve Windows Update, Joey?
    Post here instead:
    http://community.sprint.com/baw/community/buzzaboutwireless/phones-and-devices/mobile-broadband

  • RELEVANCY SCORE 2.34

    DB:2.34:How Can I Uninstall Acrobat 7.1.0 Professional 9j


    I can not uninstall Acrobat, it always pop a window "internal error 2753 .uninstmanager.dll " ,But i can not reinstall it also.
    Can anybody tell me how to uninstall acrobat completely?
    Thanks!

    DB:2.34:How Can I Uninstall Acrobat 7.1.0 Professional 9j

    Download the utility http://support.microsoft.com/kb/290301

  • RELEVANCY SCORE 2.34

    DB:2.34:Fatal Error 2753 1c



    I am not able to install the HP F2200 printer with the fatal error of 2753

    DB:2.34:Fatal Error 2753 1c


    I am not able to install the HP F2200 printer with the fatal error of 2753

  • RELEVANCY SCORE 2.33

    DB:2.33:I Have Deleted Java And Tried To Reinstall And It Comes Back An Error Internal Error 2753 Regutils.Dll And Then Wants To Install Again And Come Back With The Same Error mk


    original title:java issue

    i have deleted java and tried to reinstall and it comes back an error "internal error 2753 regutils.dll" and then wants to install again and come back with the same error need help with this

    DB:2.33:I Have Deleted Java And Tried To Reinstall And It Comes Back An Error Internal Error 2753 Regutils.Dll And Then Wants To Install Again And Come Back With The Same Error mk

    This thread was originally created in the System Repair and Recovery forum.
    The Microsoft Answers Moderation team has moved it to the
    Programs forum. Thanks.

  • RELEVANCY SCORE 2.33

    DB:2.33:Erro Interno 2753 7a


    Ola bom dia.

    Preciso de ajuda.

    Tenho instalado no meu notebook um pacote do Nokia (N95), dentro dele tem um programa chamado Nokia Ovi Suite, sempre funcionou aqui, só que de uns meses pra cá, qdo vou reinicar a maquina, demora demais, e ele fica perguntando se quero atualizar o programa,
    clico em sim e não atualiza. Tento desinstalar o programa pelo painel de controle e também não é permitido. Tentei reinstalar pelo CD e pelo site e não consigo de forma alguma.Liguei na nokia tentamos fazer a atualização e não conseguirmos, eles informaram
    que o problema é no computador....
    Pesquisei na internet e descobri ( e nao sei se é real, pois sou absolutamente leiga no assunto) que poderia ser problema do windows installer... Lembrei que algumas vezes da um erro nele e abre rapidamente e fecha a tela do DOS, mas não me recordo que erro
    possa ser este...
    Vcs teriam como me ajudar? Tenho windows 7, 64 Bit, processador intel core 2 duo, dELL INSPIRON, T6600, 4 giga de memoria e hd de 320. Segue abaixo o erro dele.
    Obrigada.

    Internal Error 2753
    msoutlookaPIproxi64.exe
    F0E456FF_6A2A_4EF9_A006_10CA5DC7EA4F

    DB:2.33:Erro Interno 2753 7a

    Olá,

    Minha primeira sugestão é que tente iniciar o Windows em modo de segurança, onde apenas o essencial para o carregamento do sistema será utilizado. Vejamos se neste modo de diagnóstico, o problema não ocorre.

    Para iniciar o Windows em modo de segurança, pressione F8 repetidamente durante a inicialização do computador (antes de iniciar o Windows) e na tela de opções de inicialização escolha modo de segurança.

    Se no modo de segurança o problema não ocorrer, ótimo, já sabemos que tem algo (programa/serviço/driver) que está carregando junto com o Windows e está causando este comportamento. Neste caso, sugiro que efetue procedimento de inicialização limpa do
    Windows e veja se assim o problema é solucionado.

    Se no modo de segurança o problema também ocorreu, sugiro que pule a etapa de inicialização limpa, descrita logo abaixo.

    1. Feche todos os programas que estejam em execução.
    2. Clique em Iniciar, logo após clique em Todos os Programas, depois clique em Acessórios, após clique em Executar e por fim digite MSCONFIG e clique em OK.
    3. Na caixa de diálogo 'Utilitários de Configuração do Sistema', na guia Geral, habilite a opção 'Inicialização Seletiva' e desabilite a opção "carregar itens de inicialização".
    4. Clique na guia "Serviços".
    5. Habilite a opção "Ocultar todos os serviços Microsoft" e desabilite os serviços restantes.
    6. Clique em Aplicar e OK e SIM quando perguntado se deseja Reiniciar o Windows.
    7. Após reiniciar, verifique se o erro persiste.

    OBS: Este procedimento desabilita todos serviços e programas de terceiros, bem como logon por fingerprint, antivírus dentre outros. Você pode posteriormente, se o problema for solucionado desta forma, habilitar os
    programas e serviços que serão inicializados com o Windows, seletivamente, ao invés de manter todos desativados. Efetue este procedimento para não ficar sem proteção antivírus por exemplo. Se o problema voltar após ativação da inicialização de um serviço ou
    programa em especifico, o problema está exatamente na inicialização deste software e é recomendável removê-lo.

    Se a inicialização limpaou o modo seguro não funcionaram então é possível que alguma configuração que desconheço tenha causado este comportamento que descreveu. Neste caso minha sugestão é que crie novo usuário do Windows e verifique se desta
    forma consegue com sucesso solucionar este problema.

    Para criar novo usuário do Windows, por gentileza, utilize as instruções da documentação presente no link abaixo.

    http://windows.microsoft.com/pt-BR/windows7/Create-a-user-account

    Sugestão: Crie nova conta de usuário com privilégios administrativos.

    Espero ter ajudado.

    Qualquer dúvida, poste novamente!!!

  • RELEVANCY SCORE 2.33

    DB:2.33:Internal Error 2753. K_Coinst.Exe mc


    hi
    a few days ago i clean installed Windows 7, and yesterday i wanted to install the driver for my KORG synthesizer, so that i can work with it on my computer.
    So i installed the application that would install my instrument's driver as soon as i would connect it to the pc.
    the installation finished with no problems.
    so, i connected the synthesizer to the pc via USB, and the icon that shows that new hardware is connected appeared.

    at this point i noticed ,in the bubble message, that it was searching the driver via Windows Update, rather than KORG's application that i had installed earlier.
    after that i tried to update the firmware of the synthesizer.
    however i got an error message saying that the driver installed on my system was not installed from the KORG USB MIDI DRIVER ( the driver application from KORG).

    after that i tried to uninstall the application stated above, but i get the error message
    Internal Error 3753. k_coinst.exe.
    now i cannot use the instrument on the pc and i'm stuck with this app.
    any help would be greatly appreciated (sorry for the long message, but i tried to be as descriptive as possible)
    thanks

    DB:2.33:Internal Error 2753. K_Coinst.Exe mc

    xigncy1- your answer was so helpful! You rock! I've got a show tomorrow, and without your help, i'd be screwed!!!!

  • RELEVANCY SCORE 2.33

    DB:2.33:Install Fails With Internal Error 2753 Regutils.Dll 1x


    I've been beating my head against this wall for two full days now. I tried installing update JRE 24 and it fails every time with "Internal Error 2753. regutils.dll." I've gone through various forums and tried a variety of tactics. I first uninstalled the older version I had. That didn't work. I then went through the registry and deleted tons of Java references based on a search for the path to Java's bin folder. I deleted c:\program files (x86)\java. that didn't work.

    I followed the tips from this thread: Internal Error 2753. RegUtils to remove the two JavaSoft registry entries. That didn't work. I followed their Orca tips to remove the NewConsumerVersionInstalled entry. That didn't work either.

    I'm running Win 7 Pro x64. I have searched c:\program files (x86)\ for RegUtils.dll and find it in two folders:
    C:\Program Files (x86)\Adobe\Acrobat 9.0\Designer 8.2\jre\bin
    C:\Program Files (x86)\Adobe\Adobe Flash CS3\JVM\bin

    What can I do to get this thing installed? Or do I just give up on running JRE-based websites and applications (including Oracle SQL Developer which died during all my uninstall steps) forever?

    HELP!

    DB:2.33:Install Fails With Internal Error 2753 Regutils.Dll 1x

    This thread was posted more than 18 months ago.
    It was the only thread by the original poster. (Go glance in their profile.)
    It seems to have been abandoned by them, so there is little chance of them responding.

    This resurrected thread is now locked, to that it can return to its slumber.

  • RELEVANCY SCORE 2.32

    DB:2.32:Error 2753.Setup.Exe af


    I am trying to install some software on my PC running Windows XP Pro with service pack 3.
    Half way through the install I get "Internal error 2753.setup.exe"
    Any suggestions on how to fix this issue?

    DB:2.32:Error 2753.Setup.Exe af

    Does the error occur when installing any/all software or just one particular software? What software are you trying to install?

  • RELEVANCY SCORE 2.32

    DB:2.32:I Cant Install Java. I Keep Getting Error Code 2502 And 2503. 3j


    I am running vista and am on a home network. After uninstalling java, I keep geeting internal error codes 2502 and 2503 when trying to reinstall java.. Now I am getting internal error code 2753 regutls.dll also.

  • RELEVANCY SCORE 2.32

    DB:2.32:Getting 2753 Error Reinstalling Vse 8.0i xd


    VSE 8.0i was getting an error on automatic updating, so I decided to uninstall and then reinstall it. Now, I get error 2753 trying to reinstall it. I have been in the registry and deleted some keys, but I still get the error. I'd appreciate any help you can give me. Thanks.

  • RELEVANCY SCORE 2.31

    DB:2.31:Cupc Install Trouble - Error 2753 x1



    When attempting to insall CUPC on my laptop, I get the following error dialog:

    "Error 2753. The File 'cupck9.exe' is not marked for installation."

    I have tried a couple different versions of the client and end up with the same result. Any ideas?

    DB:2.31:Cupc Install Trouble - Error 2753 x1


    Hello,

    Did you get any where with resolving this?

    Rgrds.

  • RELEVANCY SCORE 2.31

    DB:2.31:2753 Error d8


    Hi,

    Am trying to install a joypad, after the installation has run I get "Internal Error 2753.JoytechNeoSTrayIcon.exe" displayed.

    Any tips on how to resolve this/

    Many thanks

    DB:2.31:2753 Error d8

    Went to the manufacturers site and have additional downloads, haven't had a chance to try them yet!

    thanks for your reply.

  • RELEVANCY SCORE 2.31

    DB:2.31:Error 2753 - The File Is Not Marked For Instalation 9s


    Hello,

    DB:2.31:Error 2753 - The File Is Not Marked For Instalation 9s

    What Fix It did you try?
    What program are you trying to install?
    Is it just the one program that this is happening to?

    You can try (re)installing the latest Windows Installer version WindowsXP-KB942288-v3-x86.exe from here:

    http://www.microsoft.com/download/en/details.aspx?id=8483
    Be aware that you must have SP2 or SP3 installed.

    Let us know if the same problem occurs while attempting to install that.

  • RELEVANCY SCORE 2.31

    DB:2.31:Internal Error 2753 Vista ca


    I am running Vista and trying to install Dragon 11.5 software - Dragon 10 is currently installed. When I try to install the software I get the following error message internal error 2753.natspeak.exe. I did some research and found a solution that
    involved going to regsvr32 vbscript.ddl which I did several times - it did not fix the problem - any suggestions?

    DB:2.31:Internal Error 2753 Vista ca

    Hi kitty1993,

    1. Did you get the message that vbscript.dll was registered successfully after running the command?
    2. Did you make any changes to the computer prior to the issue occur?
    3. Are you able to install other applications?

    Method 1
    Looks like the application might have installed partially. I would suggest you to perform clean boot and install the program.

    How to troubleshoot a problem by performing a clean boot in Windows Vista or in Windows 7
    http://support.microsoft.com/kb/929135

    Note: Follow step 7 from the clean boot article KB929135 to put the computer back to normal mode.

    Method 2
    If the above steps fail, then try to uninstall and re-install the program.

    Uninstall or change a program
    http://windows.microsoft.com/en-US/windows-vista/Uninstall-or-change-a-program

  • RELEVANCY SCORE 2.31

    DB:2.31:[Resolved]Internal Error Code 2753 After Installation Proceeds c9



    Greetings:When I try to finish installing my Bitdefender Anti-Virus Pro 2011, I get the following error message:The installer has encountered an unexpected error installing this package.This may indicate a problem with this package. The error code is 2753.I do not know how to fix this, and I tried the following article too:http://www.ehow.com/how_5047270_fix-internal-error.htmlAfter searching on Google, there are no good answers. Does anyone know of something else that has worked for you to fix this issue? I attached a picture of the screen. ThanksAdam Dastmalchi


    Attached File(s)


    installationpackageerror.JPG ( 61.07K )
    Number of downloads: 3

    DB:2.31:[Resolved]Internal Error Code 2753 After Installation Proceeds c9


    Glad to see the issue is now resolved. Feel free to contact us anytimeCase resolved, topic closed.Best regards,